<svg width="906" height="451" viewBox="0 0 906 451" fill="none" xmlns="http://www.w3.org/2000/svg">
<path d="M18.2677 451C13.5612 451 9.49074 449.309 6.05628 445.927C2.68543 442.481 1 438.398 1 433.676C1 428.826 2.68543 424.71 6.05628 421.329C9.49074 417.883 13.5612 416.16 18.2677 416.16C23.1014 416.16 27.2036 417.883 30.5745 421.329C33.9453 424.71 35.6308 428.826 35.6308 433.676C35.6308 438.398 33.9453 442.481 30.5745 445.927C27.2036 449.309 23.1014 451 18.2677 451Z" fill="#2A2C2E"/>
<path d="M90.3361 451C82.7676 451 76.1849 449.15 70.588 445.449C64.9911 441.684 60.6344 436.675 57.518 430.421C54.4651 424.104 52.9387 417.117 52.9387 409.46C52.9387 401.803 54.4651 394.848 57.518 388.594C60.6344 382.277 64.9911 377.236 70.588 373.471C76.1849 369.707 82.7676 367.824 90.3361 367.824C95.3606 367.824 99.8127 368.622 103.692 370.217C107.572 371.749 110.72 373.599 113.137 375.769C115.554 377.874 117.017 379.82 117.526 381.607V317H146.528V448.703H117.812V435.973C116.603 438.334 114.632 440.695 111.897 443.056C109.162 445.353 105.95 447.235 102.261 448.703C98.5724 450.234 94.5974 451 90.3361 451ZM99.2084 428.124C102.707 428.124 105.823 427.327 108.558 425.731C111.356 424.136 113.55 421.935 115.141 419.127C116.731 416.256 117.526 413.033 117.526 409.46C117.526 405.887 116.731 402.696 115.141 399.889C113.55 397.017 111.356 394.784 108.558 393.189C105.823 391.53 102.707 390.7 99.2084 390.7C95.8376 390.7 92.7847 391.53 90.0499 393.189C87.3787 394.784 85.248 397.017 83.658 399.889C82.1316 402.696 81.3683 405.887 81.3683 409.46C81.3683 413.033 82.1316 416.256 83.658 419.127C85.248 421.935 87.3787 424.136 90.0499 425.731C92.7847 427.327 95.8376 428.124 99.2084 428.124Z" fill="#2A2C2E"/>
<path d="M186.423 415.586C186.614 418.393 187.505 420.882 189.095 423.051C190.685 425.221 192.879 426.944 195.677 428.22C198.539 429.432 201.91 430.039 205.79 430.039C209.479 430.039 212.786 429.656 215.712 428.89C218.701 428.124 221.277 427.167 223.439 426.019C225.665 424.87 227.382 423.69 228.591 422.477L239.848 440.471C238.258 442.194 236 443.885 233.075 445.544C230.213 447.14 226.428 448.448 221.722 449.469C217.015 450.49 211.069 451 203.882 451C195.232 451 187.536 449.373 180.795 446.119C174.053 442.864 168.742 438.079 164.863 431.761C160.983 425.444 159.043 417.723 159.043 408.599C159.043 400.941 160.697 394.05 164.004 387.924C167.375 381.735 172.24 376.853 178.6 373.28C184.961 369.643 192.624 367.824 201.592 367.824C210.115 367.824 217.492 369.388 223.725 372.514C230.022 375.641 234.856 380.299 238.226 386.489C241.661 392.614 243.378 400.271 243.378 409.46C243.378 409.97 243.346 410.991 243.283 412.523C243.283 414.054 243.219 415.075 243.092 415.586H186.423ZM216.093 400.367C216.03 398.325 215.489 396.315 214.471 394.337C213.454 392.295 211.927 390.636 209.892 389.36C207.857 388.02 205.249 387.35 202.069 387.35C198.889 387.35 196.186 387.988 193.96 389.264C191.798 390.477 190.144 392.072 188.999 394.05C187.854 396.028 187.218 398.134 187.091 400.367H216.093Z" fill="#2A2C2E"/>
<path d="M251.305 370.121H282.311L301.2 422.286L320.185 370.121H351L318.182 448.703H284.219L251.305 370.121Z" fill="#2A2C2E"/>
<path fill-rule="evenodd" clip-rule="evenodd" d="M889.476 9.62517C879.478 -1.6272 816.129 -2.42391 844.648 56.1554C867.346 87.9321 916.146 40.8345 889.476 9.62517Z" fill="#63EBC4"/>
<path fill-rule="evenodd" clip-rule="evenodd" d="M864.086 111.07C859.546 114.247 848.197 114.12 841.672 118.695C835.146 123.271 836.281 137.188 834.295 141.764C832.309 146.339 832.025 212.112 831.741 216.878C831.458 221.644 829.948 266.15 832.842 271.48C835.203 277.078 836.973 278.242 847.062 280.554C859.546 283.223 891.062 285.142 893.331 281.71C895.601 278.278 898.858 267.314 900.118 251.194C903.239 236.324 901.207 203.056 901.82 184.468C902.32 169.532 905.599 151.458 903.806 139.666C902.683 133.318 904.544 125.782 893.706 115.909C889.359 111.39 879.974 107.829 874.583 107.638C869.192 107.447 866.787 109.183 864.086 111.07Z" fill="#63EBC4"/>
<path fill-rule="evenodd" clip-rule="evenodd" d="M695.029 163.827C685.051 148.884 654.363 89.7277 642.541 71.6173C638.038 64.7183 632.185 52.0405 625.234 49.487C618.283 46.9335 606.225 52.5603 600.834 56.2963C596.037 59.6204 594.704 66.3525 592.89 71.901C590.526 79.1359 587.901 85.9145 586.648 99.7056C585.741 109.693 583.182 120.267 582.109 130.631C581.021 141.129 579.993 151.985 580.123 162.692C580.264 174.372 582.014 188.368 582.96 200.71C583.88 212.723 584.52 226.86 585.797 236.743C586.812 244.597 587.078 252.924 590.62 260.008C594.356 267.479 601.402 279.301 608.211 281.571C615.02 283.84 628.071 287.813 641.406 284.408C650.507 282.085 652.471 282.989 653.606 265.966C654.573 251.472 649.776 208.181 651.053 204.682C651.677 202.973 655.025 199.008 656.443 203.831C657.321 206.813 662.62 223.76 668.766 239.496C672.561 249.216 676.679 258.476 680.276 263.696C687.943 274.825 695.77 285.585 738.438 284.975C758.294 284.692 755.862 279.465 758.011 271.924C769.132 233.007 803.202 57.505 805.108 51.4731C806.822 46.0642 807.855 32.9416 790.638 17.7103C778.507 6.96748 767.09 0.119591 753.759 1.25447C744.397 2.05116 732.325 7.90149 729.359 17.1428C720.8 43.8126 708.128 136.825 702.406 161.273C701.814 163.806 696.474 165.991 695.029 163.827Z" fill="#63EBC4"/>
<path fill-rule="evenodd" clip-rule="evenodd" d="M343.788 129.6C342.455 120.546 339.645 109.176 338.269 102.707C333.793 81.6482 334.335 62.3915 313.524 57.7237C271.681 48.3394 256.61 89.0511 263.59 119.386C283.262 204.881 301.19 207.916 305.675 242.048C309.08 267.961 328.278 287.727 345.301 286.214C355.603 285.298 366.907 280.263 379.992 269.967C388.529 263.25 386.472 251.149 401.289 249.519C424.706 246.943 427.486 254.626 442.523 269.191C462.477 282.336 489.81 287.727 507.968 268.434C526.126 249.141 560.686 104.853 558.658 77.3958C557.679 64.1268 565.827 26.9877 508.119 21.1805C472.03 17.5489 477.715 64.4184 476.569 93.2842C475.448 121.525 477.704 176.887 465.22 184.075C452.737 191.262 426.85 136.44 410.179 118.062C405.366 112.756 385.968 114.847 381.429 122.034C376.889 129.221 366.864 181.426 358.542 181.426C350.22 181.426 349.025 168.808 346.909 161.377C344.45 152.74 345.228 139.379 343.788 129.6Z" fill="#63EBC4"/>
<path fill-rule="evenodd" clip-rule="evenodd" d="M94.5993 16.9637C72.8936 24.1055 46.8753 46.6874 37.2708 57.4223C27.6652 68.1571 -0.907691 112.336 1.25426 144.544C3.38556 176.323 32.1173 230.314 41.1566 247.263C50.196 264.214 136.123 306.416 177.932 264.607C219.741 222.798 256.255 178.295 250.227 121.247C248.349 103.479 219.47 18.5582 171.718 14.316C116.693 9.42804 116.63 9.71631 94.5993 16.9637ZM155.256 79.0157C138.044 75.6746 88.1725 96.9843 81.8671 119.871C75.5628 142.759 63.8043 184.749 113.739 211.23C187.79 227.496 183.376 157.701 189.681 134.815C195.686 113.012 172.469 82.3568 155.256 79.0157Z" fill="#63EBC4"/>
</svg>
