INFO: Statistics on 19 Trucks
* Maximal length: 17.874622344970703m
* Minimal length: 7.661712169647217m
* Average length: 12.077564816725882m
INFO: Statistics on 20 Trucks
* Maximal length: 17.874622344970703m
* Minimal length: 7.661712169647217m
* Average length: 12.27363088130951m