ALERT: Pedestrian(s) [403, 419, 443] is/are on the road
ALERT: Pedestrian(s) [403, 419, 443] is/are on the road
ALERT: Pedestrian(s) [403, 419, 443] is/are on the road
ALERT: Pedestrian(s) [403, 443] is/are on the road
ALERT: Pedestrian(s) [403, 443] is/are on the road
ALERT: Pedestrian(s) [403, 443] is/are on the road
ALERT: Pedestrian(s) [403, 443] is/are on the road
ALERT: Pedestrian(s) [403] is/are on the road
