{
  "Version": "2012-10-17",
   "Statement": [
       {"Effect": "Allow",
        "Action": [
           "aps:RemoteWrite", 
           "aps:GetSeries", 
           "aps:GetLabels",
           "aps:GetMetricMetadata"
        ], 
        "Resource": "*"
      }
   ]
}