<?xml version="1.0" encoding="UTF-8"?>
<!DOCTYPE svg PUBLIC '-//W3C//DTD SVG 1.0//EN'
          'http://www.w3.org/TR/2001/REC-SVG-20010904/DTD/svg10.dtd'>
<svg fill-opacity="0" xmlns:xlink="http://www.w3.org/1999/xlink" color-rendering="auto" color-interpolation="auto" text-rendering="auto" stroke="rgb(0,0,0)" stroke-linecap="square" width="1177" stroke-miterlimit="10" shape-rendering="auto" stroke-opacity="0" fill="rgb(0,0,0)" stroke-dasharray="none" font-weight="normal" stroke-width="1" height="288" xmlns="http://www.w3.org/2000/svg" font-family="'Dialog'" font-style="normal" stroke-linejoin="miter" font-size="12px" stroke-dashoffset="0" image-rendering="auto"
><!--Generated by the Batik Graphics2D SVG Generator--><defs id="genericDefs"
  /><g
  ><defs id="defs1"
    ><clipPath clipPathUnits="userSpaceOnUse" id="clipPath1"
      ><path d="M-7 -7 L108 -7 L108 51 L-7 51 L-7 -7 Z"
      /></clipPath
      ><clipPath clipPathUnits="userSpaceOnUse" id="clipPath2"
      ><path d="M0 0 L0 12 L97 12 L97 0 Z"
      /></clipPath
      ><clipPath clipPathUnits="userSpaceOnUse" id="clipPath3"
      ><path d="M0 0 L0 28 L97 28 L97 0 Z"
      /></clipPath
      ><clipPath clipPathUnits="userSpaceOnUse" id="clipPath4"
      ><path d="M0 0 L0 26 L97 26 L97 0 Z"
      /></clipPath
      ><clipPath clipPathUnits="userSpaceOnUse" id="clipPath5"
      ><path d="M0 0 L0 14 L97 14 L97 0 Z"
      /></clipPath
      ><clipPath clipPathUnits="userSpaceOnUse" id="clipPath6"
      ><path d="M0 0 L452 0 L452 183 L0 183 L0 0 Z"
      /></clipPath
      ><clipPath clipPathUnits="userSpaceOnUse" id="clipPath7"
      ><path d="M0 0 L0 183 L452 183 L452 0 Z"
      /></clipPath
      ><clipPath clipPathUnits="userSpaceOnUse" id="clipPath8"
      ><path d="M0 0 L390 0 L390 183 L0 183 L0 0 Z"
      /></clipPath
      ><clipPath clipPathUnits="userSpaceOnUse" id="clipPath9"
      ><path d="M0 0 L0 183 L390 183 L390 0 Z"
      /></clipPath
      ><clipPath clipPathUnits="userSpaceOnUse" id="clipPath10"
      ><path d="M0 0 L356 0 L356 182 L0 182 L0 0 Z"
      /></clipPath
      ><clipPath clipPathUnits="userSpaceOnUse" id="clipPath11"
      ><path d="M0 0 L0 182 L356 182 L356 0 Z"
      /></clipPath
      ><clipPath clipPathUnits="userSpaceOnUse" id="clipPath12"
      ><path d="M0 0 L230 0 L230 182 L0 182 L0 0 Z"
      /></clipPath
      ><clipPath clipPathUnits="userSpaceOnUse" id="clipPath13"
      ><path d="M0 0 L0 182 L230 182 L230 0 Z"
      /></clipPath
      ><clipPath clipPathUnits="userSpaceOnUse" id="clipPath14"
      ><path d="M0 0 L355 0 L355 182 L0 182 L0 0 Z"
      /></clipPath
      ><clipPath clipPathUnits="userSpaceOnUse" id="clipPath15"
      ><path d="M0 0 L0 182 L355 182 L355 0 Z"
      /></clipPath
      ><clipPath clipPathUnits="userSpaceOnUse" id="clipPath16"
      ><path d="M0 0 L229 0 L229 182 L0 182 L0 0 Z"
      /></clipPath
      ><clipPath clipPathUnits="userSpaceOnUse" id="clipPath17"
      ><path d="M0 0 L0 182 L229 182 L229 0 Z"
      /></clipPath
      ><clipPath clipPathUnits="userSpaceOnUse" id="clipPath18"
      ><path d="M0 0 L104 0 L104 182 L0 182 L0 0 Z"
      /></clipPath
      ><clipPath clipPathUnits="userSpaceOnUse" id="clipPath19"
      ><path d="M0 0 L0 182 L104 182 L104 0 Z"
      /></clipPath
      ><clipPath clipPathUnits="userSpaceOnUse" id="clipPath20"
      ><path d="M0 0 L293 0 L293 185 L0 185 L0 0 Z"
      /></clipPath
      ><clipPath clipPathUnits="userSpaceOnUse" id="clipPath21"
      ><path d="M0 0 L0 185 L293 185 L293 0 Z"
      /></clipPath
      ><clipPath clipPathUnits="userSpaceOnUse" id="clipPath22"
      ><path d="M0 0 L167 0 L167 185 L0 185 L0 0 Z"
      /></clipPath
      ><clipPath clipPathUnits="userSpaceOnUse" id="clipPath23"
      ><path d="M0 0 L0 185 L167 185 L167 0 Z"
      /></clipPath
      ><clipPath clipPathUnits="userSpaceOnUse" id="clipPath24"
      ><path d="M0 0 L166 0 L166 185 L0 185 L0 0 Z"
      /></clipPath
      ><clipPath clipPathUnits="userSpaceOnUse" id="clipPath25"
      ><path d="M0 0 L0 185 L166 185 L166 0 Z"
      /></clipPath
      ><clipPath clipPathUnits="userSpaceOnUse" id="clipPath26"
      ><path d="M0 0 L292 0 L292 185 L0 185 L0 0 Z"
      /></clipPath
      ><clipPath clipPathUnits="userSpaceOnUse" id="clipPath27"
      ><path d="M0 0 L0 185 L292 185 L292 0 Z"
      /></clipPath
    ></defs
    ><g fill="white" text-rendering="geometricPrecision" fill-opacity="1" stroke-opacity="1" stroke="white"
    ><rect x="0" width="1177" height="288" y="0" stroke="none"
    /></g
    ><g font-size="11px" transform="translate(601,0)" fill-opacity="1" fill="rgb(122,207,245)" text-rendering="geometricPrecision" image-rendering="optimizeQuality" font-family="sans-serif" stroke="rgb(122,207,245)" font-weight="bold" stroke-opacity="1"
    ><rect x="0" width="97" height="40" y="0" clip-path="url(#clipPath1)" stroke="none"
    /></g
    ><g fill-opacity="1" text-rendering="geometricPrecision" stroke="black" stroke-linecap="butt" transform="translate(601,0)" stroke-miterlimit="0" stroke-opacity="1" fill="black" font-weight="bold" font-family="sans-serif" stroke-linejoin="round" font-size="11px" image-rendering="optimizeQuality"
    ><rect fill="none" x="0" width="97" height="40" y="0" clip-path="url(#clipPath1)"
      /><line y2="28" fill="none" x1="0" clip-path="url(#clipPath1)" x2="97" y1="28"
    /></g
    ><g font-size="11px" transform="translate(601,0)" fill-opacity="1" fill="black" text-rendering="geometricPrecision" image-rendering="optimizeQuality" font-family="sans-serif" stroke="black" stroke-opacity="1"
    ><text x="4" xml:space="preserve" y="11" clip-path="url(#clipPath3)" stroke="none"
      >&lt;&lt;Interface&gt;&gt;</text
      ><text x="10" xml:space="preserve" y="25" clip-path="url(#clipPath3)" font-weight="bold" stroke="none"
      >JComponent</text
    ></g
    ><g font-size="11px" transform="translate(824,244)" fill-opacity="1" fill="rgb(122,207,245)" text-rendering="geometricPrecision" image-rendering="optimizeQuality" font-family="sans-serif" stroke="rgb(122,207,245)" font-weight="bold" stroke-opacity="1"
    ><rect x="0" width="97" height="40" y="0" clip-path="url(#clipPath1)" stroke="none"
    /></g
    ><g fill-opacity="1" text-rendering="geometricPrecision" stroke="black" stroke-linecap="butt" transform="translate(824,244)" stroke-miterlimit="0" stroke-opacity="1" fill="black" font-weight="bold" font-family="sans-serif" stroke-linejoin="round" font-size="11px" image-rendering="optimizeQuality"
    ><rect fill="none" x="0" width="97" height="40" y="0" clip-path="url(#clipPath1)"
      /><line y2="14" fill="none" x1="0" clip-path="url(#clipPath1)" x2="97" y1="14"
    /></g
    ><g font-size="11px" transform="translate(824,244)" fill-opacity="1" fill="black" text-rendering="geometricPrecision" image-rendering="optimizeQuality" font-family="sans-serif" stroke="black" font-weight="bold" stroke-opacity="1"
    ><text x="21" xml:space="preserve" y="11" clip-path="url(#clipPath5)" stroke="none"
      >JWindow</text
    ></g
    ><g font-size="11px" transform="translate(698,244)" fill-opacity="1" fill="rgb(122,207,245)" text-rendering="geometricPrecision" image-rendering="optimizeQuality" font-family="sans-serif" stroke="rgb(122,207,245)" font-weight="bold" stroke-opacity="1"
    ><rect x="0" width="97" height="40" y="0" clip-path="url(#clipPath1)" stroke="none"
    /></g
    ><g fill-opacity="1" text-rendering="geometricPrecision" stroke="black" stroke-linecap="butt" transform="translate(698,244)" stroke-miterlimit="0" stroke-opacity="1" fill="black" font-weight="bold" font-family="sans-serif" stroke-linejoin="round" font-size="11px" image-rendering="optimizeQuality"
    ><rect fill="none" x="0" width="97" height="40" y="0" clip-path="url(#clipPath1)"
      /><line y2="14" fill="none" x1="0" clip-path="url(#clipPath1)" x2="97" y1="14"
    /></g
    ><g font-size="11px" transform="translate(698,244)" fill-opacity="1" fill="black" text-rendering="geometricPrecision" image-rendering="optimizeQuality" font-family="sans-serif" stroke="black" font-weight="bold" stroke-opacity="1"
    ><text x="26" xml:space="preserve" y="11" clip-path="url(#clipPath5)" stroke="none"
      >JDialog</text
    ></g
    ><g font-size="11px" transform="translate(950,244)" fill-opacity="1" fill="rgb(122,207,245)" text-rendering="geometricPrecision" image-rendering="optimizeQuality" font-family="sans-serif" stroke="rgb(122,207,245)" font-weight="bold" stroke-opacity="1"
    ><rect x="0" width="97" height="40" y="0" clip-path="url(#clipPath1)" stroke="none"
    /></g
    ><g fill-opacity="1" text-rendering="geometricPrecision" stroke="black" stroke-linecap="butt" transform="translate(950,244)" stroke-miterlimit="0" stroke-opacity="1" fill="black" font-weight="bold" font-family="sans-serif" stroke-linejoin="round" font-size="11px" image-rendering="optimizeQuality"
    ><rect fill="none" x="0" width="97" height="40" y="0" clip-path="url(#clipPath1)"
      /><line y2="14" fill="none" x1="0" clip-path="url(#clipPath1)" x2="97" y1="14"
    /></g
    ><g font-size="11px" transform="translate(950,244)" fill-opacity="1" fill="black" text-rendering="geometricPrecision" image-rendering="optimizeQuality" font-family="sans-serif" stroke="black" font-weight="bold" stroke-opacity="1"
    ><text x="26" xml:space="preserve" y="11" clip-path="url(#clipPath5)" stroke="none"
      >JFrame</text
    ></g
    ><g font-size="11px" transform="translate(1076,244)" fill-opacity="1" fill="rgb(122,207,245)" text-rendering="geometricPrecision" image-rendering="optimizeQuality" font-family="sans-serif" stroke="rgb(122,207,245)" font-weight="bold" stroke-opacity="1"
    ><rect x="0" width="97" height="40" y="0" clip-path="url(#clipPath1)" stroke="none"
    /></g
    ><g fill-opacity="1" text-rendering="geometricPrecision" stroke="black" stroke-linecap="butt" transform="translate(1076,244)" stroke-miterlimit="0" stroke-opacity="1" fill="black" font-weight="bold" font-family="sans-serif" stroke-linejoin="round" font-size="11px" image-rendering="optimizeQuality"
    ><rect fill="none" x="0" width="97" height="40" y="0" clip-path="url(#clipPath1)"
      /><line y2="14" fill="none" x1="0" clip-path="url(#clipPath1)" x2="97" y1="14"
    /></g
    ><g font-size="11px" transform="translate(1076,244)" fill-opacity="1" fill="black" text-rendering="geometricPrecision" image-rendering="optimizeQuality" font-family="sans-serif" stroke="black" font-weight="bold" stroke-opacity="1"
    ><text x="29" xml:space="preserve" y="11" clip-path="url(#clipPath5)" stroke="none"
      >JPanel</text
    ></g
    ><g font-size="11px" transform="translate(504,241)" fill-opacity="1" fill="rgb(122,207,245)" text-rendering="geometricPrecision" image-rendering="optimizeQuality" font-family="sans-serif" stroke="rgb(122,207,245)" font-weight="bold" stroke-opacity="1"
    ><rect x="0" width="97" height="40" y="0" clip-path="url(#clipPath1)" stroke="none"
    /></g
    ><g fill-opacity="1" text-rendering="geometricPrecision" stroke="black" stroke-linecap="butt" transform="translate(504,241)" stroke-miterlimit="0" stroke-opacity="1" fill="black" font-weight="bold" font-family="sans-serif" stroke-linejoin="round" font-size="11px" image-rendering="optimizeQuality"
    ><rect fill="none" x="0" width="97" height="40" y="0" clip-path="url(#clipPath1)"
      /><line y2="14" fill="none" x1="0" clip-path="url(#clipPath1)" x2="97" y1="14"
    /></g
    ><g font-size="11px" transform="translate(504,241)" fill-opacity="1" fill="black" text-rendering="geometricPrecision" image-rendering="optimizeQuality" font-family="sans-serif" stroke="black" font-weight="bold" stroke-opacity="1"
    ><text x="25" xml:space="preserve" y="11" clip-path="url(#clipPath5)" stroke="none"
      >Jbutton</text
    ></g
    ><g font-size="11px" transform="translate(378,241)" fill-opacity="1" fill="rgb(122,207,245)" text-rendering="geometricPrecision" image-rendering="optimizeQuality" font-family="sans-serif" stroke="rgb(122,207,245)" font-weight="bold" stroke-opacity="1"
    ><rect x="0" width="97" height="40" y="0" clip-path="url(#clipPath1)" stroke="none"
    /></g
    ><g fill-opacity="1" text-rendering="geometricPrecision" stroke="black" stroke-linecap="butt" transform="translate(378,241)" stroke-miterlimit="0" stroke-opacity="1" fill="black" font-weight="bold" font-family="sans-serif" stroke-linejoin="round" font-size="11px" image-rendering="optimizeQuality"
    ><rect fill="none" x="0" width="97" height="40" y="0" clip-path="url(#clipPath1)"
      /><line y2="14" fill="none" x1="0" clip-path="url(#clipPath1)" x2="97" y1="14"
    /></g
    ><g font-size="11px" transform="translate(378,241)" fill-opacity="1" fill="black" text-rendering="geometricPrecision" image-rendering="optimizeQuality" font-family="sans-serif" stroke="black" font-weight="bold" stroke-opacity="1"
    ><text x="30" xml:space="preserve" y="11" clip-path="url(#clipPath5)" stroke="none"
      >Jlabel</text
    ></g
    ><g font-size="11px" transform="translate(252,241)" fill-opacity="1" fill="rgb(122,207,245)" text-rendering="geometricPrecision" image-rendering="optimizeQuality" font-family="sans-serif" stroke="rgb(122,207,245)" font-weight="bold" stroke-opacity="1"
    ><rect x="0" width="97" height="40" y="0" clip-path="url(#clipPath1)" stroke="none"
    /></g
    ><g fill-opacity="1" text-rendering="geometricPrecision" stroke="black" stroke-linecap="butt" transform="translate(252,241)" stroke-miterlimit="0" stroke-opacity="1" fill="black" font-weight="bold" font-family="sans-serif" stroke-linejoin="round" font-size="11px" image-rendering="optimizeQuality"
    ><rect fill="none" x="0" width="97" height="40" y="0" clip-path="url(#clipPath1)"
      /><line y2="14" fill="none" x1="0" clip-path="url(#clipPath1)" x2="97" y1="14"
    /></g
    ><g font-size="11px" transform="translate(252,241)" fill-opacity="1" fill="black" text-rendering="geometricPrecision" image-rendering="optimizeQuality" font-family="sans-serif" stroke="black" font-weight="bold" stroke-opacity="1"
    ><text x="17" xml:space="preserve" y="11" clip-path="url(#clipPath5)" stroke="none"
      >JTextField</text
    ></g
    ><g font-size="11px" transform="translate(0,241)" fill-opacity="1" fill="rgb(122,207,245)" text-rendering="geometricPrecision" image-rendering="optimizeQuality" font-family="sans-serif" stroke="rgb(122,207,245)" font-weight="bold" stroke-opacity="1"
    ><rect x="0" width="97" height="40" y="0" clip-path="url(#clipPath1)" stroke="none"
    /></g
    ><g fill-opacity="1" text-rendering="geometricPrecision" stroke="black" stroke-linecap="butt" transform="translate(0,241)" stroke-miterlimit="0" stroke-opacity="1" fill="black" font-weight="bold" font-family="sans-serif" stroke-linejoin="round" font-size="11px" image-rendering="optimizeQuality"
    ><rect fill="none" x="0" width="97" height="40" y="0" clip-path="url(#clipPath1)"
      /><line y2="14" fill="none" x1="0" clip-path="url(#clipPath1)" x2="97" y1="14"
    /></g
    ><g font-size="11px" transform="translate(0,241)" fill-opacity="1" fill="black" text-rendering="geometricPrecision" image-rendering="optimizeQuality" font-family="sans-serif" stroke="black" font-weight="bold" stroke-opacity="1"
    ><text x="17" xml:space="preserve" y="11" clip-path="url(#clipPath5)" stroke="none"
      >JTextArea</text
    ></g
    ><g font-size="11px" transform="translate(126,241)" fill-opacity="1" fill="rgb(122,207,245)" text-rendering="geometricPrecision" image-rendering="optimizeQuality" font-family="sans-serif" stroke="rgb(122,207,245)" font-weight="bold" stroke-opacity="1"
    ><rect x="0" width="97" height="40" y="0" clip-path="url(#clipPath1)" stroke="none"
    /></g
    ><g fill-opacity="1" text-rendering="geometricPrecision" stroke="black" stroke-linecap="butt" transform="translate(126,241)" stroke-miterlimit="0" stroke-opacity="1" fill="black" font-weight="bold" font-family="sans-serif" stroke-linejoin="round" font-size="11px" image-rendering="optimizeQuality"
    ><rect fill="none" x="0" width="97" height="40" y="0" clip-path="url(#clipPath1)"
      /><line y2="14" fill="none" x1="0" clip-path="url(#clipPath1)" x2="97" y1="14"
    /></g
    ><g font-size="11px" transform="translate(126,241)" fill-opacity="1" fill="black" text-rendering="geometricPrecision" image-rendering="optimizeQuality" font-family="sans-serif" stroke="black" font-weight="bold" stroke-opacity="1"
    ><text x="13" xml:space="preserve" y="11" clip-path="url(#clipPath5)" stroke="none"
      >JComboBox</text
    ></g
    ><g font-size="11px" transform="translate(887,121)" fill-opacity="1" fill="rgb(122,207,245)" text-rendering="geometricPrecision" image-rendering="optimizeQuality" font-family="sans-serif" stroke="rgb(122,207,245)" font-weight="bold" stroke-opacity="1"
    ><rect x="0" width="97" height="40" y="0" clip-path="url(#clipPath1)" stroke="none"
    /></g
    ><g fill-opacity="1" text-rendering="geometricPrecision" stroke="black" stroke-linecap="butt" transform="translate(887,121)" stroke-miterlimit="0" stroke-opacity="1" fill="black" font-weight="bold" font-family="sans-serif" stroke-linejoin="round" font-size="11px" image-rendering="optimizeQuality"
    ><rect fill="none" x="0" width="97" height="40" y="0" clip-path="url(#clipPath1)"
      /><line y2="14" fill="none" x1="0" clip-path="url(#clipPath1)" x2="97" y1="14"
    /></g
    ><g font-size="11px" transform="translate(887,121)" fill-opacity="1" fill="black" text-rendering="geometricPrecision" image-rendering="optimizeQuality" font-family="sans-serif" font-style="italic" stroke="black" font-weight="bold" stroke-opacity="1"
    ><text x="18" xml:space="preserve" y="11" clip-path="url(#clipPath5)" stroke="none"
      >Container</text
    ></g
    ><g font-size="11px" transform="translate(252,121)" fill-opacity="1" fill="rgb(122,207,245)" text-rendering="geometricPrecision" image-rendering="optimizeQuality" font-family="sans-serif" stroke="rgb(122,207,245)" font-weight="bold" stroke-opacity="1"
    ><rect x="0" width="97" height="40" y="0" clip-path="url(#clipPath1)" stroke="none"
    /></g
    ><g fill-opacity="1" text-rendering="geometricPrecision" stroke="black" stroke-linecap="butt" transform="translate(252,121)" stroke-miterlimit="0" stroke-opacity="1" fill="black" font-weight="bold" font-family="sans-serif" stroke-linejoin="round" font-size="11px" image-rendering="optimizeQuality"
    ><rect fill="none" x="0" width="97" height="40" y="0" clip-path="url(#clipPath1)"
      /><line y2="14" fill="none" x1="0" clip-path="url(#clipPath1)" x2="97" y1="14"
    /></g
    ><g font-size="11px" transform="translate(252,121)" fill-opacity="1" fill="black" text-rendering="geometricPrecision" image-rendering="optimizeQuality" font-family="sans-serif" stroke="black" font-weight="bold" stroke-opacity="1"
    ><text x="25" xml:space="preserve" y="11" clip-path="url(#clipPath5)" stroke="none"
      >Widget</text
    ></g
    ><g stroke-linecap="butt" transform="translate(251,-9)" fill-opacity="1" fill="black" text-rendering="geometricPrecision" image-rendering="optimizeQuality" font-family="'Droid Sans'" stroke-linejoin="round" stroke="black" stroke-width="1.5" stroke-opacity="1"
    ><line y2="93" fill="none" x1="398" clip-path="url(#clipPath7)" x2="398" y1="50"
      /><line y2="93" fill="none" x1="398" clip-path="url(#clipPath7)" x2="50" y1="93"
      /><line y2="129" fill="none" x1="50" clip-path="url(#clipPath7)" x2="50" y1="93"
      /><polygon fill="white" clip-path="url(#clipPath7)" points=" 398 50 391 63 404 63" stroke="none"
      /><polygon fill="none" points=" 398 50 391 63 404 63" clip-path="url(#clipPath7)"
    /></g
    ><g stroke-linecap="butt" transform="translate(599,-9)" fill-opacity="1" fill="black" text-rendering="geometricPrecision" image-rendering="optimizeQuality" font-family="'Droid Sans'" stroke-linejoin="round" stroke="black" stroke-width="1.5" stroke-opacity="1"
    ><line y2="93" fill="none" x1="50" clip-path="url(#clipPath9)" x2="50" y1="50"
      /><line y2="93" fill="none" x1="50" clip-path="url(#clipPath9)" x2="336" y1="93"
      /><line y2="129" fill="none" x1="336" clip-path="url(#clipPath9)" x2="336" y1="93"
      /><polygon fill="white" clip-path="url(#clipPath9)" points=" 50 50 43 63 56 63" stroke="none"
      /><polygon fill="none" points=" 50 50 43 63 56 63" clip-path="url(#clipPath9)"
    /></g
    ><g stroke-linecap="butt" transform="translate(-2,112)" fill-opacity="1" fill="black" text-rendering="geometricPrecision" image-rendering="optimizeQuality" font-family="'Droid Sans'" stroke-linejoin="round" stroke="black" stroke-width="1.5" stroke-opacity="1"
    ><line y2="96" fill="none" x1="302" clip-path="url(#clipPath11)" x2="302" y1="50"
      /><line y2="96" fill="none" x1="302" clip-path="url(#clipPath11)" x2="50" y1="96"
      /><line y2="128" fill="none" x1="50" clip-path="url(#clipPath11)" x2="50" y1="96"
      /><polygon fill="white" clip-path="url(#clipPath11)" points=" 302 50 295 63 308 63" stroke="none"
      /><polygon fill="none" points=" 302 50 295 63 308 63" clip-path="url(#clipPath11)"
    /></g
    ><g stroke-linecap="butt" transform="translate(124,112)" fill-opacity="1" fill="black" text-rendering="geometricPrecision" image-rendering="optimizeQuality" font-family="'Droid Sans'" stroke-linejoin="round" stroke="black" stroke-width="1.5" stroke-opacity="1"
    ><line y2="96" fill="none" x1="176" clip-path="url(#clipPath13)" x2="176" y1="50"
      /><line y2="96" fill="none" x1="176" clip-path="url(#clipPath13)" x2="50" y1="96"
      /><line y2="128" fill="none" x1="50" clip-path="url(#clipPath13)" x2="50" y1="96"
      /><polygon fill="white" clip-path="url(#clipPath13)" points=" 176 50 169 63 182 63" stroke="none"
      /><polygon fill="none" points=" 176 50 169 63 182 63" clip-path="url(#clipPath13)"
    /></g
    ><g stroke-linecap="butt" transform="translate(251,112)" fill-opacity="1" fill="black" text-rendering="geometricPrecision" image-rendering="optimizeQuality" font-family="'Droid Sans'" stroke-linejoin="round" stroke="black" stroke-width="1.5" stroke-opacity="1"
    ><line y2="96" fill="none" x1="50" clip-path="url(#clipPath15)" x2="50" y1="50"
      /><line y2="96" fill="none" x1="50" clip-path="url(#clipPath15)" x2="301" y1="96"
      /><line y2="128" fill="none" x1="301" clip-path="url(#clipPath15)" x2="301" y1="96"
      /><polygon fill="white" clip-path="url(#clipPath15)" points=" 50 50 43 63 56 63" stroke="none"
      /><polygon fill="none" points=" 50 50 43 63 56 63" clip-path="url(#clipPath15)"
    /></g
    ><g stroke-linecap="butt" transform="translate(251,112)" fill-opacity="1" fill="black" text-rendering="geometricPrecision" image-rendering="optimizeQuality" font-family="'Droid Sans'" stroke-linejoin="round" stroke="black" stroke-width="1.5" stroke-opacity="1"
    ><line y2="96" fill="none" x1="50" clip-path="url(#clipPath17)" x2="50" y1="50"
      /><line y2="96" fill="none" x1="50" clip-path="url(#clipPath17)" x2="175" y1="96"
      /><line y2="128" fill="none" x1="175" clip-path="url(#clipPath17)" x2="175" y1="96"
      /><polygon fill="white" clip-path="url(#clipPath17)" points=" 50 50 43 63 56 63" stroke="none"
      /><polygon fill="none" points=" 50 50 43 63 56 63" clip-path="url(#clipPath17)"
    /></g
    ><g stroke-linecap="butt" transform="translate(251,112)" fill-opacity="1" fill="black" text-rendering="geometricPrecision" image-rendering="optimizeQuality" font-family="'Droid Sans'" stroke-linejoin="round" stroke="black" stroke-width="1.5" stroke-opacity="1"
    ><line y2="128" fill="none" x1="50" clip-path="url(#clipPath19)" x2="50" y1="50"
      /><polygon fill="white" clip-path="url(#clipPath19)" points=" 50 50 43 63 56 63" stroke="none"
      /><polygon fill="none" points=" 50 50 43 63 56 63" clip-path="url(#clipPath19)"
    /></g
    ><g stroke-linecap="butt" transform="translate(696,112)" fill-opacity="1" fill="black" text-rendering="geometricPrecision" image-rendering="optimizeQuality" font-family="'Droid Sans'" stroke-linejoin="round" stroke="black" stroke-width="1.5" stroke-opacity="1"
    ><line y2="96" fill="none" x1="239" clip-path="url(#clipPath21)" x2="239" y1="50"
      /><line y2="96" fill="none" x1="239" clip-path="url(#clipPath21)" x2="50" y1="96"
      /><line y2="131" fill="none" x1="50" clip-path="url(#clipPath21)" x2="50" y1="96"
      /><polygon fill="white" clip-path="url(#clipPath21)" points=" 239 50 232 63 245 63" stroke="none"
      /><polygon fill="none" points=" 239 50 232 63 245 63" clip-path="url(#clipPath21)"
    /></g
    ><g stroke-linecap="butt" transform="translate(822,112)" fill-opacity="1" fill="black" text-rendering="geometricPrecision" image-rendering="optimizeQuality" font-family="'Droid Sans'" stroke-linejoin="round" stroke="black" stroke-width="1.5" stroke-opacity="1"
    ><line y2="96" fill="none" x1="113" clip-path="url(#clipPath23)" x2="113" y1="50"
      /><line y2="96" fill="none" x1="113" clip-path="url(#clipPath23)" x2="50" y1="96"
      /><line y2="131" fill="none" x1="50" clip-path="url(#clipPath23)" x2="50" y1="96"
      /><polygon fill="white" clip-path="url(#clipPath23)" points=" 113 50 106 63 119 63" stroke="none"
      /><polygon fill="none" points=" 113 50 106 63 119 63" clip-path="url(#clipPath23)"
    /></g
    ><g stroke-linecap="butt" transform="translate(885,112)" fill-opacity="1" fill="black" text-rendering="geometricPrecision" image-rendering="optimizeQuality" font-family="'Droid Sans'" stroke-linejoin="round" stroke="black" stroke-width="1.5" stroke-opacity="1"
    ><line y2="96" fill="none" x1="50" clip-path="url(#clipPath25)" x2="50" y1="50"
      /><line y2="96" fill="none" x1="50" clip-path="url(#clipPath25)" x2="112" y1="96"
      /><line y2="131" fill="none" x1="112" clip-path="url(#clipPath25)" x2="112" y1="96"
      /><polygon fill="white" clip-path="url(#clipPath25)" points=" 50 50 43 63 56 63" stroke="none"
      /><polygon fill="none" points=" 50 50 43 63 56 63" clip-path="url(#clipPath25)"
    /></g
    ><g stroke-linecap="butt" transform="translate(885,112)" fill-opacity="1" fill="black" text-rendering="geometricPrecision" image-rendering="optimizeQuality" font-family="'Droid Sans'" stroke-linejoin="round" stroke="black" stroke-width="1.5" stroke-opacity="1"
    ><line y2="96" fill="none" x1="50" clip-path="url(#clipPath27)" x2="50" y1="50"
      /><line y2="96" fill="none" x1="50" clip-path="url(#clipPath27)" x2="238" y1="96"
      /><line y2="131" fill="none" x1="238" clip-path="url(#clipPath27)" x2="238" y1="96"
      /><polygon fill="white" clip-path="url(#clipPath27)" points=" 50 50 43 63 56 63" stroke="none"
      /><polygon fill="none" points=" 50 50 43 63 56 63" clip-path="url(#clipPath27)"
    /></g
    ><g font-size="10px" transform="rotate(-45) translate(-204.7353,0)" fill-opacity="1" fill="rgb(120,120,120)" text-rendering="geometricPrecision" image-rendering="optimizeQuality" stroke="rgb(120,120,120)" stroke-opacity="1"
    ><text x="0" xml:space="preserve" y="0" stroke="none"
      >Visual Paradigm Enterprise [evaluation copy] </text
      ><text x="235" xml:space="preserve" y="0" stroke="none"
      >Visual Paradigm Enterprise [evaluation copy] </text
      ><text x="470" xml:space="preserve" y="0" stroke="none"
      >Visual Paradigm Enterprise [evaluation copy] </text
      ><text x="705" xml:space="preserve" y="0" stroke="none"
      >Visual Paradigm Enterprise [evaluation copy] </text
      ><text x="940" xml:space="preserve" y="0" stroke="none"
      >Visual Paradigm Enterprise [evaluation copy] </text
      ><text x="100" xml:space="preserve" y="52" stroke="none"
      >Visual Paradigm Enterprise [evaluation copy] </text
      ><text x="335" xml:space="preserve" y="52" stroke="none"
      >Visual Paradigm Enterprise [evaluation copy] </text
      ><text x="570" xml:space="preserve" y="52" stroke="none"
      >Visual Paradigm Enterprise [evaluation copy] </text
      ><text x="805" xml:space="preserve" y="52" stroke="none"
      >Visual Paradigm Enterprise [evaluation copy] </text
      ><text x="0" xml:space="preserve" y="104" stroke="none"
      >Visual Paradigm Enterprise [evaluation copy] </text
      ><text x="235" xml:space="preserve" y="104" stroke="none"
      >Visual Paradigm Enterprise [evaluation copy] </text
      ><text x="470" xml:space="preserve" y="104" stroke="none"
      >Visual Paradigm Enterprise [evaluation copy] </text
      ><text x="705" xml:space="preserve" y="104" stroke="none"
      >Visual Paradigm Enterprise [evaluation copy] </text
      ><text x="940" xml:space="preserve" y="104" stroke="none"
      >Visual Paradigm Enterprise [evaluation copy] </text
      ><text x="100" xml:space="preserve" y="156" stroke="none"
      >Visual Paradigm Enterprise [evaluation copy] </text
      ><text x="335" xml:space="preserve" y="156" stroke="none"
      >Visual Paradigm Enterprise [evaluation copy] </text
      ><text x="570" xml:space="preserve" y="156" stroke="none"
      >Visual Paradigm Enterprise [evaluation copy] </text
      ><text x="805" xml:space="preserve" y="156" stroke="none"
      >Visual Paradigm Enterprise [evaluation copy] </text
      ><text x="0" xml:space="preserve" y="208" stroke="none"
      >Visual Paradigm Enterprise [evaluation copy] </text
      ><text x="235" xml:space="preserve" y="208" stroke="none"
      >Visual Paradigm Enterprise [evaluation copy] </text
      ><text x="470" xml:space="preserve" y="208" stroke="none"
      >Visual Paradigm Enterprise [evaluation copy] </text
      ><text x="705" xml:space="preserve" y="208" stroke="none"
      >Visual Paradigm Enterprise [evaluation copy] </text
      ><text x="940" xml:space="preserve" y="208" stroke="none"
      >Visual Paradigm Enterprise [evaluation copy] </text
      ><text x="100" xml:space="preserve" y="260" stroke="none"
      >Visual Paradigm Enterprise [evaluation copy] </text
      ><text x="335" xml:space="preserve" y="260" stroke="none"
      >Visual Paradigm Enterprise [evaluation copy] </text
      ><text x="570" xml:space="preserve" y="260" stroke="none"
      >Visual Paradigm Enterprise [evaluation copy] </text
      ><text x="805" xml:space="preserve" y="260" stroke="none"
      >Visual Paradigm Enterprise [evaluation copy] </text
      ><text x="0" xml:space="preserve" y="312" stroke="none"
      >Visual Paradigm Enterprise [evaluation copy] </text
      ><text x="235" xml:space="preserve" y="312" stroke="none"
      >Visual Paradigm Enterprise [evaluation copy] </text
      ><text x="470" xml:space="preserve" y="312" stroke="none"
      >Visual Paradigm Enterprise [evaluation copy] </text
      ><text x="705" xml:space="preserve" y="312" stroke="none"
      >Visual Paradigm Enterprise [evaluation copy] </text
      ><text x="940" xml:space="preserve" y="312" stroke="none"
      >Visual Paradigm Enterprise [evaluation copy] </text
      ><text x="100" xml:space="preserve" y="364" stroke="none"
      >Visual Paradigm Enterprise [evaluation copy] </text
      ><text x="335" xml:space="preserve" y="364" stroke="none"
      >Visual Paradigm Enterprise [evaluation copy] </text
      ><text x="570" xml:space="preserve" y="364" stroke="none"
      >Visual Paradigm Enterprise [evaluation copy] </text
      ><text x="805" xml:space="preserve" y="364" stroke="none"
      >Visual Paradigm Enterprise [evaluation copy] </text
      ><text x="0" xml:space="preserve" y="416" stroke="none"
      >Visual Paradigm Enterprise [evaluation copy] </text
      ><text x="235" xml:space="preserve" y="416" stroke="none"
      >Visual Paradigm Enterprise [evaluation copy] </text
      ><text x="470" xml:space="preserve" y="416" stroke="none"
      >Visual Paradigm Enterprise [evaluation copy] </text
      ><text x="705" xml:space="preserve" y="416" stroke="none"
      >Visual Paradigm Enterprise [evaluation copy] </text
      ><text x="940" xml:space="preserve" y="416" stroke="none"
      >Visual Paradigm Enterprise [evaluation copy] </text
      ><text x="100" xml:space="preserve" y="468" stroke="none"
      >Visual Paradigm Enterprise [evaluation copy] </text
      ><text x="335" xml:space="preserve" y="468" stroke="none"
      >Visual Paradigm Enterprise [evaluation copy] </text
      ><text x="570" xml:space="preserve" y="468" stroke="none"
      >Visual Paradigm Enterprise [evaluation copy] </text
      ><text x="805" xml:space="preserve" y="468" stroke="none"
      >Visual Paradigm Enterprise [evaluation copy] </text
      ><text x="0" xml:space="preserve" y="520" stroke="none"
      >Visual Paradigm Enterprise [evaluation copy] </text
      ><text x="235" xml:space="preserve" y="520" stroke="none"
      >Visual Paradigm Enterprise [evaluation copy] </text
      ><text x="470" xml:space="preserve" y="520" stroke="none"
      >Visual Paradigm Enterprise [evaluation copy] </text
      ><text x="705" xml:space="preserve" y="520" stroke="none"
      >Visual Paradigm Enterprise [evaluation copy] </text
      ><text x="940" xml:space="preserve" y="520" stroke="none"
      >Visual Paradigm Enterprise [evaluation copy] </text
      ><text x="100" xml:space="preserve" y="572" stroke="none"
      >Visual Paradigm Enterprise [evaluation copy] </text
      ><text x="335" xml:space="preserve" y="572" stroke="none"
      >Visual Paradigm Enterprise [evaluation copy] </text
      ><text x="570" xml:space="preserve" y="572" stroke="none"
      >Visual Paradigm Enterprise [evaluation copy] </text
      ><text x="805" xml:space="preserve" y="572" stroke="none"
      >Visual Paradigm Enterprise [evaluation copy] </text
      ><text x="0" xml:space="preserve" y="624" stroke="none"
      >Visual Paradigm Enterprise [evaluation copy] </text
      ><text x="235" xml:space="preserve" y="624" stroke="none"
      >Visual Paradigm Enterprise [evaluation copy] </text
      ><text x="470" xml:space="preserve" y="624" stroke="none"
      >Visual Paradigm Enterprise [evaluation copy] </text
      ><text x="705" xml:space="preserve" y="624" stroke="none"
      >Visual Paradigm Enterprise [evaluation copy] </text
      ><text x="940" xml:space="preserve" y="624" stroke="none"
      >Visual Paradigm Enterprise [evaluation copy] </text
      ><text x="100" xml:space="preserve" y="676" stroke="none"
      >Visual Paradigm Enterprise [evaluation copy] </text
      ><text x="335" xml:space="preserve" y="676" stroke="none"
      >Visual Paradigm Enterprise [evaluation copy] </text
      ><text x="570" xml:space="preserve" y="676" stroke="none"
      >Visual Paradigm Enterprise [evaluation copy] </text
      ><text x="805" xml:space="preserve" y="676" stroke="none"
      >Visual Paradigm Enterprise [evaluation copy] </text
      ><text x="0" xml:space="preserve" y="728" stroke="none"
      >Visual Paradigm Enterprise [evaluation copy] </text
      ><text x="235" xml:space="preserve" y="728" stroke="none"
      >Visual Paradigm Enterprise [evaluation copy] </text
      ><text x="470" xml:space="preserve" y="728" stroke="none"
      >Visual Paradigm Enterprise [evaluation copy] </text
      ><text x="705" xml:space="preserve" y="728" stroke="none"
      >Visual Paradigm Enterprise [evaluation copy] </text
      ><text x="940" xml:space="preserve" y="728" stroke="none"
      >Visual Paradigm Enterprise [evaluation copy] </text
      ><text x="100" xml:space="preserve" y="780" stroke="none"
      >Visual Paradigm Enterprise [evaluation copy] </text
      ><text x="335" xml:space="preserve" y="780" stroke="none"
      >Visual Paradigm Enterprise [evaluation copy] </text
      ><text x="570" xml:space="preserve" y="780" stroke="none"
      >Visual Paradigm Enterprise [evaluation copy] </text
      ><text x="805" xml:space="preserve" y="780" stroke="none"
      >Visual Paradigm Enterprise [evaluation copy] </text
      ><text x="0" xml:space="preserve" y="832" stroke="none"
      >Visual Paradigm Enterprise [evaluation copy] </text
      ><text x="235" xml:space="preserve" y="832" stroke="none"
      >Visual Paradigm Enterprise [evaluation copy] </text
      ><text x="470" xml:space="preserve" y="832" stroke="none"
      >Visual Paradigm Enterprise [evaluation copy] </text
      ><text x="705" xml:space="preserve" y="832" stroke="none"
      >Visual Paradigm Enterprise [evaluation copy] </text
      ><text x="940" xml:space="preserve" y="832" stroke="none"
      >Visual Paradigm Enterprise [evaluation copy] </text
      ><text x="100" xml:space="preserve" y="884" stroke="none"
      >Visual Paradigm Enterprise [evaluation copy] </text
      ><text x="335" xml:space="preserve" y="884" stroke="none"
      >Visual Paradigm Enterprise [evaluation copy] </text
      ><text x="570" xml:space="preserve" y="884" stroke="none"
      >Visual Paradigm Enterprise [evaluation copy] </text
      ><text x="805" xml:space="preserve" y="884" stroke="none"
      >Visual Paradigm Enterprise [evaluation copy] </text
      ><text x="0" xml:space="preserve" y="936" stroke="none"
      >Visual Paradigm Enterprise [evaluation copy] </text
      ><text x="235" xml:space="preserve" y="936" stroke="none"
      >Visual Paradigm Enterprise [evaluation copy] </text
      ><text x="470" xml:space="preserve" y="936" stroke="none"
      >Visual Paradigm Enterprise [evaluation copy] </text
      ><text x="705" xml:space="preserve" y="936" stroke="none"
      >Visual Paradigm Enterprise [evaluation copy] </text
      ><text x="940" xml:space="preserve" y="936" stroke="none"
      >Visual Paradigm Enterprise [evaluation copy] </text
    ></g
  ></g
></svg
>
