{
  "groups": [
    {
      "name": "mail-server",
      "type": "fr.jihadoussad.mailserver.controller.context.MailServerContext",
      "sourceType": "fr.jihadoussad.mailserver.controller.context.MailServerContext"
    }
  ],
  "properties": [
    {
      "name": "mail-server.provider",
      "type": "java.lang.String",
      "description": "Determine the service provider name to load (prod or simu).",
      "sourceType": "fr.jihadoussad.mailserver.controller.context.MailServerContext",
      "defaultValue": "email-service-prod"
    }
  ],
  "hints": [
    {
      "name": "mail-server.provider",
      "values": [
        {
          "value": "email-service-prod",
          "description": "enable the prod service provider."
        },
        {
          "value": "email-service-simu",
          "description": "enable the simu service provider."
        }
      ]
    }
  ]
}
