{
  "groups": [
    {
      "name": "lvlup-api",
      "type": "fr.jihadoussad.lvlup.api.context.LvlupApiContext",
      "sourceType": "fr.jihadoussad.lvlup.api.context.LvlupApiContext"
    }
  ],
  "properties": [
    {
      "name": "lvlup-api.base-resource-url",
      "type": "java.lang.String",
      "description": "The base resource url (only available from dev and test profile).",
      "sourceType": "fr.jihadoussad.lvlup.api.context.LvlupApiContext"
    },
    {
      "name": "lvlup-api.access-token-expiration",
      "type": "java.lang.Long",
      "description": "The access token expiration duration.",
      "defaultValue": "1 hour",
      "sourceType": "fr.jihadoussad.lvlup.api.context.LvlupApiContext"
    },
    {
      "name": "lvlup-api.front-url",
      "type": "java.lang.String",
      "description": "The front url calling.",
      "sourceType": "fr.jihadoussad.lvlup.api.context.LvlupApiContext"
    },
    {
      "name": "lvlup-api.max-retry",
      "type": "java.lang.Integer",
      "description": "Max retry authentication.",
      "defaultValue": 5,
      "sourceType": "fr.jihadoussad.lvlup.api.context.LvlupApiContext"
    },
    {
      "name": "lvlup-api.access-secret-key",
      "type": "java.lang.String",
      "description": "The secret key to generate access token.",
      "sourceType": "fr.jihadoussad.lvlup.api.context.LvlupApiContext"
    },
    {
      "name": "lvlup-api.subject-name",
      "type": "java.lang.String",
      "description": "The subject token name.",
      "defaultValue": "lvlup",
      "sourceType": "fr.jihadoussad.lvlup.api.context.LvlupApiContext"
    },
    {
      "name": "lvlup-api.web-url-ignoring",
      "type": "java.util.List",
      "description": "The web url ignoring by security configuration.",
      "sourceType": "fr.jihadoussad.lvlup.api.context.LvlupApiContext"
    }
  ],
  "hints": [
    {
      "name": "lvlup-api.access-token-expiration"
    },
    {
      "name": "lvlup-api.access-secret-key"
    },
    {
      "name": "lvlup-api.base-resource-url"
    },
    {
      "name": "lvlup-api.front-url"
    },
    {
      "name": "lvlup-api.max-retry"
    },
    {
      "name": "lvlup-api.subject-name"
    },
    {
      "name": "lvlup-api.web-url-ignoring"
    }
  ]
}
