{
 "$id": "https://ourscitest.farmos.net/api/organization/farm/resource/schema?farm_id=1",
 "title": "Farm organization",
 "type": "object",
 "properties": {
  "id": {
   "type": "string",
   "format": "uuid"
  },
  "type": {
   "const": "organization--farm"
  },
  "meta": {
   "type": "object"
  },
  "attributes": {
   "description": "Entity attributes",
   "type": "object",
   "properties": {
    "name": {
     "type": "string",
     "title": "Name",
     "maxLength": 255,
     "description": "The name of the organization."
    },
    "status": {
     "type": "string",
     "title": "Status",
     "maxLength": 255,
     "oneOf": [
      {
       "const": "active",
       "title": "Active"
      },
      {
       "const": "archived",
       "title": "Archived"
      }
     ],
     "description": "Indicates the status of the organization."
    },
    "archived": {
     "type": "string",
     "title": "Timestamp",
     "format": "date-time",
     "description": "The time the organization was archived."
    },
    "data": {
     "type": "string",
     "title": "Data"
    },
    "notes": {
     "type": "object",
     "properties": {
      "value": {
       "type": "string",
       "title": "Text"
      },
      "format": {
       "type": "string",
       "title": "Text format"
      }
     },
     "required": [
      "value"
     ],
     "title": "Notes"
    },
    "pasa_farm_id": {
     "type": "string",
     "title": "Pasa Farm ID",
     "maxLength": 255
    }
   },
   "required": [
    "name",
    "status"
   ],
   "additionalProperties": false
  },
  "relationships": {
   "description": "Entity relationships",
   "properties": {
    "file": {
     "type": "object",
     "properties": {
      "data": {
       "type": "array",
       "title": "Files",
       "items": {
        "type": "object",
        "required": [
         "id",
         "type"
        ],
        "properties": {
         "id": {
          "type": "string",
          "title": "Resource ID",
          "format": "uuid",
          "maxLength": 128
         },
         "type": {
          "type": "string"
         }
        }
       }
      }
     }
    },
    "image": {
     "type": "object",
     "properties": {
      "data": {
       "type": "array",
       "title": "Images",
       "items": {
        "type": "object",
        "required": [
         "id",
         "type"
        ],
        "properties": {
         "id": {
          "type": "string",
          "title": "Resource ID",
          "format": "uuid",
          "maxLength": 128
         },
         "type": {
          "type": "string"
         }
        }
       }
      }
     }
    },
    "user": {
     "type": "object",
     "properties": {
      "data": {
       "type": "array",
       "title": "Users",
       "items": {
        "type": "object",
        "required": [
         "id",
         "type"
        ],
        "properties": {
         "id": {
          "type": "string",
          "title": "Resource ID",
          "format": "uuid",
          "maxLength": 128
         },
         "type": {
          "type": "string"
         }
        }
       }
      }
     }
    }
   },
   "type": "object",
   "additionalProperties": false
  }
 },
 "required": [
  "id",
  "attributes"
 ]
}