{
 "$id": "https://ourscitest.farmos.net/api/taxonomy_term/crop_family/resource/schema?farm_id=1",
 "title": "Crop family taxonomy term",
 "type": "object",
 "properties": {
  "id": {
   "type": "string",
   "format": "uuid"
  },
  "type": {
   "const": "taxonomy_term--crop_family"
  },
  "meta": {
   "type": "object"
  },
  "attributes": {
   "description": "Entity attributes",
   "type": "object",
   "properties": {
    "status": {
     "type": "boolean",
     "title": "Published",
     "oneOf": [
      {
       "const": 0,
       "title": "Off"
      },
      {
       "const": 1,
       "title": "On"
      }
     ],
     "default": true
    },
    "name": {
     "type": "string",
     "title": "Name",
     "maxLength": 255
    },
    "description": {
     "type": "object",
     "properties": {
      "value": {
       "type": "string",
       "title": "Text"
      },
      "format": {
       "type": "string",
       "title": "Text format"
      }
     },
     "required": [
      "value"
     ],
     "title": "Description"
    },
    "weight": {
     "type": "integer",
     "title": "Weight",
     "description": "The weight of this term in relation to other terms.",
     "default": 0
    },
    "external_uri": {
     "type": "array",
     "title": "External URI",
     "description": "Link this term to one or more external URLs or ontology item URIs.",
     "items": {
      "type": "string",
      "title": "URI value",
      "format": "uri",
      "maxLength": 2048
     }
    }
   },
   "required": [
    "name"
   ],
   "additionalProperties": false
  },
  "relationships": {
   "description": "Entity relationships",
   "properties": {
    "vid": {
     "type": "object",
     "properties": {
      "data": {
       "title": "Vocabulary",
       "type": "object",
       "required": [
        "id",
        "type"
       ],
       "properties": {
        "id": {
         "type": "string",
         "title": "Resource ID",
         "format": "uuid",
         "maxLength": 128
        },
        "type": {
         "type": "string"
        }
       }
      }
     }
    },
    "parent": {
     "type": "object",
     "properties": {
      "data": {
       "type": "array",
       "title": "Term Parents",
       "items": {
        "type": "object",
        "required": [
         "id",
         "type"
        ],
        "properties": {
         "id": {
          "type": "string",
          "title": "Resource ID",
          "format": "uuid",
          "maxLength": 128
         },
         "type": {
          "type": "string"
         }
        }
       }
      }
     }
    },
    "file": {
     "type": "object",
     "properties": {
      "data": {
       "type": "array",
       "title": "Files",
       "items": {
        "type": "object",
        "required": [
         "id",
         "type"
        ],
        "properties": {
         "id": {
          "type": "string",
          "title": "Resource ID",
          "format": "uuid",
          "maxLength": 128
         },
         "type": {
          "type": "string"
         }
        }
       }
      }
     }
    },
    "image": {
     "type": "object",
     "properties": {
      "data": {
       "type": "array",
       "title": "Images",
       "items": {
        "type": "object",
        "required": [
         "id",
         "type"
        ],
        "properties": {
         "id": {
          "type": "string",
          "title": "Resource ID",
          "format": "uuid",
          "maxLength": 128
         },
         "type": {
          "type": "string"
         }
        }
       }
      }
     }
    }
   },
   "type": "object",
   "additionalProperties": false
  }
 },
 "required": [
  "id",
  "attributes"
 ]
}