[
  {
    "id": 2,
    "user": {
      "id": 3,
      "username": "the user id as string",
      "email": "the users email address",
      "displayName": "the users display name"
    },
    "url": "https://<hostname>",
    "username": "<username>",
    "password": "<password>",
    "token": "",
    "parameters": "",
    "note": "",
    "type": "FARMOS"
  }
]
