{
  "variance": {
    "columnNames": [
      "chlorophyll_1.data.chlorophyll_spad",
      "chlorophyll_1.data.carotenoid_spad",
      "chlorophyll_1.data.anthocyanin_spad",
      "dbh",
      "age",
      "growth",
      "tpz_line_bare",
      "tpz_line_grass",
      "tpz_line_impervious",
      "tpz_line_mulch",
      "crown_density",
      "crown_dieback",
      "crown_light_exposure",
      "crown_position",
      "quercus-macrocarpa"
    ],
    "column_names": [
      "_cn6ca",
      "chlorophyll1.data.chlorophyllspad",
      "chlorophyll1.data.carotenoidspad",
      "chlorophyll1.data.anthocyaninspad",
      "dbh",
      "age",
      "growth",
      "tpzlinebare",
      "tpzlinegrass",
      "tpzlineimpervious",
      "tpzlinemulch",
      "crowndensity",
      "crowndieback",
      "crownlightexposure",
      "crownposition"
    ],
    "name": "variance",
    "tabletop": {
      "callback": [(Function: callback)],
      "wanted": [],
      "key": "1qYwGx7lieQQt7W55FZ2f5z7G31k-hVIHhn3wIIAxObQ",
      "simpleSheet": false,
      "parseNumbers": false,
      "wait": false,
      "reverse": false,
      "postProcess": undefined,
      "debug": false,
      "query": "",
      "orderby": undefined,
      "endpoint": "https://spreadsheets.google.com",
      "singleton": false,
      "simpleUrl": false,
      "authkey": undefined,
      "sheetPrivacy": "public",
      "callbackContext": undefined,
      "prettyColumnNames": true,
      "parameterize": false,
      "models": [Circular],
      "modelNames": [Array],
      "model_names": [Array],
      "baseJsonPath":
        "/feeds/worksheets/1qYwGx7lieQQt7W55FZ2f5z7G31k-hVIHhn3wIIAxObQ/public/basic?alt=json",
      "googleSheetName": "Kopie von Standard Tree Values",
      "foundSheetNames": [Array],
      "sheetsToLoad": 0
    },
    "elements": [[Object], [Object]],
    "onReady": [(Function: onReady)],
    "raw": { "version": "1.0", "encoding": "UTF-8", "feed": [Object] },
    "originalColumns": [
      "_cn6ca",
      "chlorophyll1.data.chlorophyllspad",
      "chlorophyll1.data.carotenoidspad",
      "chlorophyll1.data.anthocyaninspad",
      "dbh",
      "age",
      "growth",
      "tpzlinebare",
      "tpzlinegrass",
      "tpzlineimpervious",
      "tpzlinemulch",
      "crowndensity",
      "crowndieback",
      "crownlightexposure",
      "crownposition"
    ],
    "original_columns": [
      "_cn6ca",
      "chlorophyll1.data.chlorophyllspad",
      "chlorophyll1.data.carotenoidspad",
      "chlorophyll1.data.anthocyaninspad",
      "dbh",
      "age",
      "growth",
      "tpzlinebare",
      "tpzlinegrass",
      "tpzlineimpervious",
      "tpzlinemulch",
      "crowndensity",
      "crowndieback",
      "crownlightexposure",
      "crownposition"
    ],
    "prettyColumns": {
      "_cn6ca": "chlorophyll_1.data.chlorophyll_spad",
      "chlorophyll1.data.chlorophyllspad": "chlorophyll_1.data.carotenoid_spad",
      "chlorophyll1.data.carotenoidspad": "chlorophyll_1.data.anthocyanin_spad",
      "chlorophyll1.data.anthocyaninspad": "dbh",
      "dbh": "age",
      "age": "growth",
      "growth": "tpz_line_bare",
      "tpzlinebare": "tpz_line_grass",
      "tpzlinegrass": "tpz_line_impervious",
      "tpzlineimpervious": "tpz_line_mulch",
      "tpzlinemulch": "crown_density",
      "crowndensity": "crown_dieback",
      "crowndieback": "crown_light_exposure",
      "crownlightexposure": "crown_position",
      "crownposition": "quercus-macrocarpa"
    },
    "pretty_columns": {
      "_cn6ca": "chlorophyll_1.data.chlorophyll_spad",
      "chlorophyll1.data.chlorophyllspad": "chlorophyll_1.data.carotenoid_spad",
      "chlorophyll1.data.carotenoidspad": "chlorophyll_1.data.anthocyanin_spad",
      "chlorophyll1.data.anthocyaninspad": "dbh",
      "dbh": "age",
      "age": "growth",
      "growth": "tpz_line_bare",
      "tpzlinebare": "tpz_line_grass",
      "tpzlinegrass": "tpz_line_impervious",
      "tpzlineimpervious": "tpz_line_mulch",
      "tpzlinemulch": "crown_density",
      "crowndensity": "crown_dieback",
      "crowndieback": "crown_light_exposure",
      "crownlightexposure": "crown_position",
      "crownposition": "quercus-macrocarpa"
    }
  },
  "averages": {
    "columnNames": [
      "chlorophyll_1.data.chlorophyll_spad",
      "chlorophyll_1.data.carotenoid_spad",
      "chlorophyll_1.data.anthocyanin_spad",
      "dbh",
      "age",
      "growth",
      "tpz_line_bare",
      "tpz_line_grass",
      "tpz_line_impervious",
      "tpz_line_mulch",
      "crown_density",
      "crown_dieback",
      "crown_light_exposure",
      "crown_position",
      "quercus-macrocarpa"
    ],
    "column_names": [
      "_cn6ca",
      "chlorophyll1.data.chlorophyllspad",
      "chlorophyll1.data.carotenoidspad",
      "chlorophyll1.data.anthocyaninspad",
      "dbh",
      "age",
      "growth",
      "tpzlinebare",
      "tpzlinegrass",
      "tpzlineimpervious",
      "tpzlinemulch",
      "crowndensity",
      "crowndieback",
      "crownlightexposure",
      "crownposition"
    ],
    "name": "averages",
    "tabletop": {
      "callback": [(Function: callback)],
      "wanted": [],
      "key": "1qYwGx7lieQQt7W55FZ2f5z7G31k-hVIHhn3wIIAxObQ",
      "simpleSheet": false,
      "parseNumbers": false,
      "wait": false,
      "reverse": false,
      "postProcess": undefined,
      "debug": false,
      "query": "",
      "orderby": undefined,
      "endpoint": "https://spreadsheets.google.com",
      "singleton": false,
      "simpleUrl": false,
      "authkey": undefined,
      "sheetPrivacy": "public",
      "callbackContext": undefined,
      "prettyColumnNames": true,
      "parameterize": false,
      "models": [Circular],
      "modelNames": [Array],
      "model_names": [Array],
      "baseJsonPath":
        "/feeds/worksheets/1qYwGx7lieQQt7W55FZ2f5z7G31k-hVIHhn3wIIAxObQ/public/basic?alt=json",
      "googleSheetName": "Kopie von Standard Tree Values",
      "foundSheetNames": [Array],
      "sheetsToLoad": 0
    },
    "elements": [[Object], [Object]],
    "onReady": [(Function: onReady)],
    "raw": { "version": "1.0", "encoding": "UTF-8", "feed": [Object] },
    "originalColumns": [
      "_cn6ca",
      "chlorophyll1.data.chlorophyllspad",
      "chlorophyll1.data.carotenoidspad",
      "chlorophyll1.data.anthocyaninspad",
      "dbh",
      "age",
      "growth",
      "tpzlinebare",
      "tpzlinegrass",
      "tpzlineimpervious",
      "tpzlinemulch",
      "crowndensity",
      "crowndieback",
      "crownlightexposure",
      "crownposition"
    ],
    "original_columns": [
      "_cn6ca",
      "chlorophyll1.data.chlorophyllspad",
      "chlorophyll1.data.carotenoidspad",
      "chlorophyll1.data.anthocyaninspad",
      "dbh",
      "age",
      "growth",
      "tpzlinebare",
      "tpzlinegrass",
      "tpzlineimpervious",
      "tpzlinemulch",
      "crowndensity",
      "crowndieback",
      "crownlightexposure",
      "crownposition"
    ],
    "prettyColumns": {
      "_cn6ca": "chlorophyll_1.data.chlorophyll_spad",
      "chlorophyll1.data.chlorophyllspad": "chlorophyll_1.data.carotenoid_spad",
      "chlorophyll1.data.carotenoidspad": "chlorophyll_1.data.anthocyanin_spad",
      "chlorophyll1.data.anthocyaninspad": "dbh",
      "dbh": "age",
      "age": "growth",
      "growth": "tpz_line_bare",
      "tpzlinebare": "tpz_line_grass",
      "tpzlinegrass": "tpz_line_impervious",
      "tpzlineimpervious": "tpz_line_mulch",
      "tpzlinemulch": "crown_density",
      "crowndensity": "crown_dieback",
      "crowndieback": "crown_light_exposure",
      "crownlightexposure": "crown_position",
      "crownposition": "quercus-macrocarpa"
    },
    "pretty_columns": {
      "_cn6ca": "chlorophyll_1.data.chlorophyll_spad",
      "chlorophyll1.data.chlorophyllspad": "chlorophyll_1.data.carotenoid_spad",
      "chlorophyll1.data.carotenoidspad": "chlorophyll_1.data.anthocyanin_spad",
      "chlorophyll1.data.anthocyaninspad": "dbh",
      "dbh": "age",
      "age": "growth",
      "growth": "tpz_line_bare",
      "tpzlinebare": "tpz_line_grass",
      "tpzlinegrass": "tpz_line_impervious",
      "tpzlineimpervious": "tpz_line_mulch",
      "tpzlinemulch": "crown_density",
      "crowndensity": "crown_dieback",
      "crowndieback": "crown_light_exposure",
      "crownlightexposure": "crown_position",
      "crownposition": "quercus-macrocarpa"
    }
  }
}
