{
  "field_id": "Feld im Garten (server: 8, tid: 25)",
  "crop": "Kale",
  "general_management": "biodynamic",
  "irrigation_source": "surface",
  "land_prep_method": "tillage",
  "tillage/type_1": "moldboard_shallow",
  "tillage/date_1": "2019-03-27",
  "tillage/depth_1": "3",
  "tillage/tillage_2": "Yes",
  "tillage/type_2": "seedbed_conditioner",
  "tillage/date_2": "2019-03-15",
  "tillage/depth_2": "6",
  "tillage/tillage_3": "No",
  "mulch_question": "Yes",
  "mulch/type": "wood_chips",
  "mulch/depth": "2",
  "mulch/date": "2019-03-07",
  "planting_date": "2019-03-28",
  "transplanting_question": "Yes",
  "transplanting/potting_soil_days": "3",
  "transplanting/potting_soil_brand": "orga-manure",
  "transplanting/seedling_tray_type": "cell",
  "transplanting/cell_number": "6",
  "transplanting/lighting": "yes",
  "transplanting/climate": "no",
  "transplanting/seedling_treatment": "foliar_spray drench kelp",
  "transplanting/seedling_treatment_date": "2019-03-12",
  "transplanting/seedling_treatment_name": "seedster4k",
  "lime_question": "Yes",
  "lime/rate": "36",
  "lime/lime_date": "2019-04-05",
  "amendments_question": "Yes",
  "amendments/name_1": "eff",
  "amendments/amendment_date_1": "2019-03-22",
  "amendments/method_1": "sidedress",
  "amendments/nutrients_1": "K P N B Mn",
  "amendments/n_1": "3",
  "amendments/p_1": "5",
  "amendments/k_1": "5",
  "amendments/nutrients_trace_1": "trace 1",
  "amendments/amendment_2": "Yes",
  "amendments/name_2": "fee",
  "amendments/amendment_date_2": "2019-03-16",
  "amendments/method_2": "Injection",
  "amendments/nutrients_2": "N P K Ca Mg Cu Zn",
  "amendments/n_2": "1",
  "amendments/p_2": "36",
  "amendments/k_2": "1",
  "history_info": "",
  "history_1/use": "cover_crop cash_crop",
  "history_1/cash_crop1": "carob",
  "history_1/cash_crop2": "durian",
  "history_1/cover_crop": "legumes brassicas",
  "history_2/use_2": "pastured fallow",
  "history_2/pastured_2": "sheep pigs",
  "error_check": "",
  "thanks": ""
}
