{
  "device_name": "Reflectometer",
  "device_version": "1B",
  "device_id": "ff:ff:ff:ff",
  "device_battery": 96,
  "device_firmware": 1.18,
  "sample": [
    {
      "calibration":2,
      "temperature": 27.030001,
      "humidity": 39.585999,
      "pressure": 982.840027,
      "voc": 60.292999,
      "data_raw": [
        21938,
        21984,
        21988,
        21978,
        21996,
        21990,
        21990,
        21948,
        21986,
        21978,
        21988,
        22006,
        21980,
        21986,
        21982,
        21988,
        21992,
        21986,
        21988,
        21990,
        21984,
        21978,
        21988,
        21978,
        21984,
        21986,
        21986,
        21986,
        22006,
        21960,
        21982,
        21980,
        21992,
        21986,
        21982,
        21982,
        21992,
        21980,
        21980,
        21990,
        21984,
        21980,
        21960,
        21980,
        21986,
        21980,
        21984,
        21986,
        21992,
        21980,
        21978,
        21980,
        21982,
        21960,
        21962,
        21964,
        21982,
        21982,
        21982,
        21984,
        49680,
        49936,
        49916,
        49908,
        49894,
        49892,
        49876,
        49852,
        49872,
        49850,
        49842,
        49856,
        49808,
        49824,
        49830,
        49818,
        49782,
        49784,
        49774,
        49808,
        49780,
        49782,
        49782,
        49778,
        49780,
        49764,
        49762,
        49762,
        49760,
        49764,
        49746,
        49750,
        49738,
        49744,
        49748,
        49718,
        49720,
        49744,
        49718,
        49714,
        49720,
        49716,
        49720,
        49712,
        49700,
        49714,
        49708,
        49700,
        49700,
        49686,
        49686,
        49688,
        49636,
        49622,
        49616,
        49618,
        49610,
        49618,
        49624,
        49620,
        60264,
        59754,
        59728,
        59724,
        59708,
        59712,
        59712,
        59708,
        59706,
        59704,
        59706,
        59688,
        59702,
        59706,
        59690,
        59718,
        59700,
        59686,
        59704,
        59706,
        59704,
        59702,
        59686,
        59708,
        59704,
        59706,
        59686,
        59684,
        59688,
        59696,
        59700,
        59692,
        59704,
        59704,
        59706,
        59692,
        59690,
        59688,
        59706,
        59690,
        59686,
        59692,
        59710,
        59706,
        59692,
        59686,
        59704,
        59704,
        59708,
        59688,
        59690,
        59706,
        59704,
        59690,
        59684,
        59684,
        59694,
        59708,
        59692,
        59688,
        44746,
        44258,
        44228,
        44228,
        44230,
        44212,
        44218,
        44212,
        44222,
        44210,
        44218,
        44214,
        44214,
        44226,
        44214,
        44214,
        44212,
        44210,
        44210,
        44216,
        44214,
        44210,
        44212,
        44210,
        44202,
        44210,
        44208,
        44210,
        44208,
        44194,
        44202,
        44216,
        44216,
        44218,
        44218,
        44212,
        44194,
        44196,
        44200,
        44196,
        44212,
        44212,
        44214,
        44208,
        44210,
        44210,
        44210,
        44192,
        44208,
        44210,
        44212,
        44210,
        44194,
        44210,
        44214,
        44206,
        44212,
        44200,
        44210,
        44212,
        51496,
        51644,
        51684,
        51684,
        51684,
        51684,
        51688,
        51682,
        51682,
        51682,
        51684,
        51684,
        51686,
        51682,
        51684,
        51688,
        51682,
        51684,
        51680,
        51680,
        51680,
        51704,
        51692,
        51682,
        51686,
        51690,
        51692,
        51684,
        51688,
        51684,
        51682,
        51686,
        51684,
        51660,
        51682,
        51682,
        51686,
        51662,
        51680,
        51674,
        51682,
        51684,
        51662,
        51684,
        51686,
        51682,
        51670,
        51658,
        51658,
        51674,
        51678,
        51680,
        51686,
        51684,
        51684,
        51676,
        51682,
        51680,
        51680,
        51658,
        51234,
        51492,
        51446,
        51434,
        51364,
        51362,
        51336,
        51316,
        51292,
        51272,
        51268,
        51234,
        51238,
        51186,
        51174,
        51168,
        51162,
        51138,
        51124,
        51110,
        51108,
        51078,
        51058,
        51044,
        51046,
        51046,
        51072,
        51066,
        50996,
        51000,
        50986,
        50978,
        50974,
        50938,
        50930,
        50940,
        50982,
        50978,
        50978,
        50980,
        50984,
        50938,
        50942,
        50932,
        50930,
        50934,
        50918,
        50922,
        50910,
        50888,
        50878,
        50886,
        50880,
        50868,
        50854,
        50850,
        50848,
        50818,
        50812,
        50844,
        55340,
        55336,
        55318,
        55312,
        55302,
        55292,
        55298,
        55260,
        55252,
        55256,
        55240,
        55236,
        55238,
        55202,
        55238,
        55210,
        55210,
        55206,
        55196,
        55192,
        55194,
        55174,
        55194,
        55194,
        55174,
        55176,
        55148,
        55156,
        55178,
        55146,
        55150,
        55146,
        55134,
        55146,
        55130,
        55124,
        55130,
        55112,
        55132,
        55124,
        55112,
        55116,
        55114,
        55112,
        55112,
        55110,
        55114,
        55092,
        55110,
        55092,
        55104,
        55082,
        55082,
        55080,
        55074,
        55080,
        55076,
        55070,
        55074,
        55074,
        59308,
        48952,
        48232,
        47970,
        47890,
        47786,
        47724,
        47728,
        47694,
        47692,
        47682,
        47728,
        47678,
        47706,
        47648,
        47672,
        47682,
        47624,
        47628,
        47626,
        47660,
        47616,
        47628,
        47618,
        47606,
        47618,
        47600,
        47554,
        47574,
        47644,
        47626,
        47568,
        47574,
        47612,
        47626,
        47596,
        47612,
        47566,
        47610,
        47568,
        47568,
        47564,
        47568,
        47564,
        47560,
        47544,
        47534,
        47562,
        47598,
        47546,
        47542,
        47540,
        47566,
        47584,
        47528,
        47558,
        47566,
        47552,
        47556,
        47542,
        54574,
        54818,
        54802,
        54808,
        54788,
        54782,
        54780,
        54782,
        54812,
        54754,
        54770,
        54778,
        54784,
        54784,
        54754,
        54724,
        54724,
        54716,
        54752,
        54742,
        54752,
        54712,
        54766,
        54752,
        54746,
        54752,
        54742,
        54744,
        54742,
        54742,
        54754,
        54748,
        54742,
        54808,
        54722,
        54708,
        54778,
        54752,
        54750,
        54716,
        54716,
        54722,
        54734,
        54750,
        54798,
        54758,
        54772,
        54756,
        54812,
        54772,
        54700,
        54712,
        54716,
        54742,
        54722,
        54718,
        54708,
        54778,
        54764,
        54644,
        42382,
        42468,
        42482,
        42446,
        42434,
        42442,
        42448,
        42456,
        42408,
        42416,
        42414,
        42432,
        42476,
        42400,
        42408,
        42396,
        42390,
        42386,
        42382,
        42372,
        42400,
        42388,
        42384,
        42390,
        42354,
        42368,
        42386,
        42360,
        42358,
        42352,
        42370,
        42362,
        42346,
        42388,
        42384,
        42388,
        42400,
        42370,
        42376,
        42376,
        42344,
        42370,
        42390,
        42376,
        42358,
        42358,
        42368,
        42336,
        42358,
        42358,
        42338,
        42356,
        42360,
        42366,
        42364,
        42332,
        42394,
        42334,
        42346,
        42330
      ]
    }
  ]
}
