{
  "title": "Planting Form - anon test",
  "controls": [
    {
      "name": "field_id",
      "label": {
        "0": "Enter the Field ID - must match the area name in the drop down menu EXACTLY"
      },
      "hint": { "0": "farmos-area;choose farmOS field" },
      "defaultValue": "",
      "readOnly": false,
      "required": true,
      "requiredText": {},
      "relevance": "",
      "constraint": "",
      "invalidText": {},
      "calculate": "",
      "length": false,
      "metadata": {},
      "type": "inputText"
    },
    {
      "name": "crop",
      "label": { "0": "Which crop are you filling this form out for?" },
      "hint": { "0": "You need to fill out a separate survey for each crop" },
      "defaultValue": "",
      "readOnly": false,
      "required": true,
      "requiredText": {},
      "relevance": "",
      "constraint": "",
      "invalidText": {},
      "calculate": "",
      "options": [
        { "text": { "0": "Carrot" }, "cascade": [], "val": "carrot" },
        { "text": { "0": "Spinach" }, "cascade": [], "val": "spinach" },
        { "text": { "0": "Kale" }, "cascade": [], "val": "kale" },
        { "text": { "0": "Lettuce" }, "cascade": [], "val": "lettuce" },
        {
          "text": { "0": "Cherry tomato" },
          "cascade": [],
          "val": "cherry_tomato"
        },
        { "text": { "0": "Grape" }, "cascade": [], "val": "grape" },
        { "text": { "0": "Other" }, "cascade": [], "val": "other" }
      ],
      "cascading": false,
      "other": false,
      "appearance": "Default",
      "metadata": {},
      "type": "inputSelectOne"
    },
    {
      "name": "other_crop",
      "label": { "0": "Please enter the crop planted" },
      "hint": { "0": "ontology;crops;pick crop" },
      "defaultValue": "",
      "readOnly": false,
      "required": false,
      "requiredText": {},
      "relevance": "(selected(/data/crop, 'other'))",
      "constraint": "",
      "invalidText": {},
      "calculate": "",
      "length": false,
      "metadata": {},
      "type": "inputText"
    },
    {
      "name": "grape_instructions",
      "label": {
        "0": "Fill out this form for the activities that you have completed for grapes THIS spring only. You only need to submit weekly management forms when you have done some management activity to your grapes."
      },
      "hint": {},
      "defaultValue": "",
      "readOnly": true,
      "required": false,
      "requiredText": {},
      "relevance": "(selected(/data/crop, 'grape'))",
      "constraint": "",
      "invalidText": {},
      "calculate": "",
      "length": false,
      "metadata": {},
      "type": "inputText"
    },
    {
      "name": "planting_date_grape",
      "label": { "0": "Month and Year that grapes were planted." },
      "hint": {},
      "defaultValue": "",
      "readOnly": false,
      "required": false,
      "requiredText": {},
      "relevance": "(selected(/data/crop, 'grape'))",
      "constraint": "",
      "invalidText": {},
      "calculate": "",
      "range": false,
      "kind": "Year and Month",
      "metadata": {},
      "type": "inputDate"
    },
    {
      "name": "submit_rfc",
      "label": {
        "0": "Will you submit samples from this planting to the RFC lab as part of the Farm Partners or NOFA programs?"
      },
      "hint": {},
      "defaultValue": "",
      "readOnly": false,
      "required": false,
      "requiredText": {},
      "relevance": "",
      "constraint": "",
      "invalidText": {},
      "calculate": "",
      "options": [
        { "text": { "0": "yes" }, "cascade": [], "val": "yes" },
        { "text": { "0": "no" }, "cascade": [], "val": "no" }
      ],
      "cascading": false,
      "other": false,
      "appearance": "Default",
      "metadata": {},
      "type": "inputSelectOne"
    },
    {
      "name": "general_management",
      "label": {
        "0": " Which best describes the general management for this field?"
      },
      "hint": {},
      "defaultValue": "",
      "readOnly": false,
      "required": true,
      "requiredText": {},
      "relevance": "",
      "constraint": "",
      "invalidText": {},
      "calculate": "",
      "options": [
        {
          "text": { "0": "Certified Organic" },
          "cascade": [],
          "val": "organic"
        },
        {
          "text": { "0": "Organic (not certified)" },
          "cascade": [],
          "val": "organic_not_certified"
        },
        { "text": { "0": "Biodynamic" }, "cascade": [], "val": "biodynamic" },
        {
          "text": { "0": "None of these options" },
          "cascade": [],
          "val": "other"
        }
      ],
      "cascading": false,
      "other": false,
      "appearance": "Default",
      "metadata": {},
      "type": "inputSelectOne"
    },
    {
      "name": "irrigation_source",
      "label": {
        "0": "If you irrigate, which best describes the water source used for irrigation?"
      },
      "hint": { "0": "Using a watering can counts as irrigation" },
      "defaultValue": "",
      "readOnly": false,
      "required": true,
      "requiredText": {},
      "relevance": "",
      "constraint": "",
      "invalidText": {},
      "calculate": "",
      "options": [
        {
          "text": { "0": "Chlorinated water source" },
          "cascade": [],
          "val": "chlorinated"
        },
        { "text": { "0": "Well water" }, "cascade": [], "val": "well" },
        { "text": { "0": "Surface water" }, "cascade": [], "val": "surface" },
        { "text": { "0": "I do not irrigate" }, "cascade": [], "val": "none" },
        { "text": { "0": "Other" }, "cascade": [], "val": "other" }
      ],
      "cascading": false,
      "other": false,
      "appearance": "Default",
      "metadata": {},
      "type": "inputSelectOne"
    },
    {
      "name": "land_prep_method",
      "label": {
        "0": "For this crop, how did you prepare your field/seed bed for planting?"
      },
      "hint": { "0": "" },
      "defaultValue": "",
      "readOnly": false,
      "required": true,
      "requiredText": {},
      "relevance": "",
      "constraint": "",
      "invalidText": {},
      "calculate": "",
      "options": [
        { "text": { "0": "Tillage" }, "cascade": [], "val": "tillage" },
        {
          "text": { "0": "Sheet mulching" },
          "cascade": [],
          "val": "sheet_mulching"
        },
        {
          "text": { "0": "Solarization/Occultation" },
          "cascade": [],
          "val": "solarization"
        },
        {
          "text": { "0": "Broadforking" },
          "cascade": [],
          "val": "broadforking"
        },
        {
          "text": { "0": "No-till with chemical weed control" },
          "cascade": [],
          "val": "notill_chem"
        },
        { "text": { "0": "Other" }, "cascade": [], "val": "other" },
        {
          "text": { "0": "None - for perrenial crops" },
          "cascade": [],
          "val": "none"
        }
      ],
      "cascading": false,
      "other": false,
      "appearance": "Default",
      "metadata": {},
      "type": "inputSelectOne"
    },
    {
      "name": "herbicide_name",
      "label": { "0": "Name of herbicide applied" },
      "hint": {
        "0": "If multiple herbicides were used, use comma to seperate different herbicides"
      },
      "defaultValue": "",
      "readOnly": false,
      "required": false,
      "requiredText": {},
      "relevance": "(selected(/data/land_prep_method, 'notill_chem'))",
      "constraint": "",
      "invalidText": {},
      "calculate": "",
      "length": false,
      "metadata": {},
      "type": "inputText"
    },
    {
      "name": "herbicide_rate",
      "label": { "0": "Application rate (gallons/acre)" },
      "hint": {},
      "defaultValue": "",
      "readOnly": false,
      "required": false,
      "requiredText": {},
      "relevance": "(selected(/data/land_prep_method, 'notill_chem'))",
      "constraint": "",
      "invalidText": {},
      "calculate": "",
      "range": false,
      "appearance": "Textbox",
      "kind": "Decimal",
      "selectRange": { "min": "1", "max": "10" },
      "selectStep": "1",
      "sliderTicks": true,
      "metadata": {},
      "type": "inputNumeric"
    },
    {
      "name": "land_prep_other",
      "label": { "0": "Please describe method of land preparation" },
      "hint": {},
      "defaultValue": "",
      "readOnly": false,
      "required": false,
      "requiredText": {},
      "relevance": "(selected(/data/land_prep_method, 'other'))",
      "constraint": "",
      "invalidText": {},
      "calculate": "",
      "length": false,
      "metadata": {},
      "type": "inputText"
    },
    {
      "name": "tillage",
      "label": { "0": "TILLAGE" },
      "loop": false,
      "fieldList": false,
      "relevance": "(selected(/data/land_prep_method, 'tillage'))",
      "metadata": {},
      "type": "group",
      "children": [
        {
          "name": "type_1",
          "label": {
            "0": "1st tillage operation: Choose a tillage operation."
          },
          "hint": { "0": "ontology;tillage;begin typing to refine list" },
          "defaultValue": "",
          "readOnly": false,
          "required": false,
          "requiredText": {},
          "relevance": "",
          "constraint": "",
          "invalidText": {},
          "calculate": "",
          "length": false,
          "metadata": {},
          "type": "inputText"
        },
        {
          "name": "date_1",
          "label": { "0": "Estimated date of tillage" },
          "hint": {},
          "defaultValue": "",
          "readOnly": false,
          "required": false,
          "requiredText": {},
          "relevance": "",
          "constraint": "",
          "invalidText": {},
          "calculate": "",
          "range": false,
          "kind": "Full Date",
          "metadata": {},
          "type": "inputDate"
        },
        {
          "name": "depth_1",
          "label": { "0": "Depth of tillage" },
          "hint": { "0": "in inches" },
          "defaultValue": "",
          "readOnly": false,
          "required": false,
          "requiredText": {},
          "relevance": "",
          "constraint": "",
          "invalidText": {},
          "calculate": "",
          "range": false,
          "appearance": "Textbox",
          "kind": "Integer",
          "selectRange": { "min": "1", "max": "10" },
          "selectStep": "1",
          "sliderTicks": true,
          "metadata": {},
          "type": "inputNumeric"
        },
        {
          "name": "tillage_2",
          "label": { "0": "Did you perform a 2nd tillage?" },
          "hint": {},
          "defaultValue": "",
          "readOnly": false,
          "required": false,
          "requiredText": {},
          "relevance": "",
          "constraint": "",
          "invalidText": {},
          "calculate": "",
          "options": [
            { "text": { "0": "Yes" }, "cascade": [], "val": "Yes" },
            { "text": { "0": "No" }, "cascade": [], "val": "No" }
          ],
          "cascading": false,
          "other": false,
          "appearance": "Default",
          "metadata": {},
          "type": "inputSelectOne"
        },
        {
          "name": "type_2",
          "label": { "0": "2nd tillage operation: Choose a tillage" },
          "hint": { "0": "ontology;tillage;begin typing to refine list" },
          "defaultValue": "",
          "readOnly": false,
          "required": false,
          "requiredText": {},
          "relevance": "(selected(/data/tillage/tillage_2, 'Yes'))",
          "constraint": "",
          "invalidText": {},
          "calculate": "",
          "length": false,
          "metadata": {},
          "type": "inputText"
        },
        {
          "name": "date_2",
          "label": { "0": "Estimated date of 2nd tillage" },
          "hint": {},
          "defaultValue": "",
          "readOnly": false,
          "required": false,
          "requiredText": {},
          "relevance": "(selected(/data/tillage/tillage_2, 'Yes'))",
          "constraint": "",
          "invalidText": {},
          "calculate": "",
          "range": false,
          "kind": "Full Date",
          "metadata": {},
          "type": "inputDate"
        },
        {
          "name": "depth_2",
          "label": { "0": "Depth of 2nd tillage" },
          "hint": { "0": "in inches" },
          "defaultValue": "",
          "readOnly": false,
          "required": false,
          "requiredText": {},
          "relevance": "(selected(/data/tillage/tillage_2, 'Yes'))",
          "constraint": "",
          "invalidText": {},
          "calculate": "",
          "range": false,
          "appearance": "Textbox",
          "kind": "Integer",
          "selectRange": { "min": "1", "max": "10" },
          "selectStep": "1",
          "sliderTicks": true,
          "metadata": {},
          "type": "inputNumeric"
        },
        {
          "name": "tillage_3",
          "label": { "0": "Did you perform a 3rd tillage?" },
          "hint": {},
          "defaultValue": "",
          "readOnly": false,
          "required": false,
          "requiredText": {},
          "relevance": "(selected(/data/tillage/tillage_2, 'Yes'))",
          "constraint": "",
          "invalidText": {},
          "calculate": "",
          "options": [
            { "text": { "0": "Yes" }, "cascade": [], "val": "Yes" },
            { "text": { "0": "No" }, "cascade": [], "val": "No" }
          ],
          "cascading": false,
          "other": false,
          "appearance": "Default",
          "metadata": {},
          "type": "inputSelectOne"
        },
        {
          "name": "type_3",
          "label": { "0": "3rd tillage operation: Choose a tillage" },
          "hint": { "0": "ontology;tillage;begin typing to refine list" },
          "defaultValue": "",
          "readOnly": false,
          "required": false,
          "requiredText": {},
          "relevance": "(selected(/data/tillage/tillage_3, 'Yes'))",
          "constraint": "",
          "invalidText": {},
          "calculate": "",
          "length": false,
          "metadata": {},
          "type": "inputText"
        },
        {
          "name": "date_3",
          "label": { "0": "Estimated date of 3rd tillage" },
          "hint": {},
          "defaultValue": "",
          "readOnly": false,
          "required": false,
          "requiredText": {},
          "relevance": "(selected(/data/tillage/tillage_3, 'Yes'))",
          "constraint": "",
          "invalidText": {},
          "calculate": "",
          "range": false,
          "kind": "Full Date",
          "metadata": {},
          "type": "inputDate"
        },
        {
          "name": "depth_3",
          "label": { "0": "Depth of 3rd tillage" },
          "hint": { "0": "in inches" },
          "defaultValue": "",
          "readOnly": false,
          "required": false,
          "requiredText": {},
          "relevance": "(selected(/data/tillage/tillage_3, 'Yes'))",
          "constraint": "",
          "invalidText": {},
          "calculate": "",
          "range": false,
          "appearance": "Textbox",
          "kind": "Integer",
          "selectRange": { "min": "1", "max": "10" },
          "selectStep": "1",
          "sliderTicks": true,
          "metadata": {},
          "type": "inputNumeric"
        }
      ]
    },
    {
      "name": "mulch_question",
      "label": { "0": "Did you use mulch in this field?" },
      "hint": {
        "0": "This only includes sheet mulch IF most of the mulch remained on the field at/after planting"
      },
      "defaultValue": "",
      "readOnly": false,
      "required": true,
      "requiredText": {},
      "relevance": "",
      "constraint": "",
      "invalidText": {},
      "calculate": "",
      "options": [
        { "text": { "0": "Yes" }, "cascade": [], "val": "Yes" },
        { "text": { "0": "No" }, "cascade": [], "val": "No" }
      ],
      "cascading": false,
      "other": false,
      "appearance": "Default",
      "metadata": {},
      "type": "inputSelectOne"
    },
    {
      "name": "mulch",
      "label": { "0": "MULCH" },
      "loop": false,
      "fieldList": false,
      "relevance": "(selected(/data/mulch_question, 'Yes'))",
      "metadata": {},
      "type": "group",
      "children": [
        {
          "name": "mulch_type_1",
          "label": { "0": "What type of mulch was added?" },
          "hint": {},
          "defaultValue": "",
          "readOnly": false,
          "required": false,
          "requiredText": {},
          "relevance": "",
          "constraint": "",
          "invalidText": {},
          "calculate": "",
          "options": [
            { "val": "plastic", "cascade": [], "text": { "0": "Plastic" } },
            {
              "val": "wood_chips",
              "cascade": [],
              "text": { "0": "Wood chips" }
            },
            { "val": "straw_hay", "cascade": [], "text": { "0": "Straw/Hay" } },
            {
              "val": "leaves",
              "cascade": [],
              "text": { "0": "Leaves/leaf litter" }
            },
            { "val": "cardboard", "cascade": [], "text": { "0": "Cardboard" } },
            { "val": "other", "cascade": [], "text": { "0": "Other" } }
          ],
          "cascading": false,
          "other": false,
          "appearance": "Default",
          "metadata": {},
          "type": "inputSelectOne"
        },
        {
          "name": "mulch_other_1",
          "label": { "0": "Describe the mulch that was used" },
          "hint": {},
          "defaultValue": "",
          "readOnly": false,
          "required": false,
          "requiredText": {},
          "relevance": "(selected(/data/mulch/mulch_type_1, 'other'))",
          "constraint": "",
          "invalidText": {},
          "calculate": "",
          "length": false,
          "metadata": {},
          "type": "inputText"
        },
        {
          "name": "mulch_depth_1",
          "label": { "0": "If applicable, amount of mulch added?" },
          "hint": { "0": "in inches" },
          "defaultValue": "",
          "readOnly": false,
          "required": false,
          "requiredText": {},
          "relevance": "",
          "constraint": "",
          "invalidText": {},
          "calculate": "",
          "range": false,
          "appearance": "Textbox",
          "kind": "Integer",
          "selectRange": { "min": "1", "max": "10" },
          "selectStep": "1",
          "sliderTicks": true,
          "metadata": {},
          "type": "inputNumeric"
        },
        {
          "name": "mulch_date_1",
          "label": { "0": "Estimated date that mulch was added" },
          "hint": {},
          "defaultValue": "",
          "readOnly": false,
          "required": false,
          "requiredText": {},
          "relevance": "",
          "constraint": "",
          "invalidText": {},
          "calculate": "",
          "range": false,
          "kind": "Full Date",
          "metadata": {},
          "type": "inputDate"
        },
        {
          "name": "mulch_2",
          "label": { "0": "Did you add a 2nd type of mulch?" },
          "hint": {},
          "defaultValue": "",
          "readOnly": false,
          "required": false,
          "requiredText": {},
          "relevance": "",
          "constraint": "",
          "invalidText": {},
          "calculate": "",
          "options": [
            { "text": { "0": "Yes" }, "cascade": [], "val": "yes" },
            { "text": { "0": "No" }, "cascade": [], "val": "no" }
          ],
          "cascading": false,
          "other": false,
          "appearance": "Default",
          "metadata": {},
          "type": "inputSelectOne"
        },
        {
          "name": "mulch_type_2",
          "label": { "0": "What type of mulch was added?" },
          "hint": {},
          "defaultValue": "",
          "readOnly": false,
          "required": false,
          "requiredText": {},
          "relevance": "(selected(/data/mulch/mulch_2, 'yes'))",
          "constraint": "",
          "invalidText": {},
          "calculate": "",
          "options": [
            { "val": "plastic", "cascade": [], "text": { "0": "Plastic" } },
            {
              "val": "wood_chips",
              "cascade": [],
              "text": { "0": "Wood chips" }
            },
            { "val": "straw_hay", "cascade": [], "text": { "0": "Straw/Hay" } },
            {
              "val": "leaves",
              "cascade": [],
              "text": { "0": "Leaves/leaf litter" }
            },
            { "val": "cardboard", "cascade": [], "text": { "0": "Cardboard" } },
            { "val": "other", "cascade": [], "text": { "0": "Other" } }
          ],
          "cascading": false,
          "other": false,
          "appearance": "Default",
          "metadata": {},
          "type": "inputSelectOne"
        },
        {
          "name": "mulch_other_2",
          "label": { "0": "Describe the mulch that was used" },
          "hint": {},
          "defaultValue": "",
          "readOnly": false,
          "required": false,
          "requiredText": {},
          "relevance": "(selected(/data/mulch/mulch_type_2, 'other'))",
          "constraint": "",
          "invalidText": {},
          "calculate": "",
          "length": false,
          "metadata": {},
          "type": "inputText"
        },
        {
          "name": "mulch_depth_2",
          "label": { "0": "If applicable, amount of mulch added?" },
          "hint": { "0": "in inches" },
          "defaultValue": "",
          "readOnly": false,
          "required": false,
          "requiredText": {},
          "relevance": "(selected(/data/mulch/mulch_2, 'yes'))",
          "constraint": "",
          "invalidText": {},
          "calculate": "",
          "range": false,
          "appearance": "Textbox",
          "kind": "Integer",
          "selectRange": { "min": "1", "max": "10" },
          "selectStep": "1",
          "sliderTicks": true,
          "metadata": {},
          "type": "inputNumeric"
        },
        {
          "name": "mulch_date_2",
          "label": { "0": "Estimated date that mulch was added" },
          "hint": {},
          "defaultValue": "",
          "readOnly": false,
          "required": false,
          "requiredText": {},
          "relevance": "(selected(/data/mulch/mulch_2, 'yes'))",
          "constraint": "",
          "invalidText": {},
          "calculate": "",
          "range": false,
          "kind": "Full Date",
          "metadata": {},
          "type": "inputDate"
        }
      ]
    },
    {
      "name": "planting_date",
      "label": {
        "0": "Date that the crop was planted OR transplanted into the field"
      },
      "hint": {},
      "defaultValue": "",
      "readOnly": false,
      "required": false,
      "requiredText": {},
      "relevance": "not(selected(/data/crop, 'grape'))",
      "constraint": "",
      "invalidText": {},
      "calculate": "",
      "range": false,
      "kind": "Full Date",
      "metadata": {},
      "type": "inputDate"
    },
    {
      "name": "transplanting_question",
      "label": { "0": "Did you transplant this crop?" },
      "hint": {},
      "defaultValue": "",
      "readOnly": false,
      "required": false,
      "requiredText": {},
      "relevance": "not(selected(/data/crop, 'grape'))",
      "constraint": "",
      "invalidText": {},
      "calculate": "",
      "options": [
        { "text": { "0": "Yes" }, "cascade": [], "val": "Yes" },
        { "text": { "0": "No" }, "cascade": [], "val": "No" }
      ],
      "cascading": false,
      "other": false,
      "appearance": "Default",
      "metadata": {},
      "type": "inputSelectOne"
    },
    {
      "name": "transplanting",
      "label": { "0": "TRANSPLANTING" },
      "loop": false,
      "fieldList": false,
      "relevance": "(selected(/data/transplanting_question, 'Yes'))",
      "metadata": {},
      "type": "group",
      "children": [
        {
          "name": "potting_soil_days",
          "label": {
            "0": "How many days was the crop was in potting soil prior to planting in the field?"
          },
          "hint": {},
          "defaultValue": "",
          "readOnly": false,
          "required": false,
          "requiredText": {},
          "relevance": "",
          "constraint": "",
          "invalidText": {},
          "calculate": "",
          "range": false,
          "appearance": "Textbox",
          "kind": "Integer",
          "selectRange": { "min": "1", "max": "10" },
          "selectStep": "1",
          "sliderTicks": true,
          "metadata": {},
          "type": "inputNumeric"
        },
        {
          "name": "potting_soil_brand",
          "label": { "0": "Brand/source of potting soil used" },
          "hint": {},
          "defaultValue": "",
          "readOnly": false,
          "required": false,
          "requiredText": {},
          "relevance": "",
          "constraint": "",
          "invalidText": {},
          "calculate": "",
          "length": false,
          "metadata": {},
          "type": "inputText"
        },
        {
          "name": "seedling_tray_type",
          "label": { "0": "Type of seedling tray" },
          "hint": {},
          "defaultValue": "",
          "readOnly": false,
          "required": false,
          "requiredText": {},
          "relevance": "",
          "constraint": "",
          "invalidText": {},
          "calculate": "",
          "options": [
            { "text": { "0": "Open Tray" }, "cascade": [], "val": "open" },
            { "text": { "0": "Cell tray" }, "cascade": [], "val": "cell" },
            {
              "text": { "0": "Paper pot transplanting" },
              "cascade": [],
              "val": "paper_pot"
            },
            {
              "text": { "0": "Soil blocks" },
              "cascade": [],
              "val": "soil_blocks"
            }
          ],
          "cascading": false,
          "other": false,
          "appearance": "Default",
          "metadata": {},
          "type": "inputSelectOne"
        },
        {
          "name": "cell_number",
          "label": { "0": "How many cells/tray?" },
          "hint": {},
          "defaultValue": "",
          "readOnly": false,
          "required": false,
          "requiredText": {},
          "relevance": "(selected(/data/transplanting/seedling_tray_type, 'cell'))",
          "constraint": "",
          "invalidText": {},
          "calculate": "",
          "range": false,
          "appearance": "Textbox",
          "kind": "Integer",
          "selectRange": { "min": "1", "max": "10" },
          "selectStep": "1",
          "sliderTicks": true,
          "metadata": {},
          "type": "inputNumeric"
        },
        {
          "name": "lighting",
          "label": { "0": "Were seedlings propagated in artificial lighting?" },
          "hint": { "0": "" },
          "defaultValue": "",
          "readOnly": false,
          "required": false,
          "requiredText": {},
          "relevance": "",
          "constraint": "",
          "invalidText": {},
          "calculate": "",
          "options": [
            { "text": { "0": "yes" }, "cascade": [], "val": "yes" },
            {
              "text": { "0": "for some of the time" },
              "cascade": [],
              "val": "some"
            },
            { "text": { "0": "no" }, "cascade": [], "val": "no" }
          ],
          "cascading": false,
          "other": false,
          "appearance": "Default",
          "metadata": {},
          "type": "inputSelectOne"
        },
        {
          "name": "climate",
          "label": {
            "0": "Were seedlings propagated in a climate controlled space?"
          },
          "hint": { "0": "" },
          "defaultValue": "",
          "readOnly": false,
          "required": false,
          "requiredText": {},
          "relevance": "",
          "constraint": "",
          "invalidText": {},
          "calculate": "",
          "options": [
            { "text": { "0": "yes" }, "cascade": [], "val": "yes" },
            {
              "text": { "0": "for some of the time" },
              "cascade": [],
              "val": "some"
            },
            { "text": { "0": "no" }, "cascade": [], "val": "no" }
          ],
          "cascading": false,
          "other": false,
          "appearance": "Default",
          "metadata": {},
          "type": "inputSelectOne"
        },
        {
          "name": "seedling_treatment",
          "label": {
            "0": "Treatments applied to the seedlings while in trays"
          },
          "hint": { "0": "Check any that apply" },
          "defaultValue": "",
          "readOnly": false,
          "required": false,
          "requiredText": {},
          "relevance": "",
          "constraint": "",
          "invalidText": {},
          "calculate": "",
          "options": [
            { "text": { "0": "Inoculum" }, "val": "inoculum" },
            {
              "text": { "0": "Foliar spray" },
              "cascade": [],
              "val": "foliar_spray"
            },
            { "text": { "0": "Drench" }, "cascade": [], "val": "drench" },
            { "text": { "0": "Kelp" }, "cascade": [], "val": "kelp" },
            { "text": { "0": "Other" }, "cascade": [], "val": "other" },
            { "text": { "0": "None" }, "cascade": [], "val": "none" }
          ],
          "other": false,
          "count": false,
          "appearance": "Default",
          "metadata": {},
          "type": "inputSelectMany"
        },
        {
          "name": "seedling_treatment_other",
          "label": { "0": "If other, enter the treatment here" },
          "hint": {},
          "defaultValue": "",
          "readOnly": false,
          "required": false,
          "requiredText": {},
          "relevance": "(selected(/data/transplanting/seedling_treatment, 'other'))",
          "constraint": "",
          "invalidText": { "0": "" },
          "calculate": "",
          "length": false,
          "metadata": {},
          "type": "inputText"
        },
        {
          "name": "seedling_treatment_date",
          "label": { "0": "Date of seedling treatment" },
          "hint": {},
          "defaultValue": "",
          "readOnly": false,
          "required": false,
          "requiredText": {},
          "relevance": "not(selected(/data/transplanting/seedling_treatment, 'none'))",
          "constraint": "",
          "invalidText": {},
          "calculate": "",
          "range": false,
          "kind": "Full Date",
          "metadata": {},
          "type": "inputDate"
        },
        {
          "name": "seedling_treatment_name",
          "label": { "0": "Brand/source of seedling treatment" },
          "hint": {},
          "defaultValue": "",
          "readOnly": false,
          "required": false,
          "requiredText": {},
          "relevance": "not(selected(/data/transplanting/seedling_treatment, 'none'))",
          "constraint": "",
          "invalidText": {},
          "calculate": "",
          "length": false,
          "metadata": {},
          "type": "inputText"
        }
      ]
    },
    {
      "name": "lime_question",
      "label": {
        "0": "Did you add lime before, at, or immediately after planting?"
      },
      "hint": { "0": "" },
      "defaultValue": "",
      "readOnly": false,
      "required": true,
      "requiredText": {},
      "relevance": "",
      "constraint": "",
      "invalidText": {},
      "calculate": "",
      "options": [
        { "text": { "0": "Yes" }, "cascade": [], "val": "Yes" },
        { "text": { "0": "No" }, "cascade": [], "val": "No" }
      ],
      "cascading": false,
      "other": false,
      "appearance": "Default",
      "metadata": {},
      "type": "inputSelectOne"
    },
    {
      "name": "lime",
      "label": { "0": "LIME/LIMESTONE" },
      "loop": false,
      "fieldList": false,
      "relevance": "(selected(/data/lime_question, 'Yes'))",
      "metadata": {},
      "type": "group",
      "children": [
        {
          "name": "rate",
          "label": { "0": "How much lime/limestone was applied?" },
          "hint": { "0": "lbs/acre" },
          "defaultValue": "",
          "readOnly": false,
          "required": false,
          "requiredText": {},
          "relevance": "",
          "constraint": "",
          "invalidText": {},
          "calculate": "",
          "range": false,
          "appearance": "Textbox",
          "kind": "Integer",
          "selectRange": { "min": "1", "max": "10" },
          "selectStep": "1",
          "sliderTicks": true,
          "metadata": {},
          "type": "inputNumeric"
        },
        {
          "name": "lime_date",
          "label": { "0": "Date of lime/limestone application" },
          "hint": {},
          "defaultValue": "",
          "readOnly": false,
          "required": false,
          "requiredText": {},
          "relevance": "",
          "constraint": "",
          "invalidText": {},
          "calculate": "",
          "range": false,
          "kind": "Full Date",
          "metadata": {},
          "type": "inputDate"
        }
      ]
    },
    {
      "name": "amendments_question",
      "label": {
        "0": "Did you add amendments or fertilizer to the participating crop?"
      },
      "hint": { "0": "Either before, at, or immediately following planting" },
      "defaultValue": "",
      "readOnly": false,
      "required": true,
      "requiredText": {},
      "relevance": "",
      "constraint": "",
      "invalidText": {},
      "calculate": "",
      "options": [
        { "text": { "0": "Yes" }, "cascade": [], "val": "Yes" },
        { "text": { "0": "No" }, "cascade": [], "val": "No" }
      ],
      "cascading": false,
      "other": false,
      "appearance": "Default",
      "metadata": {},
      "type": "inputSelectOne"
    },
    {
      "name": "amendments",
      "label": { "0": "AMENDMENT/FERTILIZER" },
      "loop": false,
      "fieldList": false,
      "relevance": "(selected(/data/amendments_question, 'Yes'))",
      "metadata": {},
      "type": "group",
      "children": [
        {
          "name": "amendment_type_1",
          "label": {
            "0": "Which of the following best describes the type of the 1st amendment added?"
          },
          "hint": {},
          "defaultValue": "",
          "readOnly": false,
          "required": false,
          "requiredText": {},
          "relevance": "",
          "constraint": "",
          "invalidText": {},
          "calculate": "",
          "options": [
            { "val": "compost", "cascade": [], "text": { "0": "Compost" } },
            {
              "val": "compost_tea",
              "cascade": [],
              "text": { "0": "Compost tea" }
            },
            { "val": "inoculant", "cascade": [], "text": { "0": "Inoculant" } },
            {
              "val": "foliar_sprays",
              "cascade": [],
              "text": { "0": "Foliar spray" }
            },
            {
              "val": "org_fertilizer",
              "cascade": [],
              "text": { "0": "Organic fertilizer" }
            },
            {
              "val": "synth_fertilizer",
              "cascade": [],
              "text": { "0": "Synthetic fertilizer" }
            },
            {
              "val": "biostimulants",
              "cascade": [],
              "text": { "0": "Biostimulants" }
            },
            { "val": "other", "cascade": [], "text": { "0": "Other" } }
          ],
          "cascading": false,
          "other": false,
          "appearance": "Default",
          "metadata": {},
          "type": "inputSelectOne"
        },
        {
          "name": "name_1",
          "label": { "0": "Name/Brand/Source of amendment/fertilizer" },
          "hint": { "0": "" },
          "defaultValue": "",
          "readOnly": false,
          "required": false,
          "requiredText": {},
          "relevance": "",
          "constraint": "",
          "invalidText": {},
          "calculate": "",
          "length": false,
          "metadata": {},
          "type": "inputText"
        },
        {
          "name": "amendment_date_1",
          "label": { "0": "Date applied" },
          "hint": {},
          "defaultValue": "",
          "readOnly": false,
          "required": false,
          "requiredText": {},
          "relevance": "",
          "constraint": "",
          "invalidText": {},
          "calculate": "",
          "range": false,
          "kind": "Full Date",
          "metadata": {},
          "type": "inputDate"
        },
        {
          "name": "method_1",
          "label": { "0": "Method of application" },
          "hint": {},
          "defaultValue": "",
          "readOnly": false,
          "required": false,
          "requiredText": {},
          "relevance": "",
          "constraint": "",
          "invalidText": {},
          "calculate": "",
          "options": [
            {
              "val": "broadcast_surface",
              "cascade": [],
              "text": { "0": "Broadcast - Surface" }
            },
            {
              "val": "broadcast_incorporated",
              "cascade": [],
              "text": { "0": "Broadcast - Incorporated" }
            },
            { "val": "banded", "cascade": [], "text": { "0": "Banded" } },
            { "val": "topdress", "cascade": [], "text": { "0": "Topdress" } },
            { "val": "sidedress", "cascade": [], "text": { "0": "Sidedress" } },
            {
              "val": "seed_placement",
              "cascade": [],
              "text": { "0": "Seed Placement" }
            },
            { "val": "foliar", "cascade": [], "text": { "0": "Foliar" } },
            { "val": "injection", "cascade": [], "text": { "0": "Injection" } },
            {
              "val": "fertigation",
              "cascade": [],
              "text": { "0": "Fertigation" }
            }
          ],
          "cascading": false,
          "other": false,
          "appearance": "Default",
          "metadata": {},
          "type": "inputSelectOne"
        },
        {
          "name": "nutrients_1",
          "label": {
            "0": "Which nutrients did you apply with this amendment/fertilizer?"
          },
          "hint": { "0": "Select all that apply" },
          "defaultValue": "",
          "readOnly": false,
          "required": false,
          "requiredText": {},
          "relevance": "",
          "constraint": "",
          "invalidText": {},
          "calculate": "",
          "options": [
            { "val": "unknown", "cascade": [], "text": { "0": "Not known" } },
            { "val": "N", "cascade": [], "text": { "0": "N" } },
            { "val": "P", "cascade": [], "text": { "0": "P" } },
            { "val": "K", "cascade": [], "text": { "0": "K" } },
            {
              "val": "Ca",
              "cascade": [],
              "text": { "0": "Ca (not limestone/lime)" }
            },
            {
              "val": "Mg",
              "cascade": [],
              "text": { "0": "Mg (not limestone/lime)" }
            },
            { "val": "B", "cascade": [], "text": { "0": "B" } },
            { "val": "Cu", "cascade": [], "text": { "0": "Cu" } },
            { "val": "Mn", "cascade": [], "text": { "0": "Mn" } },
            { "val": "Zn", "cascade": [], "text": { "0": "Zn" } },
            { "val": "other", "cascade": [], "text": { "0": "Other" } }
          ],
          "other": false,
          "count": false,
          "appearance": "Default",
          "metadata": {},
          "type": "inputSelectMany"
        },
        {
          "name": "n_1",
          "label": { "0": "N (lbs per acre)" },
          "hint": { "0": "" },
          "defaultValue": "",
          "readOnly": false,
          "required": false,
          "requiredText": {},
          "relevance": "(selected(/data/amendments/nutrients_1, 'N'))",
          "constraint": "",
          "invalidText": {},
          "calculate": "",
          "range": false,
          "appearance": "Textbox",
          "kind": "Integer",
          "selectRange": { "min": "1", "max": "10" },
          "selectStep": "1",
          "sliderTicks": true,
          "metadata": {},
          "type": "inputNumeric"
        },
        {
          "name": "p_1",
          "label": { "0": "P (lbs per acre)" },
          "hint": { "0": "" },
          "defaultValue": "",
          "readOnly": false,
          "required": false,
          "requiredText": {},
          "relevance": "(selected(/data/amendments/nutrients_1, 'P'))",
          "constraint": "",
          "invalidText": {},
          "calculate": "",
          "range": false,
          "appearance": "Textbox",
          "kind": "Integer",
          "selectRange": { "min": "1", "max": "10" },
          "selectStep": "1",
          "sliderTicks": true,
          "metadata": {},
          "type": "inputNumeric"
        },
        {
          "name": "k_1",
          "label": { "0": "K (lbs per acre)" },
          "hint": { "0": "" },
          "defaultValue": "",
          "readOnly": false,
          "required": false,
          "requiredText": {},
          "relevance": "(selected(/data/amendments/nutrients_1, 'K'))",
          "constraint": "",
          "invalidText": {},
          "calculate": "",
          "range": false,
          "appearance": "Textbox",
          "kind": "Integer",
          "selectRange": { "min": "1", "max": "10" },
          "selectStep": "1",
          "sliderTicks": true,
          "metadata": {},
          "type": "inputNumeric"
        },
        {
          "name": "nutrients_trace_1",
          "label": { "0": "Other trace minerals added" },
          "hint": { "0": "Use a comma to separate different trace minerals" },
          "defaultValue": "",
          "readOnly": false,
          "required": false,
          "requiredText": {},
          "relevance": "(selected(/data/amendments/nutrients_1, 'other'))",
          "constraint": "",
          "invalidText": {},
          "calculate": "",
          "length": false,
          "metadata": {},
          "type": "inputText"
        },
        {
          "name": "amendment_2",
          "label": { "0": "Did you add a 2nd amendment/fertilizer?" },
          "hint": { "0": "" },
          "defaultValue": "",
          "readOnly": false,
          "required": false,
          "requiredText": {},
          "relevance": "",
          "constraint": "",
          "invalidText": {},
          "calculate": "",
          "options": [
            { "text": { "0": "Yes" }, "cascade": [], "val": "Yes" },
            { "text": { "0": "No" }, "cascade": [], "val": "No" }
          ],
          "cascading": false,
          "other": false,
          "appearance": "Default",
          "metadata": {},
          "type": "inputSelectOne"
        },
        {
          "name": "amendment_type_2",
          "label": {
            "0": "Which of the following best describes the type of the 2nd amendment added?"
          },
          "hint": {},
          "defaultValue": "",
          "readOnly": false,
          "required": false,
          "requiredText": {},
          "relevance": "(selected(/data/amendments/amendment_2, 'Yes'))",
          "constraint": "",
          "invalidText": {},
          "calculate": "",
          "options": [
            { "val": "compost", "cascade": [], "text": { "0": "Compost" } },
            {
              "val": "compost_tea",
              "cascade": [],
              "text": { "0": "Compost tea" }
            },
            { "val": "inoculant", "cascade": [], "text": { "0": "Inoculant" } },
            {
              "val": "foliar_spray",
              "cascade": [],
              "text": { "0": "Foliar spray" }
            },
            {
              "val": "organic_fertilizer",
              "cascade": [],
              "text": { "0": "Organic fertilizer" }
            },
            {
              "val": "synthetic_fertilizer",
              "cascade": [],
              "text": { "0": "Synthetic fertilizer" }
            },
            {
              "val": "biostimulants",
              "cascade": [],
              "text": { "0": "Biostimulants" }
            },
            { "val": "other", "cascade": [], "text": { "0": "Other" } }
          ],
          "cascading": false,
          "other": false,
          "appearance": "Default",
          "metadata": {},
          "type": "inputSelectOne"
        },
        {
          "name": "name_2",
          "label": { "0": "Name/Brand/Source of 2nd amendment/fertilizer" },
          "hint": {},
          "defaultValue": "",
          "readOnly": false,
          "required": false,
          "requiredText": {},
          "relevance": "(selected(/data/amendments/amendment_2, 'Yes'))",
          "constraint": "",
          "invalidText": {},
          "calculate": "",
          "length": false,
          "metadata": {},
          "type": "inputText"
        },
        {
          "name": "amendment_date_2",
          "label": { "0": "Date applied" },
          "hint": {},
          "defaultValue": "",
          "readOnly": false,
          "required": false,
          "requiredText": {},
          "relevance": "(selected(/data/amendments/amendment_2, 'Yes'))",
          "constraint": "",
          "invalidText": {},
          "calculate": "",
          "range": false,
          "kind": "Full Date",
          "metadata": {},
          "type": "inputDate"
        },
        {
          "name": "method_2",
          "label": { "0": "Method of application" },
          "hint": {},
          "defaultValue": "",
          "readOnly": false,
          "required": false,
          "requiredText": {},
          "relevance": "(selected(/data/amendments/amendment_2, 'Yes'))",
          "constraint": "",
          "invalidText": {},
          "calculate": "",
          "options": [
            {
              "val": "Broadcast_Surface",
              "cascade": [],
              "text": { "0": "Broadcast - Surface" }
            },
            {
              "val": "Broadcast_Incorporated",
              "cascade": [],
              "text": { "0": "Broadcast - Incorporated" }
            },
            { "val": "Banded", "cascade": [], "text": { "0": "Banded" } },
            { "val": "Topdress", "cascade": [], "text": { "0": "Topdress" } },
            { "val": "Sidedress", "cascade": [], "text": { "0": "Sidedress" } },
            {
              "val": "Seed_Placement",
              "cascade": [],
              "text": { "0": "Seed Placement" }
            },
            { "val": "Foliar", "cascade": [], "text": { "0": "Foliar" } },
            { "val": "Injection", "cascade": [], "text": { "0": "Injection" } },
            {
              "val": "Fertigation",
              "cascade": [],
              "text": { "0": "Fertigation" }
            }
          ],
          "cascading": false,
          "other": false,
          "appearance": "Default",
          "metadata": {},
          "type": "inputSelectOne"
        },
        {
          "name": "nutrients_2",
          "label": {
            "0": "Which nutrients did you apply with this amendment/fertilizer?"
          },
          "hint": { "0": "Select all that apply" },
          "defaultValue": "",
          "readOnly": false,
          "required": false,
          "requiredText": {},
          "relevance": "(selected(/data/amendments/amendment_2, 'Yes'))",
          "constraint": "",
          "invalidText": {},
          "calculate": "",
          "options": [
            { "val": "unknown", "cascade": [], "text": { "0": "Not known" } },
            { "val": "N", "cascade": [], "text": { "0": "N" } },
            { "val": "P", "cascade": [], "text": { "0": "P" } },
            { "val": "K", "cascade": [], "text": { "0": "K" } },
            {
              "val": "Ca",
              "cascade": [],
              "text": { "0": "Ca (not limestone/lime)" }
            },
            {
              "val": "Mg",
              "cascade": [],
              "text": { "0": "Mg (not limestone/lime)" }
            },
            { "val": "B", "cascade": [], "text": { "0": "B" } },
            { "val": "Cu", "cascade": [], "text": { "0": "Cu" } },
            { "val": "Mn", "cascade": [], "text": { "0": "Mn" } },
            { "val": "Zn", "cascade": [], "text": { "0": "Zn" } },
            { "val": "other", "cascade": [], "text": { "0": "Other" } }
          ],
          "other": false,
          "count": false,
          "appearance": "Default",
          "metadata": {},
          "type": "inputSelectMany"
        },
        {
          "name": "n_2",
          "label": { "0": "N (lbs per acre)" },
          "hint": { "0": "" },
          "defaultValue": "",
          "readOnly": false,
          "required": false,
          "requiredText": {},
          "relevance": "(selected(/data/amendments/nutrients_2, 'N'))",
          "constraint": "",
          "invalidText": {},
          "calculate": "",
          "range": false,
          "appearance": "Textbox",
          "kind": "Integer",
          "selectRange": { "min": "1", "max": "10" },
          "selectStep": "1",
          "sliderTicks": true,
          "metadata": {},
          "type": "inputNumeric"
        },
        {
          "name": "p_2",
          "label": { "0": "P (lbs per acre)" },
          "hint": { "0": "" },
          "defaultValue": "",
          "readOnly": false,
          "required": false,
          "requiredText": {},
          "relevance": "(selected(/data/amendments/nutrients_2, 'P'))",
          "constraint": "",
          "invalidText": {},
          "calculate": "",
          "range": false,
          "appearance": "Textbox",
          "kind": "Integer",
          "selectRange": { "min": "1", "max": "10" },
          "selectStep": "1",
          "sliderTicks": true,
          "metadata": {},
          "type": "inputNumeric"
        },
        {
          "name": "k_2",
          "label": { "0": "K (lbs per acre)" },
          "hint": { "0": "Optional" },
          "defaultValue": "",
          "readOnly": false,
          "required": false,
          "requiredText": {},
          "relevance": "(selected(/data/amendments/nutrients_2, 'K'))",
          "constraint": "",
          "invalidText": {},
          "calculate": "",
          "range": false,
          "appearance": "Textbox",
          "kind": "Integer",
          "selectRange": { "min": "1", "max": "10" },
          "selectStep": "1",
          "sliderTicks": true,
          "metadata": {},
          "type": "inputNumeric"
        },
        {
          "name": "nutrients_trace_2",
          "label": { "0": "Other trace minerals added" },
          "hint": { "0": "Use a comma to separate different trace minerals" },
          "defaultValue": "",
          "readOnly": false,
          "required": false,
          "requiredText": {},
          "relevance": "(selected(/data/amendments/nutrients_2, 'other'))",
          "constraint": "",
          "invalidText": {},
          "calculate": "",
          "length": false,
          "metadata": {},
          "type": "inputText"
        }
      ]
    },
    {
      "name": "history_info",
      "label": {
        "0": "The next set of question are about the state of the field before this planting"
      },
      "hint": {
        "0": "for example, fallow, planted cash crop / cover crop, etc."
      },
      "defaultValue": "",
      "readOnly": true,
      "required": false,
      "requiredText": {},
      "relevance": "not(selected(/data/crop, 'grape'))",
      "constraint": "",
      "invalidText": {},
      "calculate": "",
      "length": false,
      "metadata": {},
      "type": "inputText"
    },
    {
      "name": "history_1",
      "label": { "0": "CROPPING HISTORY -- Last Year" },
      "loop": false,
      "fieldList": false,
      "relevance": "not(selected(/data/crop, 'grape'))",
      "metadata": {},
      "type": "group",
      "children": [
        {
          "name": "use",
          "label": { "0": "How was the field used last year?" },
          "hint": { "0": "Check all that apply" },
          "defaultValue": "",
          "readOnly": false,
          "required": false,
          "requiredText": {},
          "relevance": "",
          "constraint": "",
          "invalidText": {},
          "calculate": "",
          "options": [
            { "val": "cash_crop", "cascade": [], "text": { "0": "cash crop" } },
            {
              "val": "cover_crop",
              "cascade": [],
              "text": { "0": "cover crop" }
            },
            { "val": "pastured", "cascade": [], "text": { "0": "pastured" } },
            {
              "val": "fallow",
              "cascade": [],
              "text": { "0": "fallow (all year)" }
            },
            { "val": "other", "cascade": [], "text": { "0": "other" } }
          ],
          "other": false,
          "count": false,
          "appearance": "Default",
          "metadata": {},
          "type": "inputSelectMany"
        },
        {
          "name": "cash_crop1",
          "label": { "0": "What kind of cash crop?" },
          "hint": { "0": "ontology;crops;choose a crop" },
          "defaultValue": "",
          "readOnly": false,
          "required": false,
          "requiredText": {},
          "relevance": "(selected(/data/history_1/use, 'cash_crop'))",
          "constraint": "",
          "invalidText": {},
          "calculate": "",
          "length": false,
          "metadata": {},
          "type": "inputText"
        },
        {
          "name": "cash_crop2",
          "label": { "0": "If more than one, what other kind of cash crop?" },
          "hint": { "0": "ontology;crops;choose a crop" },
          "defaultValue": "",
          "readOnly": false,
          "required": false,
          "requiredText": {},
          "relevance": "(selected(/data/history_1/use, 'cash_crop'))",
          "constraint": "",
          "invalidText": {},
          "calculate": "",
          "length": false,
          "metadata": {},
          "type": "inputText"
        },
        {
          "name": "cover_crop",
          "label": { "0": "What kind of cover crops?" },
          "hint": { "0": "Check all that apply" },
          "defaultValue": "",
          "readOnly": false,
          "required": false,
          "requiredText": {},
          "relevance": "(selected(/data/history_1/use, 'cover_crop'))",
          "constraint": "",
          "invalidText": {},
          "calculate": "",
          "options": [
            { "val": "grasses", "cascade": [], "text": { "0": "Grasses" } },
            { "val": "legumes", "cascade": [], "text": { "0": "Legumes" } },
            { "val": "brassicas", "cascade": [], "text": { "0": "Brassicas" } },
            {
              "val": "non-legume_broadleaves",
              "cascade": [],
              "text": { "0": "Non-legume broadleaves" }
            },
            {
              "val": "3_cover_mix",
              "cascade": [],
              "text": { "0": "2-4 cover crop species mix" }
            },
            {
              "val": "8_cover_mix",
              "cascade": [],
              "text": { "0": "5-12 cover crop species mix" }
            },
            {
              "val": "12_cover_mix",
              "cascade": [],
              "text": { "0": "12+ cover crop species mix" }
            },
            { "val": "none", "cascade": [], "text": { "0": "None" } }
          ],
          "other": false,
          "count": false,
          "appearance": "Default",
          "metadata": {},
          "type": "inputSelectMany"
        },
        {
          "name": "pastured",
          "label": { "0": "What kind of animals pastured?" },
          "hint": { "0": "Check all that apply" },
          "defaultValue": "",
          "readOnly": false,
          "required": false,
          "requiredText": {},
          "relevance": "(selected(/data/history_1/use, 'pastured'))",
          "constraint": "",
          "invalidText": {},
          "calculate": "",
          "options": [
            { "val": "cows", "cascade": [], "text": { "0": "cows" } },
            { "val": "chickens", "cascade": [], "text": { "0": "chickens" } },
            { "val": "pigs", "cascade": [], "text": { "0": "pigs" } },
            { "val": "sheep", "cascade": [], "text": { "0": "sheep" } },
            { "val": "goats", "cascade": [], "text": { "0": "goats" } },
            { "val": "other", "cascade": [], "text": { "0": "other" } }
          ],
          "other": false,
          "count": false,
          "appearance": "Default",
          "metadata": {},
          "type": "inputSelectMany"
        },
        {
          "name": "other",
          "label": { "0": "Describe the use of the field (if other)" },
          "hint": { "0": "" },
          "defaultValue": "",
          "readOnly": false,
          "required": false,
          "requiredText": {},
          "relevance": "(selected(/data/history_1/use, 'other'))",
          "constraint": "",
          "invalidText": {},
          "calculate": "",
          "length": false,
          "metadata": {},
          "type": "inputText"
        }
      ]
    },
    {
      "name": "history_2",
      "label": { "0": "CROPPING HISTORY -- Two Years Ago" },
      "loop": false,
      "fieldList": false,
      "relevance": "not(selected(/data/crop, 'grape'))",
      "metadata": {},
      "type": "group",
      "children": [
        {
          "name": "use_2",
          "label": { "0": "How was the field used 2 years ago?" },
          "hint": { "0": "Check all that apply" },
          "defaultValue": "",
          "readOnly": false,
          "required": false,
          "requiredText": {},
          "relevance": "",
          "constraint": "",
          "invalidText": {},
          "calculate": "",
          "options": [
            { "val": "cash_crop", "cascade": [], "text": { "0": "cash crop" } },
            {
              "val": "cover_crop",
              "cascade": [],
              "text": { "0": "cover crop" }
            },
            { "val": "pastured", "cascade": [], "text": { "0": "pastured" } },
            {
              "val": "fallow",
              "cascade": [],
              "text": { "0": "fallow (all year)" }
            },
            { "val": "other", "cascade": [], "text": { "0": "other" } }
          ],
          "other": false,
          "count": false,
          "appearance": "Default",
          "metadata": {},
          "type": "inputSelectMany"
        },
        {
          "name": "cash_crop1_2",
          "label": { "0": "What kind of cash crop?" },
          "hint": { "0": "ontology;crops;pick crop" },
          "defaultValue": "",
          "readOnly": false,
          "required": false,
          "requiredText": {},
          "relevance": "(selected(/data/history_2/use_2, 'cash_crop'))",
          "constraint": "",
          "invalidText": {},
          "calculate": "",
          "length": false,
          "metadata": {},
          "type": "inputText"
        },
        {
          "name": "cash_crop2_2",
          "label": { "0": "If more than one, what other kind of cash crop?" },
          "hint": { "0": "ontology;crops;pick crop" },
          "defaultValue": "",
          "readOnly": false,
          "required": false,
          "requiredText": {},
          "relevance": "(selected(/data/history_2/use_2, 'cash_crop'))",
          "constraint": "",
          "invalidText": {},
          "calculate": "",
          "length": false,
          "metadata": {},
          "type": "inputText"
        },
        {
          "name": "cover_crop_2",
          "label": { "0": "What kind of cover crops?" },
          "hint": { "0": "Check all that apply" },
          "defaultValue": "",
          "readOnly": false,
          "required": false,
          "requiredText": {},
          "relevance": "(selected(/data/history_2/use_2, 'cover_crop'))",
          "constraint": "",
          "invalidText": {},
          "calculate": "",
          "options": [
            { "val": "grasses", "cascade": [], "text": { "0": "Grasses" } },
            { "val": "legumes", "cascade": [], "text": { "0": "Legumes" } },
            { "val": "brassicas", "cascade": [], "text": { "0": "Brassicas" } },
            {
              "val": "non-legume_broadleaves",
              "cascade": [],
              "text": { "0": "Non-legume broadleaves" }
            },
            {
              "val": "3_cover_mix",
              "cascade": [],
              "text": { "0": "2-4 cover crop species mix" }
            },
            {
              "val": "8_cover_mix",
              "cascade": [],
              "text": { "0": "5-12 cover crop species mix" }
            },
            {
              "val": "12_cover_mix",
              "cascade": [],
              "text": { "0": "12+ cover crop species mix" }
            },
            { "val": "none", "cascade": [], "text": { "0": "None" } }
          ],
          "other": false,
          "count": false,
          "appearance": "Default",
          "metadata": {},
          "type": "inputSelectMany"
        },
        {
          "name": "pastured_2",
          "label": { "0": "What kind of animals pastured?" },
          "hint": { "0": "Check all that apply" },
          "defaultValue": "",
          "readOnly": false,
          "required": false,
          "requiredText": {},
          "relevance": "(selected(/data/history_2/use_2, 'pastured'))",
          "constraint": "",
          "invalidText": {},
          "calculate": "",
          "options": [
            { "val": "cows", "cascade": [], "text": { "0": "cows" } },
            { "val": "chickens", "cascade": [], "text": { "0": "chickens" } },
            { "val": "pigs", "cascade": [], "text": { "0": "pigs" } },
            { "val": "sheep", "cascade": [], "text": { "0": "sheep" } },
            { "val": "goats", "cascade": [], "text": { "0": "goats" } },
            { "val": "other", "cascade": [], "text": { "0": "other" } }
          ],
          "other": false,
          "count": false,
          "appearance": "Default",
          "metadata": {},
          "type": "inputSelectMany"
        },
        {
          "name": "other_2",
          "label": { "0": "Describe the use of the field (if other)" },
          "hint": { "0": "" },
          "defaultValue": "",
          "readOnly": false,
          "required": false,
          "requiredText": {},
          "relevance": "(selected(/data/history_2/use_2, 'other'))",
          "constraint": "",
          "invalidText": {},
          "calculate": "",
          "length": false,
          "metadata": {},
          "type": "inputText"
        }
      ]
    },
    {
      "name": "farmos_group",
      "label": { "0": "Confirm answers and submit data to FarmOS;anon" },
      "loop": false,
      "fieldList": false,
      "relevance": "",
      "metadata": {},
      "type": "group",
      "children": [
        {
          "name": "error_check",
          "label": { "0": "Error Check" },
          "hint": {
            "0": "Check survey data before submitting;post-planting-error-check"
          },
          "defaultValue": "",
          "readOnly": false,
          "required": false,
          "requiredText": {},
          "relevance": "",
          "constraint": "",
          "invalidText": {},
          "calculate": "",
          "kind": "Video",
          "metadata": {},
          "type": "inputMedia"
        },
        {
          "name": "farmos_submit",
          "label": { "0": "Submit to farmOS" },
          "hint": {
            "0": "Submit data in form to your farmOS instance.  Go to main menu then profile to view and select farmOS instance;post-planting-farmos-submit-v2"
          },
          "defaultValue": "",
          "readOnly": false,
          "required": false,
          "requiredText": {},
          "relevance": "",
          "constraint": "",
          "invalidText": {},
          "calculate": "",
          "kind": "Video",
          "metadata": {},
          "type": "inputMedia"
        }
      ]
    },
    {
      "name": "thanks",
      "label": { "0": "Thanks - Almost done!" },
      "hint": {
        "0": "Select NEXT and then SUBMIT. If you need to fill out another survey look for the 'NEXT SURVEY' button in the upper right corner of the app after this survey has been submitted."
      },
      "defaultValue": "",
      "readOnly": true,
      "required": false,
      "requiredText": {},
      "relevance": "",
      "constraint": "",
      "invalidText": {},
      "calculate": "",
      "length": false,
      "metadata": {},
      "type": "inputText"
    }
  ],
  "metadata": {
    "version": 2,
    "activeLanguages": { "0": "English", "_counter": 0, "_display": "0" },
    "optionsPresets": [
      {
        "name": "cover crops",
        "options": [
          { "val": "Grasses", "cascade": [], "text": { "0": "Grasses" } },
          { "val": "Legumes", "cascade": [], "text": { "0": "Legumes" } },
          { "val": "Brassicas", "cascade": [], "text": { "0": "Brassicas" } },
          {
            "val": "Non-legume_broadleaves",
            "cascade": [],
            "text": { "0": "Non-legume broadleaves" }
          },
          {
            "val": "3_cover_mix",
            "cascade": [],
            "text": { "0": "2-4 cover crop species mix" }
          },
          {
            "val": "8_cover_mix",
            "cascade": [],
            "text": { "0": "5-12 cover crop species mix" }
          },
          {
            "val": "12_cover_mix",
            "cascade": [],
            "text": { "0": "12+ cover crop species mix" }
          }
        ]
      },
      {
        "name": "cover crops",
        "options": [
          { "val": "Grasses", "cascade": [], "text": { "0": "Grasses" } },
          { "val": "Legumes", "cascade": [], "text": { "0": "Legumes" } },
          { "val": "Brassicas", "cascade": [], "text": { "0": "Brassicas" } },
          {
            "val": "Non-legume_broadleaves",
            "cascade": [],
            "text": { "0": "Non-legume broadleaves" }
          },
          {
            "val": "3_cover_mix",
            "cascade": [],
            "text": { "0": "2-4 cover crop species mix" }
          },
          {
            "val": "8_cover_mix",
            "cascade": [],
            "text": { "0": "5-12 cover crop species mix" }
          },
          {
            "val": "12_cover_mix",
            "cascade": [],
            "text": { "0": "12+ cover crop species mix" }
          },
          { "val": "None", "cascade": [], "text": { "0": "None" } }
        ]
      },
      {
        "name": "tillage",
        "options": [
          { "val": "Bed_Shaper", "cascade": [], "text": { "0": "Bed Shaper" } },
          {
            "val": "Bedder_Hipper",
            "cascade": [],
            "text": { "0": "Bedder/Hipper" }
          },
          { "val": "Chisel", "cascade": [], "text": { "0": "Chisel" } },
          {
            "val": "Cultivate_manually",
            "cascade": [],
            "text": { "0": "Cultivate, manually" }
          },
          { "val": "Cultivator", "cascade": [], "text": { "0": "Cultivator" } },
          { "val": "Disk", "cascade": [], "text": { "0": "Disk" } },
          {
            "val": "Furrow_shaper",
            "cascade": [],
            "text": { "0": "Furrow shaper" }
          },
          { "val": "Harrow", "cascade": [], "text": { "0": "Harrow" } },
          {
            "val": "Hilling_manual",
            "cascade": [],
            "text": { "0": "Hilling, manual hoe" }
          },
          { "val": "Plow_oxen", "cascade": [], "text": { "0": "Plow, Oxen" } },
          {
            "val": "Plow_Moldboard",
            "cascade": [],
            "text": { "0": "Plow, Moldboard" }
          },
          { "val": "Ripper", "cascade": [], "text": { "0": "Ripper" } },
          { "val": "Rodweeder", "cascade": [], "text": { "0": "Rodweeder" } },
          { "val": "Roller", "cascade": [], "text": { "0": "Roller" } },
          { "val": "Rotary_hoe", "cascade": [], "text": { "0": "Rotary hoe" } },
          {
            "val": "Rototiller_field",
            "cascade": [],
            "text": { "0": "Rototiller, field" }
          },
          {
            "val": "Rototiller_row_cultivator",
            "cascade": [],
            "text": { "0": "Rototiller, row cultivator" }
          },
          {
            "val": "Seedbed_conditioner",
            "cascade": [],
            "text": { "0": "Seedbed conditioner" }
          },
          {
            "val": "Seedbed_finisher",
            "cascade": [],
            "text": { "0": "Seedbed finisher" }
          },
          { "val": "Spader", "cascade": [], "text": { "0": "Spader" } },
          { "val": "Subsoiler", "cascade": [], "text": { "0": "Subsoiler" } },
          { "val": "Sweep_plow", "cascade": [], "text": { "0": "Sweep plow" } }
        ]
      },
      {
        "name": "fertilizer",
        "options": [
          {
            "val": "Broadcast_Surface",
            "cascade": [],
            "text": { "0": "Broadcast - Surface" }
          },
          {
            "val": "Broadcast_Incorporated",
            "cascade": [],
            "text": { "0": "Broadcast - Incorporated" }
          },
          { "val": "Banded", "cascade": [], "text": { "0": "Banded" } },
          { "val": "Topdress", "cascade": [], "text": { "0": "Topdress" } },
          { "val": "Sidedress", "cascade": [], "text": { "0": "Sidedress" } },
          {
            "val": "Seed_Placement",
            "cascade": [],
            "text": { "0": "Seed Placement" }
          },
          { "val": "Foliar", "cascade": [], "text": { "0": "Foliar" } },
          { "val": "Injection", "cascade": [], "text": { "0": "Injection" } },
          {
            "val": "Fertigation",
            "cascade": [],
            "text": { "0": "Fertigation" }
          }
        ]
      },
      {
        "name": "fertilizer",
        "options": [
          {
            "val": "Broadcast_Surface",
            "cascade": [],
            "text": { "0": "Broadcast - Surface" }
          },
          {
            "val": "Broadcast_Incorporated",
            "cascade": [],
            "text": { "0": "Broadcast - Incorporated" }
          },
          { "val": "Banded", "cascade": [], "text": { "0": "Banded" } },
          { "val": "Topdress", "cascade": [], "text": { "0": "Topdress" } },
          { "val": "Sidedress", "cascade": [], "text": { "0": "Sidedress" } },
          {
            "val": "Seed_Placement",
            "cascade": [],
            "text": { "0": "Seed Placement" }
          },
          { "val": "Foliar", "cascade": [], "text": { "0": "Foliar" } },
          { "val": "Injection", "cascade": [], "text": { "0": "Injection" } },
          {
            "val": "Fertigation",
            "cascade": [],
            "text": { "0": "Fertigation" }
          }
        ]
      },
      {
        "name": "rate",
        "options": [
          { "val": "lbs_acre", "cascade": [], "text": { "0": "lbs/acre" } },
          { "val": "tons_acre", "cascade": [], "text": { "0": "tons/acre" } },
          {
            "val": "gallons_acre",
            "cascade": [],
            "text": { "0": "gallons/acre" }
          }
        ]
      },
      {
        "name": "fertilizer",
        "options": [
          {
            "val": "Broadcast_Surface",
            "cascade": [],
            "text": { "0": "Broadcast - Surface" }
          },
          {
            "val": "Broadcast_Incorporated",
            "cascade": [],
            "text": { "0": "Broadcast - Incorporated" }
          },
          { "val": "Banded", "cascade": [], "text": { "0": "Banded" } },
          { "val": "Topdress", "cascade": [], "text": { "0": "Topdress" } },
          { "val": "Sidedress", "cascade": [], "text": { "0": "Sidedress" } },
          {
            "val": "Seed_Placement",
            "cascade": [],
            "text": { "0": "Seed Placement" }
          },
          { "val": "Foliar", "cascade": [], "text": { "0": "Foliar" } },
          { "val": "Injection", "cascade": [], "text": { "0": "Injection" } },
          {
            "val": "Fertigation",
            "cascade": [],
            "text": { "0": "Fertigation" }
          }
        ]
      },
      {
        "name": "fert  units",
        "options": [
          { "val": "lbs_acre", "cascade": [], "text": { "0": "lbs/acre" } },
          { "val": "tons_acre", "cascade": [], "text": { "0": "tons/acre" } },
          {
            "val": "gallons_acre",
            "cascade": [],
            "text": { "0": "gallons/acre" }
          }
        ]
      },
      {
        "name": "nutrients",
        "options": [
          { "val": "unknown", "cascade": [], "text": { "0": "Not known" } },
          { "val": "N", "cascade": [], "text": { "0": "N" } },
          { "val": "P", "cascade": [], "text": { "0": "P" } },
          { "val": "K", "cascade": [], "text": { "0": "K" } },
          { "val": "other", "cascade": [], "text": { "0": "Other minerals" } }
        ]
      },
      {
        "name": "nutr",
        "options": [
          { "val": "unknown", "cascade": [], "text": { "0": "Not known" } },
          { "val": "N", "cascade": [], "text": { "0": "N" } },
          { "val": "P", "cascade": [], "text": { "0": "P" } },
          { "val": "K", "cascade": [], "text": { "0": "K" } },
          {
            "val": "Ca",
            "cascade": [],
            "text": { "0": "Ca (not limestone/lime)" }
          },
          {
            "val": "Mg",
            "cascade": [],
            "text": { "0": "Mg (not limestone/lime)" }
          },
          { "val": "B", "cascade": [], "text": { "0": "B" } },
          { "val": "Cu", "cascade": [], "text": { "0": "Cu" } },
          { "val": "Mn", "cascade": [], "text": { "0": "Mn" } },
          { "val": "Zn", "cascade": [], "text": { "0": "Zn" } },
          { "val": "other", "cascade": [], "text": { "0": "Other" } }
        ]
      },
      {
        "name": "amendment",
        "options": [
          { "val": "compost", "cascade": [], "text": { "0": "Compost" } },
          {
            "val": "compost_tea",
            "cascade": [],
            "text": { "0": "Compost tea" }
          },
          { "val": "inoculant", "cascade": [], "text": { "0": "Inoculant" } },
          {
            "val": "foliar_spray",
            "cascade": [],
            "text": { "0": "Foliar spray" }
          },
          {
            "val": "organic_fertilizer",
            "cascade": [],
            "text": { "0": "Organic fertilizer" }
          },
          {
            "val": "synthetic_fertilizer",
            "cascade": [],
            "text": { "0": "Synthetic fertilizer" }
          },
          {
            "val": "biostimulants",
            "cascade": [],
            "text": { "0": "Biostimulants" }
          },
          { "val": "other", "cascade": [], "text": { "0": "Other" } }
        ]
      },
      {
        "name": "mulch",
        "options": [
          { "val": "plastic", "cascade": [], "text": { "0": "Plastic" } },
          { "val": "wood_chips", "cascade": [], "text": { "0": "Wood chips" } },
          { "val": "straw_hay", "cascade": [], "text": { "0": "Straw/Hay" } },
          {
            "val": "leaves",
            "cascade": [],
            "text": { "0": "Leaves/leaf litter" }
          },
          { "val": "cardboard", "cascade": [], "text": { "0": "Cardboard" } },
          { "val": "other", "cascade": [], "text": { "0": "Other" } }
        ]
      }
    ],
    "htitle": null,
    "instance_name": "",
    "public_key": "",
    "submission_url": ""
  }
}
