{
  "error": {},
  "warning": {},
  "info": {},
  "device_firmware_old": "4.0.1",
  "device_firmware_new": "4.0.2",
  "memory_old": "{\"device_name\":\"Reflectometer\",\"device_version\":\"1.1.0\",\"device_id\":\"00:00:03:19\",\"device_battery\":100,\"device_firmware\":\"4.0.1\",\"shutdown\":420000,\"ir_high\":[\"655350016.000000\",\"655350016.000000\",\"655350016.000000\",\"655350016.000000\",\"655350016.000000\",\"655350016.000000\",\"655350016.000000\",\"655350016.000000\",\"655350016.000000\",\"655350016.000000\",\"655350016.000000\"],\"ir_low\":[\"0.000000\",\"0.000000\",\"0.000000\",\"0.000000\",\"0.000000\",\"0.000000\",\"0.000000\",\"0.000000\",\"0.000000\",\"0.000000\",\"0.000000\"],\"vis_high\":[\"655350016.000000\",\"655350016.000000\",\"655350016.000000\",\"655350016.000000\",\"655350016.000000\",\"655350016.000000\",\"655350016.000000\",\"655350016.000000\",\"655350016.000000\",\"655350016.000000\",\"655350016.000000\"],\"vis_low\":[\"0.000000\",\"0.000000\",\"0.000000\",\"0.000000\",\"0.000000\",\"0.000000\",\"0.000000\",\"0.000000\",\"0.000000\",\"0.000000\",\"0.000000\"],\"ir_high_master\":[\"10000.000000\",\"10000.000000\",\"10000.000000\",\"10000.000000\",\"10000.000000\",\"10000.000000\",\"10000.000000\",\"10000.000000\",\"10000.000000\",\"10000.000000\",\"10000.000000\"],\"ir_low_master\":[\"0.000000\",\"0.000000\",\"0.000000\",\"0.000000\",\"0.000000\",\"0.000000\",\"0.000000\",\"0.000000\",\"0.000000\",\"0.000000\",\"0.000000\"],\"vis_high_master\":[\"10000.000000\",\"10000.000000\",\"10000.000000\",\"10000.000000\",\"10000.000000\",\"10000.000000\",\"10000.000000\",\"10000.000000\",\"10000.000000\",\"10000.000000\",\"10000.000000\"],\"vis_low_master\":[\"0.000000\",\"0.000000\",\"0.000000\",\"0.000000\",\"0.000000\",\"0.000000\",\"0.000000\",\"0.000000\",\"0.000000\",\"0.000000\",\"0.000000\"],\"ir_blank\":[\"0.000000\",\"0.000000\",\"0.000000\",\"0.000000\",\"0.000000\",\"0.000000\",\"0.000000\",\"0.000000\",\"0.000000\",\"0.000000\",\"0.000000\"],\"vis_blank\":[\"0.000000\",\"0.000000\",\"0.000000\",\"0.000000\",\"0.000000\",\"0.000000\",\"0.000000\",\"0.000000\",\"0.000000\",\"0.000000\",\"0.000000\"],\"heatcal1\":[\"1.000000\",\"1.000000\",\"1.000000\",\"1.000000\",\"1.000000\",\"1.000000\",\"1.000000\",\"1.000000\",\"1.000000\",\"1.000000\",\"1.000000\"],\"heatcal2\":[\"0.000000\",\"0.000000\",\"0.000000\",\"0.000000\",\"0.000000\",\"0.000000\",\"0.000000\",\"0.000000\",\"0.000000\",\"0.000000\",\"0.000000\"],\"heatcal3\":[\"0.000000\",\"0.000000\",\"0.000000\",\"0.000000\",\"0.000000\",\"0.000000\",\"0.000000\",\"0.000000\",\"0.000000\",\"0.000000\",\"0.000000\"],\"normalized_soil\":[\"2.000000\",\"2.000000\",\"2.000000\",\"2.000000\",\"2.000000\",\"2.000000\",\"2.000000\",\"2.000000\",\"2.000000\",\"2.000000\",\"2.000000\"],\"normalized_5mlcuvette\":[\"1.000000\",\"1.000000\",\"1.000000\",\"1.000000\",\"1.000000\",\"1.000000\",\"1.000000\",\"1.000000\",\"1.000000\",\"1.000000\",\"1.000000\"],\"normalized_1mlcuvette\":[\"1.000000\",\"1.000000\",\"1.000000\",\"1.000000\",\"1.000000\",\"1.000000\",\"1.000000\",\"1.000000\",\"1.000000\",\"1.000000\",\"1.000000\"],\"normalized_custom\":[\"1.000000\",\"1.000000\",\"1.000000\",\"1.000000\",\"1.000000\",\"1.000000\",\"1.000000\",\"1.000000\",\"1.000000\",\"1.000000\",\"1.000000\"],\"userdef0\":\"0.000000\",\"userdef1\":\"0.000000\",\"userdef2\":\"0.000000\",\"userdef3\":\"0.000000\",\"userdef4\":\"0.000000\",\"userdef5\":\"0.000000\",\"userdef6\":\"0.000000\",\"userdef7\":\"0.000000\",\"userdef8\":\"0.000000\",\"userdef9\":\"0.000000\",\"userdef10\":\"0.000000\",\"userdef11\":\"0.000000\",\"userdef12\":\"0.000000\",\"userdef13\":\"0.000000\",\"userdef14\":\"0.000000\",\"userdef15\":\"0.000000\",\"userdef16\":\"0.000000\",\"userdef17\":\"0.000000\",\"userdef18\":\"0.000000\",\"userdef19\":\"0.000000\",\"userdef20\":\"0.000000\",\"userdef21\":\"0.000000\",\"userdef22\":\"0.000000\",\"userdef23\":\"0.000000\",\"userdef24\":\"0.000000\",\"userdef25\":\"0.000000\",\"userdef26\":\"0.000000\",\"userdef27\":\"0.000000\",\"userdef28\":\"0.000000\",\"userdef29\":\"0.000000\",\"userdef30\":\"0.000000\",\"userdef31\":\"0.000000\",\"userdef32\":\"0.000000\",\"userdef33\":\"0.000000\",\"userdef34\":\"0.000000\",\"userdef35\":\"0.000000\",\"userdef36\":\"0.000000\",\"userdef37\":\"0.000000\",\"userdef38\":\"0.000000\",\"userdef39\":\"0.000000\",\"userdef40\":\"0.000000\",\"userdef41\":\"0.000000\",\"userdef42\":\"0.000000\",\"userdef43\":\"0.000000\",\"userdef44\":\"0.000000\",\"userdef45\":\"0.000000\",\"userdef46\":\"0.000000\",\"userdef47\":\"0.000000\",\"userdef48\":\"0.000000\",\"userdef49\":\"0.000000\",\"userdef50\":\"0.000000\",\"userdef51\":\"0.000000\",\"userdef52\":\"0.000000\",\"userdef53\":\"0.000000\",\"userdef54\":\"0.000000\",\"userdef55\":\"0.000000\",\"userdef56\":\"0.000000\",\"userdef57\":\"0.000000\",\"userdef58\":\"0.000000\",\"userdef59\":\"0.000000\",\"userdef60\":\"0.000000\",\"userdef61\":\"0.000000\",\"userdef62\":\"0.000000\",\"userdef63\":\"0.000000\",\"userdef64\":\"0.000000\",\"userdef65\":\"0.000000\",\"userdef66\":\"0.000000\",\"userdef67\":\"0.000000\",\"userdef68\":\"0.000000\",\"userdef69\":\"0.000000\"}",
  "toDevice": "set_ir_high+0+655350016.000000+1+655350016.000000+2+655350016.000000+3+655350016.000000+4+655350016.000000+5+655350016.000000+6+655350016.000000+7+655350016.000000+8+655350016.000000+9+655350016.000000+10+655350016.000000+-1+set_ir_low+0+0.000000+1+0.000000+2+0.000000+3+0.000000+4+0.000000+5+0.000000+6+0.000000+7+0.000000+8+0.000000+9+0.000000+10+0.000000+-1+set_vis_high+0+655350016.000000+1+655350016.000000+2+655350016.000000+3+655350016.000000+4+655350016.000000+5+655350016.000000+6+655350016.000000+7+655350016.000000+8+655350016.000000+9+655350016.000000+10+655350016.000000+-1+set_vis_low+0+0.000000+1+0.000000+2+0.000000+3+0.000000+4+0.000000+5+0.000000+6+0.000000+7+0.000000+8+0.000000+9+0.000000+10+0.000000+-1+set_ir_high_master+0+10000.000000+1+10000.000000+2+10000.000000+3+10000.000000+4+10000.000000+5+10000.000000+6+10000.000000+7+10000.000000+8+10000.000000+9+10000.000000+10+10000.000000+-1+set_ir_low_master+0+0.000000+1+0.000000+2+0.000000+3+0.000000+4+0.000000+5+0.000000+6+0.000000+7+0.000000+8+0.000000+9+0.000000+10+0.000000+-1+set_vis_high_master+0+10000.000000+1+10000.000000+2+10000.000000+3+10000.000000+4+10000.000000+5+10000.000000+6+10000.000000+7+10000.000000+8+10000.000000+9+10000.000000+10+10000.000000+-1+set_vis_low_master+0+0.000000+1+0.000000+2+0.000000+3+0.000000+4+0.000000+5+0.000000+6+0.000000+7+0.000000+8+0.000000+9+0.000000+10+0.000000+-1+set_ir_blank+0+0.000000+1+0.000000+2+0.000000+3+0.000000+4+0.000000+5+0.000000+6+0.000000+7+0.000000+8+0.000000+9+0.000000+10+0.000000+-1+set_vis_blank+0+0.000000+1+0.000000+2+0.000000+3+0.000000+4+0.000000+5+0.000000+6+0.000000+7+0.000000+8+0.000000+9+0.000000+10+0.000000+-1+set_heatcal1+0+1.000000+1+1.000000+2+1.000000+3+1.000000+4+1.000000+5+1.000000+6+1.000000+7+1.000000+8+1.000000+9+1.000000+10+1.000000+-1+set_heatcal2+0+0.000000+1+0.000000+2+0.000000+3+0.000000+4+0.000000+5+0.000000+6+0.000000+7+0.000000+8+0.000000+9+0.000000+10+0.000000+-1+set_heatcal3+0+0.000000+1+0.000000+2+0.000000+3+0.000000+4+0.000000+5+0.000000+6+0.000000+7+0.000000+8+0.000000+9+0.000000+10+0.000000+-1+set_normalized_soil+0+2.000000+1+2.000000+2+2.000000+3+2.000000+4+2.000000+5+2.000000+6+2.000000+7+2.000000+8+2.000000+9+2.000000+10+2.000000+-1+set_normalized_5mlcuvette+0+1.000000+1+1.000000+2+1.000000+3+1.000000+4+1.000000+5+1.000000+6+1.000000+7+1.000000+8+1.000000+9+1.000000+10+1.000000+-1+set_normalized_1mlcuvette+0+1.000000+1+1.000000+2+1.000000+3+1.000000+4+1.000000+5+1.000000+6+1.000000+7+1.000000+8+1.000000+9+1.000000+10+1.000000+-1+set_normalized_custom+0+1.000000+1+1.000000+2+1.000000+3+1.000000+4+1.000000+5+1.000000+6+1.000000+7+1.000000+8+1.000000+9+1.000000+10+1.000000+-1+set_user_defined+0+0.000000+1+0.000000+2+0.000000+3+0.000000+4+0.000000+5+0.000000+6+0.000000+7+0.000000+8+0.000000+9+0.000000+10+0.000000+11+0.000000+12+0.000000+13+0.000000+14+0.000000+15+0.000000+16+0.000000+17+0.000000+18+0.000000+19+0.000000+20+0.000000+21+0.000000+22+0.000000+23+0.000000+24+0.000000+25+0.000000+26+0.000000+27+0.000000+28+0.000000+29+0.000000+30+0.000000+31+0.000000+32+0.000000+33+0.000000+34+0.000000+35+0.000000+36+0.000000+37+0.000000+38+0.000000+39+0.000000+40+0.000000+41+0.000000+42+0.000000+43+0.000000+44+0.000000+45+0.000000+46+0.000000+47+0.000000+48+0.000000+49+0.000000+50+0.000000+51+0.000000+52+0.000000+53+0.000000+54+0.000000+55+0.000000+56+0.000000+57+0.000000+58+0.000000+59+0.000000+60+0.000000+61+0.000000+62+0.000000+63+0.000000+64+0.000000+65+0.000000+66+0.000000+67+0.000000+68+0.000000+69+0.000000+-1+print_memory+",
  "status": "ok",
  "info_updated": "v4.0.1 -> v4.0.2 - Firmware successfully updated",
  "len": 6366
}