{
  "planting": "2019 Gartenbeet Carrot (server: 36, id: 20)",
  "which_week": "last_week",
  "management_practices": "irrigation weed_control amendment pest_disease_scouting pest_disease_control harvest thin_prune",
  "irrigation/rate": "3",
  "irrigation/type": "surface_flood",
  "weed_control/weed_control_type": "hoeing hand_pulling",
  "amendments/amendments_type": "compost compost_tea",
  "amendments/name_1": "oil",
  "amendments/nutrients_1": "Ca K P N",
  "amendments/n_1": "30",
  "amendments/p_1": "2",
  "amendments/k_1": "12",
  "amendments/amendment_2": "yes",
  "amendments/name_2": "oil",
  "amendments/nutrients_2": "P K",
  "amendments/p_2": "3",
  "amendments/k_2": "25",
  "pest_disease_scouting/pest_disease_pressure": "1",
  "pest_disease_control/pest_disease_reason": "scheduled",
  "pest_disease_control/pest_disease_type": "hand_removal compost_tea release_biocontrol elemental",
  "pest_disease_control/pest_disease_rate": "3",
  "pest_disease_control/pest_disease_controlled_1": "alfalfa_mosaic",
  "pest_disease_control/pest_disease_controlled_2": "bacterial_black_rot",
  "pest_disease_control/pest_disease_controlled_3": "",
  "harvest_group/harvest_directions": "",
  "harvest_group/harvest_weight_units": "kg",
  "harvest_group/harvest_weight": "25.0",
  "harvest_group/harvest_area_units": "row_foot",
  "harvest_group/harvest_area": "65.0",
  "harvest_group/plant_density": "25",
  "thin_prune_group/pruning_activity": "thin_fruit thin_flower pruning_cane",
  "farmos_submit": "",
  "thanks": "",
  "metaDateCreated": "2019-04-30T12:37:20.034+02:00",
  "metaDateModified": "2019-04-30T12:48:00.216+02:00",
  "metaInstanceID": "uuid:6ae0a989-1cd8-42d9-94b0-53b3af62e347",
  "metaUserID": "JgSCLqbgLmhO3Le4aFWjuErryf53"
}
