[
    {
        "pulses": [
            60,
            60,
            60,
            60,
            60,
            60,
            60,
            60,
            60,
            60
        ],
        "pulse_length": [
            [
                7
            ],
            [
                7
            ],
            [
                7
            ],
            [
                7
            ],
            [
                7
            ],
            [
                7
            ],
            [
                7
            ],
            [
                7
            ],
            [
                7
            ],
            [
                7
            ]
        ],
        "pulse_distance": [
            1500,
            1500,
            1500,
            1500,
            1500,
            1500,
            1500,
            1500,
            1500,
            1500
        ],
        "pulsed_lights": [
            [
                3
            ],
            [
                4
            ],
            [
                5
            ],
            [
                9
            ],
            [
                6
            ],
            [
                7
            ],
            [
                8
            ],
            [
                1
            ],
            [
                2
            ],
            [
                10
            ]
        ],
        "pulsed_lights_brightness": [
            [
                250
            ],
            [
                250
            ],
            [
                250
            ],
            [
                250
            ],
            [
                250
            ],
            [
                200
            ],
            [
                150
            ],
            [
                20
            ],
            [
                20
            ],
            [
                20
            ]
        ],
        "detectors": [
            [
                1
            ],
            [
                1
            ],
            [
                1
            ],
            [
                1
            ],
            [
                1
            ],
            [
                1
            ],
            [
                1
            ],
            [
                0
            ],
            [
                0
            ],
            [
                0
            ]
        ],
        "dac_lights": 1,
        "averages": 5,
        "protocols": 1,
        "recall": [
            "userdef[0]",
            "userdef[1]",
            "userdef[2]",
            "userdef[3]",
            "userdef[4]",
            "userdef[5]",
            "userdef[6]",
            "userdef[7]",
            "userdef[8]",
            "userdef[9]",
            "userdef[10]",
            "userdef[11]",
            "userdef[12]",
            "userdef[13]",
            "userdef[14]",
            "userdef[15]",
            "userdef[16]",
            "userdef[17]",
            "userdef[18]",
            "userdef[19]"
        ]
    }
]
