{
  "device_name": "MultispeQ",
  "device_version": "1",
  "device_id": "11:27:09:66",
  "device_battery": 90,
  "device_firmware": 1.17,
  "sample": [
    {
      "protocol_id": "",
      "averages": 5,
      "recall": {
        "userdef[0]": 368.5,
        "userdef[1]": 368,
        "userdef[2]": 379,
        "userdef[3]": 408.5,
        "userdef[4]": 496,
        "userdef[5]": 558,
        "userdef[6]": 659,
        "userdef[7]": 727.5,
        "userdef[8]": 806.5,
        "userdef[9]": 884,
        "userdef[10]": 955.5,
        "userdef[11]": 1024.5,
        "userdef[12]": 1101.5,
        "userdef[13]": 1181.5,
        "userdef[14]": 1258.5,
        "userdef[15]": 1319,
        "userdef[16]": 1388,
        "userdef[17]": 1449.5,
        "userdef[18]": 1512.5,
        "userdef[19]": 1584.5
      },
      "data_raw": [
        37,
        38,
        35,
        30,
        29,
        29,
        29,
        26,
        25,
        27,
        26,
        25,
        25,
        27,
        26,
        23,
        22,
        24,
        26,
        24,
        24,
        22,
        23,
        24,
        24,
        23,
        23,
        22,
        23,
        24,
        23,
        23,
        24,
        23,
        22,
        22,
        24,
        24,
        23,
        22,
        23,
        23,
        23,
        24,
        23,
        24,
        22,
        23,
        24,
        24,
        23,
        23,
        23,
        23,
        24,
        23,
        22,
        22,
        24,
        23,
        52,
        53,
        52,
        53,
        53,
        53,
        52,
        52,
        52,
        52,
        53,
        54,
        52,
        52,
        53,
        52,
        52,
        52,
        52,
        52,
        52,
        53,
        53,
        53,
        52,
        53,
        52,
        52,
        52,
        53,
        52,
        52,
        51,
        53,
        53,
        54,
        52,
        51,
        52,
        53,
        53,
        53,
        52,
        51,
        52,
        52,
        52,
        52,
        52,
        52,
        52,
        53,
        54,
        51,
        52,
        52,
        53,
        52,
        52,
        52,
        7428,
        7333,
        7334,
        7329,
        7329,
        7331,
        7330,
        7330,
        7331,
        7327,
        7330,
        7331,
        7330,
        7329,
        7331,
        7330,
        7331,
        7330,
        7331,
        7330,
        7329,
        7329,
        7332,
        7328,
        7331,
        7329,
        7330,
        7332,
        7332,
        7332,
        7330,
        7328,
        7330,
        7330,
        7332,
        7331,
        7330,
        7327,
        7329,
        7332,
        7331,
        7329,
        7329,
        7330,
        7328,
        7329,
        7332,
        7330,
        7331,
        7330,
        7331,
        7330,
        7329,
        7330,
        7330,
        7331,
        7329,
        7329,
        7328,
        7330,
        5043,
        4923,
        4919,
        4919,
        4915,
        4915,
        4915,
        4916,
        4915,
        4915,
        4917,
        4916,
        4916,
        4917,
        4917,
        4916,
        4915,
        4918,
        4918,
        4917,
        4914,
        4915,
        4917,
        4918,
        4916,
        4917,
        4916,
        4916,
        4916,
        4917,
        4916,
        4916,
        4914,
        4916,
        4917,
        4916,
        4916,
        4917,
        4916,
        4916,
        4914,
        4916,
        4918,
        4916,
        4917,
        4916,
        4917,
        4916,
        4916,
        4916,
        4917,
        4919,
        4916,
        4915,
        4915,
        4914,
        4917,
        4916,
        4918,
        4915,
        27437,
        27219,
        27210,
        27209,
        27207,
        27203,
        27204,
        27207,
        27206,
        27208,
        27203,
        27203,
        27205,
        27207,
        27207,
        27206,
        27209,
        27208,
        27207,
        27203,
        27206,
        27202,
        27202,
        27202,
        27202,
        27202,
        27204,
        27203,
        27203,
        27206,
        27209,
        27208,
        27204,
        27203,
        27204,
        27201,
        27202,
        27200,
        27204,
        27206,
        27208,
        27210,
        27211,
        27208,
        27204,
        27203,
        27202,
        27202,
        27203,
        27207,
        27204,
        27205,
        27205,
        27205,
        27202,
        27208,
        27205,
        27201,
        27199,
        27202,
        19,
        19,
        20,
        21,
        21,
        20,
        19,
        20,
        21,
        20,
        20,
        20,
        20,
        20,
        20,
        21,
        19,
        20,
        20,
        20,
        21,
        20,
        19,
        21,
        21,
        21,
        20,
        20,
        20,
        21,
        21,
        20,
        20,
        20,
        20,
        20,
        21,
        20,
        20,
        20,
        20,
        21,
        21,
        20,
        20,
        20,
        20,
        20,
        21,
        21,
        21,
        19,
        19,
        21,
        21,
        22,
        20,
        18,
        19,
        21,
        5393,
        4966,
        4958,
        4957,
        4954,
        4953,
        4952,
        4954,
        4952,
        4950,
        4951,
        4951,
        4948,
        4948,
        4955,
        4951,
        4951,
        4953,
        4953,
        4951,
        4949,
        4950,
        4951,
        4953,
        4951,
        4950,
        4951,
        4952,
        4954,
        4953,
        4953,
        4956,
        4954,
        4956,
        4954,
        4949,
        4957,
        4952,
        4952,
        4955,
        4956,
        4954,
        4959,
        4956,
        4959,
        4956,
        4957,
        4951,
        4950,
        4953,
        4955,
        4954,
        4952,
        4956,
        4951,
        4951,
        4955,
        4952,
        4957,
        4954,
        18,
        18,
        18,
        17,
        18,
        18,
        18,
        19,
        19,
        18,
        18,
        18,
        18,
        18,
        18,
        19,
        19,
        18,
        17,
        18,
        19,
        19,
        18,
        17,
        18,
        18,
        18,
        18,
        19,
        18,
        17,
        17,
        18,
        18,
        18,
        18,
        17,
        18,
        19,
        18,
        18,
        18,
        18,
        18,
        18,
        18,
        19,
        18,
        18,
        17,
        18,
        19,
        19,
        18,
        18,
        17,
        18,
        19,
        18,
        18,
        18,
        18,
        18,
        17,
        18,
        18,
        18,
        18,
        18,
        18,
        17,
        17,
        18,
        18,
        19,
        18,
        17,
        18,
        18,
        18,
        18,
        18,
        19,
        18,
        18,
        18,
        18,
        19,
        19,
        18,
        18,
        17,
        18,
        18,
        18,
        18,
        17,
        18,
        18,
        18,
        18,
        18,
        18,
        17,
        18,
        19,
        18,
        17,
        17,
        18,
        18,
        18,
        18,
        17,
        18,
        18,
        18,
        18,
        18,
        18,
        19,
        18,
        18,
        18,
        18,
        19,
        18,
        19,
        18,
        18,
        18,
        18,
        18,
        18,
        18,
        18,
        18,
        18,
        18,
        17,
        18,
        19,
        19,
        19,
        17,
        17,
        17,
        19,
        19,
        18,
        18,
        17,
        18,
        18,
        19,
        18,
        18,
        18,
        17,
        18,
        18,
        18,
        18,
        18,
        18,
        18,
        18,
        17,
        18,
        18,
        19,
        18,
        17,
        18,
        18,
        18,
        17,
        18,
        18,
        19
      ]
    }
  ]
}