{
  "project_info": {
    "project_number": "706147142498",
    "firebase_url": "https://net-oursci.firebaseio.com",
    "project_id": "net-oursci",
    "storage_bucket": "net-oursci.appspot.com"
  },
  "client": [
    {
      "client_info": {
        "mobilesdk_app_id": "1:706147142498:android:eff2413807377248",
        "android_client_info": {
          "package_name": "org.oursci.android.ourscikit"
        }
      },
      "oauth_client": [
        {
          "client_id": "706147142498-lvmkireo87u8est30brst9ajf66sbmdq.apps.googleusercontent.com",
          "client_type": 1,
          "android_info": {
            "package_name": "org.oursci.android.ourscikit",
            "certificate_hash": "4bbc98c4efb68249547d7389be1ba02c14a7ba9d"
          }
        },
        {
          "client_id": "706147142498-agm626cfjl04upvtik3vfenq513fmv4f.apps.googleusercontent.com",
          "client_type": 1,
          "android_info": {
            "package_name": "org.oursci.android.ourscikit",
            "certificate_hash": "2d4a27f549c1a12a9dbfe489ee0f03374a960cf4"
          }
        },
        {
          "client_id": "706147142498-8e7rovp0nl2jfl4533cdqn1likn8pe2j.apps.googleusercontent.com",
          "client_type": 1,
          "android_info": {
            "package_name": "org.oursci.android.ourscikit",
            "certificate_hash": "baacc3b0a678473083c39667ac130cdfd1ecc591"
          }
        },
        {
          "client_id": "706147142498-3e6k0pnqo0l4eqc62b81tiulng2vtjlp.apps.googleusercontent.com",
          "client_type": 3
        }
      ],
      "api_key": [
        {
          "current_key": "AIzaSyCoH1ojHvwi_h-wq73gma1b8iHoREZ4yyo"
        },
        {
          "current_key": "AIzaSyDnh558dBJgz-x6GyS2i2MfKmayJaoCXUE"
        }
      ],
      "services": {
        "analytics_service": {
          "status": 1
        },
        "appinvite_service": {
          "status": 2,
          "other_platform_oauth_client": [
            {
              "client_id": "706147142498-3e6k0pnqo0l4eqc62b81tiulng2vtjlp.apps.googleusercontent.com",
              "client_type": 3
            }
          ]
        },
        "ads_service": {
          "status": 2
        }
      }
    },
    {
      "client_info": {
        "mobilesdk_app_id": "1:706147142498:android:8f0e4f5de15cc0a1",
        "android_client_info": {
          "package_name": "org.oursci.android.ourscikit.debug"
        }
      },
      "oauth_client": [
        {
          "client_id": "706147142498-gkjst426jaifq035rnbp78p6p910mt6p.apps.googleusercontent.com",
          "client_type": 1,
          "android_info": {
            "package_name": "org.oursci.android.ourscikit.debug",
            "certificate_hash": "baacc3b0a678473083c39667ac130cdfd1ecc591"
          }
        },
        {
          "client_id": "706147142498-3e6k0pnqo0l4eqc62b81tiulng2vtjlp.apps.googleusercontent.com",
          "client_type": 3
        }
      ],
      "api_key": [
        {
          "current_key": "AIzaSyCoH1ojHvwi_h-wq73gma1b8iHoREZ4yyo"
        },
        {
          "current_key": "AIzaSyDnh558dBJgz-x6GyS2i2MfKmayJaoCXUE"
        }
      ],
      "services": {
        "analytics_service": {
          "status": 1
        },
        "appinvite_service": {
          "status": 2,
          "other_platform_oauth_client": [
            {
              "client_id": "706147142498-3e6k0pnqo0l4eqc62b81tiulng2vtjlp.apps.googleusercontent.com",
              "client_type": 3
            }
          ]
        },
        "ads_service": {
          "status": 2
        }
      }
    },
    {
      "client_info": {
        "mobilesdk_app_id": "1:706147142498:android:d2ff619aea6fa6f2",
        "android_client_info": {
          "package_name": "org.oursci.android.quickcarbon"
        }
      },
      "oauth_client": [
        {
          "client_id": "706147142498-ondm1pr27go6jg6mniu8td8fvimkqki0.apps.googleusercontent.com",
          "client_type": 1,
          "android_info": {
            "package_name": "org.oursci.android.quickcarbon",
            "certificate_hash": "baacc3b0a678473083c39667ac130cdfd1ecc591"
          }
        },
        {
          "client_id": "706147142498-3e6k0pnqo0l4eqc62b81tiulng2vtjlp.apps.googleusercontent.com",
          "client_type": 3
        }
      ],
      "api_key": [
        {
          "current_key": "AIzaSyCoH1ojHvwi_h-wq73gma1b8iHoREZ4yyo"
        },
        {
          "current_key": "AIzaSyDnh558dBJgz-x6GyS2i2MfKmayJaoCXUE"
        }
      ],
      "services": {
        "analytics_service": {
          "status": 1
        },
        "appinvite_service": {
          "status": 2,
          "other_platform_oauth_client": [
            {
              "client_id": "706147142498-3e6k0pnqo0l4eqc62b81tiulng2vtjlp.apps.googleusercontent.com",
              "client_type": 3
            }
          ]
        },
        "ads_service": {
          "status": 2
        }
      }
    },
    {
      "client_info": {
        "mobilesdk_app_id": "1:706147142498:android:0d7fae5164e24f06",
        "android_client_info": {
          "package_name": "org.oursci.android.quickcarbon.debug"
        }
      },
      "oauth_client": [
        {
          "client_id": "706147142498-3e6k0pnqo0l4eqc62b81tiulng2vtjlp.apps.googleusercontent.com",
          "client_type": 3
        }
      ],
      "api_key": [
        {
          "current_key": "AIzaSyCoH1ojHvwi_h-wq73gma1b8iHoREZ4yyo"
        },
        {
          "current_key": "AIzaSyDnh558dBJgz-x6GyS2i2MfKmayJaoCXUE"
        }
      ],
      "services": {
        "analytics_service": {
          "status": 1
        },
        "appinvite_service": {
          "status": 1,
          "other_platform_oauth_client": []
        },
        "ads_service": {
          "status": 2
        }
      }
    }
  ],
  "configuration_version": "1"
}