ID,Failure,Mitigations in place,Chance of failure,Mitigations needed,Possible reason for failure,Testing procedure,Reasoning behind test procedure,Record status,Resolution details
MANUF00001,XXX,,2,,Bed not sticky enough or incorrect brim settings,,,Active,
MANUF00002,Parts have curled edges,,2,,Bed not sticky enough or incorrect brim settings,,,Active,
MANUF00003,Hooks for viton bands not printed correctly,,1,,Poorly calibrated printer (XYZ),,,Active,
MANUF00004,Tappable holes are the wrong size,,4,Nut Trap design improvement,Needs investigation,,,Resolved awaiting release,
MANUF00005,Excessive stringing (between bridges),,1,,"Printer settings issues, filament quality (too much moisture, low quality)",,,Active,
MANUF00006,Brittle flexures controlling the stage,,1,,"filament with too much moisture, low quality filament",,,Active,
MANUF00007,Poor interlayer adhesion,,1,,"Poor quality filament, incorrect print settings",,,Active,
MANUF00008,Weak parts (despite good interlayer adhesion),,1,,"Printer is under-extruding, poor filament quality",,,Active,