(module c_elec_10x7.7 (layer F.Cu) (tedit 49F5D21A)
  (descr "SMT capacitor, aluminium electrolytic, 10x7.7")
  (fp_text reference c_elec_10x7.7 (at 0 -5.842) (layer F.SilkS)
    (effects (font (size 0.50038 0.50038) (thickness 0.11938)))
  )
  (fp_text value C*** (at 0 5.842) (layer F.SilkS) hide
    (effects (font (size 0.50038 0.50038) (thickness 0.11938)))
  )
  (fp_line (start -4.826 1.016) (end -4.826 -1.016) (layer F.SilkS) (width 0.127))
  (fp_line (start -4.699 -1.397) (end -4.699 1.524) (layer F.SilkS) (width 0.127))
  (fp_line (start -4.572 1.778) (end -4.572 -1.778) (layer F.SilkS) (width 0.127))
  (fp_line (start -4.445 -2.159) (end -4.445 2.159) (layer F.SilkS) (width 0.127))
  (fp_line (start -4.318 2.413) (end -4.318 -2.413) (layer F.SilkS) (width 0.127))
  (fp_line (start -4.191 -2.54) (end -4.191 2.54) (layer F.SilkS) (width 0.127))
  (fp_circle (center 0 0) (end 4.953 0) (layer F.SilkS) (width 0.127))
  (fp_line (start -5.207 -5.207) (end -5.207 5.207) (layer F.SilkS) (width 0.127))
  (fp_line (start -5.207 5.207) (end 4.445 5.207) (layer F.SilkS) (width 0.127))
  (fp_line (start 4.445 5.207) (end 5.207 4.445) (layer F.SilkS) (width 0.127))
  (fp_line (start 5.207 4.445) (end 5.207 -4.445) (layer F.SilkS) (width 0.127))
  (fp_line (start 5.207 -4.445) (end 4.445 -5.207) (layer F.SilkS) (width 0.127))
  (fp_line (start 4.445 -5.207) (end -5.207 -5.207) (layer F.SilkS) (width 0.127))
  (fp_line (start 4.572 0) (end 3.81 0) (layer F.SilkS) (width 0.127))
  (fp_line (start 4.191 -0.381) (end 4.191 0.381) (layer F.SilkS) (width 0.127))
  (pad 1 smd rect (at 4.0005 0) (size 4.0005 2.4003) (layers F.Cu F.Paste F.Mask))
  (pad 2 smd rect (at -4.0005 0) (size 4.0005 2.4003) (layers F.Cu F.Paste F.Mask))
  (model walter\smd_cap\c_elec_10x7_7.wrl
    (at (xyz 0 0 0))
    (scale (xyz 1 1 1))
    (rotate (xyz 0 0 0))
  )
)
