(module sot23-5 (layer F.Cu) (tedit 490475A6)
  (descr SOT23-5)
  (fp_text reference SOT23-5 (at 0 -2.0574) (layer F.SilkS)
    (effects (font (size 0.50038 0.50038) (thickness 0.09906)))
  )
  (fp_text value Q*** (at 0 0) (layer F.SilkS) hide
    (effects (font (size 0.50038 0.50038) (thickness 0.09906)))
  )
  (fp_line (start -0.8509 0.6985) (end -1.4986 0.0508) (layer F.SilkS) (width 0.127))
  (fp_line (start -1.0033 0.6985) (end -1.4986 0.2032) (layer F.SilkS) (width 0.127))
  (fp_line (start 0.9525 -0.6985) (end 0.9525 -1.3589) (layer F.SilkS) (width 0.127))
  (fp_line (start -0.9525 -0.6985) (end -0.9525 -1.3589) (layer F.SilkS) (width 0.127))
  (fp_line (start 0 0.6985) (end 0 1.3589) (layer F.SilkS) (width 0.127))
  (fp_line (start 0.9525 0.6985) (end 0.9525 1.3589) (layer F.SilkS) (width 0.127))
  (fp_line (start -0.9525 0.6985) (end -0.9525 1.3589) (layer F.SilkS) (width 0.127))
  (fp_line (start -1.4986 -0.6985) (end 1.4986 -0.6985) (layer F.SilkS) (width 0.127))
  (fp_line (start 1.4986 -0.6985) (end 1.4986 0.6985) (layer F.SilkS) (width 0.127))
  (fp_line (start 1.4986 0.6985) (end -1.4986 0.6985) (layer F.SilkS) (width 0.127))
  (fp_line (start -1.4986 0.6985) (end -1.4986 -0.6985) (layer F.SilkS) (width 0.127))
  (pad 1 smd rect (at -0.9525 1.05664) (size 0.59944 1.00076) (layers F.Cu F.Paste F.Mask))
  (pad 3 smd rect (at 0.9525 1.05664) (size 0.59944 1.00076) (layers F.Cu F.Paste F.Mask))
  (pad 2 smd rect (at 0 1.05664) (size 0.59944 1.00076) (layers F.Cu F.Paste F.Mask))
  (pad 4 smd rect (at 0.9525 -1.05664) (size 0.59944 1.00076) (layers F.Cu F.Paste F.Mask))
  (pad 5 smd rect (at -0.9525 -1.05664) (size 0.59944 1.00076) (layers F.Cu F.Paste F.Mask))
  (model walter\smd_trans\sot23-5.wrl
    (at (xyz 0 0 0))
    (scale (xyz 1 1 1))
    (rotate (xyz 0 0 0))
  )
)
