(module WCSP-8_2 (layer F.Cu)
  (at 0 0)
  (tags "yzf, WCSP-8, tmp006")
  (path /522F8928)
  (attr smd)
  (fp_text reference U113 (at -0.0254 -0.9144) (layer F.SilkS)
    (effects (font (size 0.2 0.2) (thickness 0.02)))
  )
  (fp_text value TMP006 (at 0.0254 0.9652) (layer F.SilkS)
    (effects (font (size 0.2 0.2) (thickness 0.02)))
  )
  (fp_line (start -0.7874 -0.7874) (end 0.7874 -0.7874) (layer F.SilkS) (width 0.02))
  (fp_line (start 0.7874 -0.7874) (end 0.7874 0.7874) (layer F.SilkS) (width 0.02))
  (fp_line (start 0.7874 0.7874) (end -0.7874 0.7874) (layer F.SilkS) (width 0.02))
  (fp_line (start -0.7874 0.7874) (end -0.7874 -0.7874) (layer F.SilkS) (width 0.02))
  (pad a1 smd circle (at -0.5 -0.5) (size 0.3 0.3)
    (layers F.Cu F.Paste F.Mask)
  )
  (pad a2 smd circle (at 0 -0.5) (size 0.3 0.3)
    (layers F.Cu F.Paste F.Mask)
  )
  (pad a3 smd circle (at 0.5 -0.5) (size 0.3 0.3)
    (layers F.Cu F.Paste F.Mask)
    (clearance 0.2)
  )
  (pad b3 smd circle (at 0.5 0) (size 0.3 0.3)
    (layers F.Cu F.Paste F.Mask)
  )
  (pad c3 smd circle (at 0.5 0.5) (size 0.3 0.3)
    (layers F.Cu F.Paste F.Mask)
  )
  (pad c2 smd circle (at 0 0.5) (size 0.3 0.3)
    (layers F.Cu F.Paste F.Mask)
  )
  (pad c1 smd circle (at -0.5 0.5) (size 0.3 0.3)
    (layers F.Cu F.Paste F.Mask)
  )
  (pad b1 smd circle (at -0.5 0) (size 0.3 0.3)
    (layers F.Cu F.Paste F.Mask)
  )
  (pad a2 smd rect (at 0 0) (size 0.35 0.35)
    (layers F.Cu)
  )
)
