M48
;DRILL file {KiCad 0.201510090346+6256~30~ubuntu15.04.1-product} date Wed 02 Dec 2015 02:22:56 PM EST
;FORMAT={-:-/ absolute / inch / decimal}
FMAT,2
INCH,TZ
T1C0.026
T2C0.028
%
G90
G05
M72
T1
X2.3114Y-2.9417
T2
X2.0244Y-2.774
X2.0874Y-2.774
T1
X2.3114Y-3.2193G85X2.3114Y-3.2311
G05
T0
M30
