(module melf (layer F.Cu) (tedit 488CBC8E)
  (descr Melf)
  (fp_text reference Melf (at 0 -2.54) (layer F.SilkS)
    (effects (font (thickness 0.3048)))
  )
  (fp_text value D*** (at 0 2.54) (layer F.SilkS) hide
    (effects (font (thickness 0.3048)))
  )
  (fp_line (start 1.3716 -1.2954) (end 1.3716 1.2954) (layer F.SilkS) (width 0.127))
  (fp_line (start 1.1303 1.2954) (end 1.1303 -1.2954) (layer F.SilkS) (width 0.127))
  (fp_line (start 1.2573 -1.2954) (end 1.2573 1.2954) (layer F.SilkS) (width 0.127))
  (fp_line (start 1.0033 -1.2954) (end 1.0033 1.2954) (layer F.SilkS) (width 0.127))
  (fp_line (start -2.6035 -1.2954) (end -2.6035 1.2954) (layer F.SilkS) (width 0.127))
  (fp_line (start -2.6035 1.2954) (end 2.6035 1.2954) (layer F.SilkS) (width 0.127))
  (fp_line (start 2.6035 1.2954) (end 2.6035 -1.2954) (layer F.SilkS) (width 0.127))
  (fp_line (start 2.6035 -1.2954) (end -2.6035 -1.2954) (layer F.SilkS) (width 0.127))
  (pad 1 smd rect (at -2.62382 0) (size 1.24968 2.99974) (layers F.Cu F.Paste F.Mask))
  (pad 2 smd rect (at 2.62382 0) (size 1.24968 2.99974) (layers F.Cu F.Paste F.Mask))
  (model walter\smd_diode\melf.wrl
    (at (xyz 0 0 0))
    (scale (xyz 1 1 1))
    (rotate (xyz 0 0 0))
  )
)
