Designator,MPN/Seeed SKU,Qty
BT1,54,1
"R7,R8,R10,R88",ERJ-3GEYJ103V,4
D11,LHUV-0385-A045,1
D2,QBLP617-IG,1
"C1,C5,C24,C34",CC0603KRX7R8BB104,4
P2,10118194-0001LF,1
Q11,2N7002K-T1-E3,1
"U8,U21",AD8665ARZ,2
D9,APT1608SF4C-PRV,1
SW1,APTCLGTVTR,1
U4,BME680,1
U16,BQ24092DGQR,1
C6,CL10C220FB8NNNC,1
"C3,C15,C31",GRM1885C1H472JA01D,3
"C51,C55",GRM32ER61A107ME20L,2
"R11,R22,R87,R91",CRCW0603100KJNEA,4
X1,CX3225SB16000D0GZJC1,1
U5,DG4157EDL-T1-GE3,1
"Q1,Q2,Q3",DMG2305UX-7,3
"R32,R77,R93",ERA-3AEB3160V,3
"R21,R33,R34,R35,R39,R63,R84,R85",ERJ-3GEY0R00V,8
"R45,R46",ERJ-3GEYJ330V,2
"R5,R47,R48",ERJ-3GEYJ681V,3
C50,GRM1885C1H102JA01D,1
C12,GRM1885C1H151JA01D,1
C62,GRM1885C1H561JA01D,1
"C4,C7,C8,C9,C10,C11,C14,C16,C18,C19,C20,C23,C25,C27,C28,C29,C30,C35,C36,C37,C38,C39,C40,C41,C42,C43,C44,C59,C64,C66",GRM188R61A106KE69D,30
P1,GRPB052VWVN-RC,1
"R25,R90",KTR18EZPF3R00,2
U3,LDL1117S50R,1
D15,LXZ1-PD01,1
D16,LXZ1-PE01,1
D14,LXZ1-PL01,1
D13,LXZ1-PM01,1
D12,LXZ1-PR01,1
"L1,L2,L4,L5,L6,L7,L8,L10",MI0805K601R-10,8
U15,MK20DX256VLH7,1
R57,RC0603FR-071ML,1
R58,RC0603FR-07249KL,1
"R3,R6,R52",RC0603JR-07130KL,3
"R12,R13,R14,R16,R17,R23,R26,R67,R68,R69,R70,R71",RC0603JR-07150RL,12
"R27,R30,R36,R43,R44,R56",RR0816P-103-D,6
R29,RT0603DRD0713KL,1
"R15,R31,R92",RT0603DRD071KL,3
"R1,R2,R4,R9,R18,R19,R20,R24,R49,R53,R64,R65,R66,R72,R73,R74,R75,R76,R86",ERJ-3GEYJ202V,19
"R28,R55",RT0603DRE07240RL,2
D8,SFH 4056,1
Q12,SIA483DJ-T1-GE3,1
J1,SJ1-3523N,1
Q4,SIA418DJ-T1-GE3,1
L3,SRN4026-1R2Y,1
U18,TPS61251DSGR,1
"U6,U17",TSV911ILT,2
"Q13,Q14,Q15,Q16,Q17",TT8J13TCR,5
D10,VLMU1610-365-135,1
D20,XZTNI53W-8,1
