(module A2001-SR04 (layer F.Cu) (tedit 56EAD676)
  (tags "connector, 4 position")
  (attr smd)
  (fp_text reference REF** (at 0 0) (layer F.SilkS)
    (effects (font (size 1 1) (thickness 0.1)))
  )
  (fp_text value A2001-SR04 (at 0.1 -2) (layer F.Fab)
    (effects (font (size 1 1) (thickness 0.1)))
  )
  (fp_line (start 6 3) (end 6 4.5) (layer F.SilkS) (width 0.15))
  (fp_line (start 6 4.5) (end 5 4.5) (layer F.SilkS) (width 0.15))
  (fp_line (start 5 4.5) (end 5 3) (layer F.SilkS) (width 0.15))
  (fp_line (start -6 3) (end -6 4.5) (layer F.SilkS) (width 0.15))
  (fp_line (start -6 4.5) (end -5 4.5) (layer F.SilkS) (width 0.15))
  (fp_line (start -5 4.5) (end -5 3) (layer F.SilkS) (width 0.15))
  (fp_line (start -6 -3) (end 6 -3) (layer F.SilkS) (width 0.15))
  (fp_line (start 6 -3) (end 6 3) (layer F.SilkS) (width 0.15))
  (fp_line (start 6 3) (end -6 3) (layer F.SilkS) (width 0.15))
  (fp_line (start -6 3) (end -6 -3) (layer F.SilkS) (width 0.15))
  (pad 1 smd rect (at -3 4.6) (size 1 3) (layers F.Cu F.Paste F.Mask))
  (pad 2 smd rect (at -1 4.6) (size 1 3) (layers F.Cu F.Paste F.Mask))
  (pad 3 smd rect (at 1 4.6) (size 1 3) (layers F.Cu F.Paste F.Mask))
  (pad 4 smd rect (at 3 4.6) (size 1 3) (layers F.Cu F.Paste F.Mask))
  (pad 0 smd rect (at -5.1 0.3) (size 1.5 8) (layers F.Cu F.Paste F.Mask))
  (pad 0 smd rect (at 5.1 0.3) (size 1.5 8) (layers F.Cu F.Paste F.Mask))
)
