(module sod87 (layer F.Cu) (tedit 4904754D)
  (descr SOD87)
  (fp_text reference SOD87 (at 0.0254 -1.8542) (layer F.SilkS)
    (effects (font (size 1.00076 1.00076) (thickness 0.20066)))
  )
  (fp_text value D*** (at 0 1.8034) (layer F.SilkS) hide
    (effects (font (size 1.00076 1.00076) (thickness 0.20066)))
  )
  (fp_line (start 1.0541 1.0033) (end 1.0541 -1.0033) (layer F.SilkS) (width 0.127))
  (fp_line (start 0.9271 -1.0033) (end 0.9271 1.0033) (layer F.SilkS) (width 0.127))
  (fp_line (start 0.8001 -1.0033) (end 0.8001 1.0033) (layer F.SilkS) (width 0.127))
  (fp_line (start -1.8542 1.0033) (end -1.8542 -1.0033) (layer F.SilkS) (width 0.127))
  (fp_line (start -1.8542 -1.0033) (end 1.8542 -1.0033) (layer F.SilkS) (width 0.127))
  (fp_line (start 1.8542 -1.0033) (end 1.8542 1.0033) (layer F.SilkS) (width 0.127))
  (fp_line (start 1.8542 1.0033) (end -1.8542 1.0033) (layer F.SilkS) (width 0.127))
  (pad 1 smd rect (at -1.84912 0) (size 1.00076 2.30124) (layers F.Cu F.Paste F.Mask))
  (pad 2 smd rect (at 1.84912 0) (size 1.00076 2.30124) (layers F.Cu F.Paste F.Mask))
  (model walter\smd_diode\sod87.wrl
    (at (xyz 0 0 0))
    (scale (xyz 1 1 1))
    (rotate (xyz 0 0 0))
  )
)
