(kicad_pcb (version 20171130) (host pcbnew "(5.0.0-rc2-dev-310-g1cd6477)")

  (general
    (thickness 1.6)
    (drawings 2)
    (tracks 0)
    (zones 0)
    (modules 19)
    (nets 85)
  )

  (page A4)
  (layers
    (0 F.Cu mixed)
    (31 B.Cu mixed)
    (32 B.Adhes user)
    (33 F.Adhes user)
    (34 B.Paste user)
    (35 F.Paste user)
    (36 B.SilkS user)
    (37 F.SilkS user)
    (38 B.Mask user)
    (39 F.Mask user)
    (40 Dwgs.User user)
    (41 Cmts.User user)
    (42 Eco1.User user)
    (43 Eco2.User user)
    (44 Edge.Cuts user)
    (45 Margin user)
    (46 B.CrtYd user)
    (47 F.CrtYd user)
    (48 B.Fab user)
    (49 F.Fab user)
  )

  (setup
    (last_trace_width 0.25)
    (trace_clearance 0.2)
    (zone_clearance 0.508)
    (zone_45_only no)
    (trace_min 0.2)
    (segment_width 0.2)
    (edge_width 0.2)
    (via_size 0.8)
    (via_drill 0.4)
    (via_min_size 0.4)
    (via_min_drill 0.3)
    (uvia_size 0.3)
    (uvia_drill 0.1)
    (uvias_allowed no)
    (uvia_min_size 0.2)
    (uvia_min_drill 0.1)
    (pcb_text_width 0.3)
    (pcb_text_size 1.5 1.5)
    (mod_edge_width 0.15)
    (mod_text_size 1 1)
    (mod_text_width 0.15)
    (pad_size 1.7 1.7)
    (pad_drill 1)
    (pad_to_mask_clearance 0.051)
    (solder_mask_min_width 0.25)
    (aux_axis_origin 0 0)
    (visible_elements FFFFEF7F)
    (pcbplotparams
      (layerselection 0x010fc_ffffffff)
      (usegerberextensions false)
      (usegerberattributes false)
      (usegerberadvancedattributes false)
      (creategerberjobfile false)
      (excludeedgelayer true)
      (linewidth 0.100000)
      (plotframeref false)
      (viasonmask false)
      (mode 1)
      (useauxorigin false)
      (hpglpennumber 1)
      (hpglpenspeed 20)
      (hpglpendiameter 15)
      (psnegative false)
      (psa4output false)
      (plotreference true)
      (plotvalue true)
      (plotinvisibletext false)
      (padsonsilk false)
      (subtractmaskfromsilk false)
      (outputformat 1)
      (mirror false)
      (drillshape 1)
      (scaleselection 1)
      (outputdirectory ""))
  )

  (net 0 "")
  (net 1 "Net-(J1-Pad1)")
  (net 2 "Net-(J1-Pad2)")
  (net 3 "Net-(U1-Pad31)")
  (net 4 "Net-(U1-Pad32)")
  (net 5 "Net-(U1-Pad34)")
  (net 6 GND)
  (net 7 "Net-(U3-Pad16)")
  (net 8 "Net-(U3-Pad7)")
  (net 9 "Net-(U3-Pad6)")
  (net 10 "Net-(U3-Pad13)")
  (net 11 "Net-(U3-Pad10)")
  (net 12 "Net-(U4-Pad10)")
  (net 13 "Net-(U4-Pad16)")
  (net 14 "Net-(U2-Pad16)")
  (net 15 "Net-(U2-Pad15)")
  (net 16 "Net-(U2-Pad13)")
  (net 17 "Net-(M2-Pad2)")
  (net 18 "Net-(M2-Pad1)")
  (net 19 "Net-(M1-Pad4)")
  (net 20 "Net-(M1-Pad3)")
  (net 21 "Net-(M1-Pad2)")
  (net 22 "Net-(M1-Pad1)")
  (net 23 "Net-(M3-Pad2)")
  (net 24 "Net-(M3-Pad1)")
  (net 25 "Net-(M4-Pad1)")
  (net 26 "Net-(M4-Pad2)")
  (net 27 "Net-(U5-Pad2)")
  (net 28 "Net-(U5-Pad1)")
  (net 29 "Net-(U5-Pad6)")
  (net 30 "Net-(U5-Pad5)")
  (net 31 "Net-(U5-Pad4)")
  (net 32 "Net-(U5-Pad8)")
  (net 33 "Net-(U5-Pad11)")
  (net 34 "Net-(U5-Pad12)")
  (net 35 "Net-(U5-Pad13)")
  (net 36 "Net-(U5-Pad9)")
  (net 37 "Net-(U5-Pad10)")
  (net 38 "Net-(U5-Pad7)")
  (net 39 "Net-(U7-Pad18)")
  (net 40 "Net-(U7-Pad19)")
  (net 41 V3V)
  (net 42 "Net-(U7-Pad15)")
  (net 43 "Net-(U7-Pad14)")
  (net 44 "Net-(U7-Pad32)")
  (net 45 V6V)
  (net 46 "Net-(U7-Pad34)")
  (net 47 "Net-(U7-Pad35)")
  (net 48 "Net-(U7-Pad36)")
  (net 49 "Net-(U7-Pad37)")
  (net 50 "Net-(U7-Pad13)")
  (net 51 "Net-(U7-Pad8)")
  (net 52 "Net-(U7-Pad7)")
  (net 53 "Net-(U7-Pad4)")
  (net 54 "Net-(U1-Pad2)")
  (net 55 "Net-(U1-Pad1)")
  (net 56 "Net-(U7-Pad39)")
  (net 57 "Net-(U7-Pad40)")
  (net 58 "Net-(U7-Pad46)")
  (net 59 "Net-(U7-Pad47)")
  (net 60 "Net-(U7-Pad48)")
  (net 61 "Net-(U7-Pad45)")
  (net 62 "Net-(U7-Pad44)")
  (net 63 "Net-(U7-Pad49)")
  (net 64 "Net-(U7-Pad50)")
  (net 65 "Net-(U7-Pad43)")
  (net 66 "Net-(U7-Pad51)")
  (net 67 "Net-(U7-Pad42)")
  (net 68 "Net-(U7-Pad41)")
  (net 69 "Net-(U7-Pad52)")
  (net 70 "Net-(U7-Pad38)")
  (net 71 "Net-(U7-Pad54)")
  (net 72 VMOT)
  (net 73 "Net-(R1-Pad2)")
  (net 74 "Net-(U7-Pad10)")
  (net 75 "Net-(U7-Pad9)")
  (net 76 "Net-(J2-Pad4)")
  (net 77 "Net-(J2-Pad3)")
  (net 78 "Net-(J2-Pad2)")
  (net 79 "Net-(J2-Pad1)")
  (net 80 "Net-(U7-Pad20)")
  (net 81 "Net-(J3-Pad1)")
  (net 82 "Net-(J3-Pad2)")
  (net 83 "Net-(J3-Pad3)")
  (net 84 "Net-(J3-Pad4)")

  (net_class Default "This is the default net class."
    (clearance 0.2)
    (trace_width 0.25)
    (via_dia 0.8)
    (via_drill 0.4)
    (uvia_dia 0.3)
    (uvia_drill 0.1)
    (add_net GND)
    (add_net "Net-(J1-Pad1)")
    (add_net "Net-(J1-Pad2)")
    (add_net "Net-(J2-Pad1)")
    (add_net "Net-(J2-Pad2)")
    (add_net "Net-(J2-Pad3)")
    (add_net "Net-(J2-Pad4)")
    (add_net "Net-(J3-Pad1)")
    (add_net "Net-(J3-Pad2)")
    (add_net "Net-(J3-Pad3)")
    (add_net "Net-(J3-Pad4)")
    (add_net "Net-(M1-Pad1)")
    (add_net "Net-(M1-Pad2)")
    (add_net "Net-(M1-Pad3)")
    (add_net "Net-(M1-Pad4)")
    (add_net "Net-(M2-Pad1)")
    (add_net "Net-(M2-Pad2)")
    (add_net "Net-(M3-Pad1)")
    (add_net "Net-(M3-Pad2)")
    (add_net "Net-(M4-Pad1)")
    (add_net "Net-(M4-Pad2)")
    (add_net "Net-(R1-Pad2)")
    (add_net "Net-(U1-Pad1)")
    (add_net "Net-(U1-Pad2)")
    (add_net "Net-(U1-Pad31)")
    (add_net "Net-(U1-Pad32)")
    (add_net "Net-(U1-Pad34)")
    (add_net "Net-(U2-Pad13)")
    (add_net "Net-(U2-Pad15)")
    (add_net "Net-(U2-Pad16)")
    (add_net "Net-(U3-Pad10)")
    (add_net "Net-(U3-Pad13)")
    (add_net "Net-(U3-Pad16)")
    (add_net "Net-(U3-Pad6)")
    (add_net "Net-(U3-Pad7)")
    (add_net "Net-(U4-Pad10)")
    (add_net "Net-(U4-Pad16)")
    (add_net "Net-(U5-Pad1)")
    (add_net "Net-(U5-Pad10)")
    (add_net "Net-(U5-Pad11)")
    (add_net "Net-(U5-Pad12)")
    (add_net "Net-(U5-Pad13)")
    (add_net "Net-(U5-Pad2)")
    (add_net "Net-(U5-Pad4)")
    (add_net "Net-(U5-Pad5)")
    (add_net "Net-(U5-Pad6)")
    (add_net "Net-(U5-Pad7)")
    (add_net "Net-(U5-Pad8)")
    (add_net "Net-(U5-Pad9)")
    (add_net "Net-(U7-Pad10)")
    (add_net "Net-(U7-Pad13)")
    (add_net "Net-(U7-Pad14)")
    (add_net "Net-(U7-Pad15)")
    (add_net "Net-(U7-Pad18)")
    (add_net "Net-(U7-Pad19)")
    (add_net "Net-(U7-Pad20)")
    (add_net "Net-(U7-Pad32)")
    (add_net "Net-(U7-Pad34)")
    (add_net "Net-(U7-Pad35)")
    (add_net "Net-(U7-Pad36)")
    (add_net "Net-(U7-Pad37)")
    (add_net "Net-(U7-Pad38)")
    (add_net "Net-(U7-Pad39)")
    (add_net "Net-(U7-Pad4)")
    (add_net "Net-(U7-Pad40)")
    (add_net "Net-(U7-Pad41)")
    (add_net "Net-(U7-Pad42)")
    (add_net "Net-(U7-Pad43)")
    (add_net "Net-(U7-Pad44)")
    (add_net "Net-(U7-Pad45)")
    (add_net "Net-(U7-Pad46)")
    (add_net "Net-(U7-Pad47)")
    (add_net "Net-(U7-Pad48)")
    (add_net "Net-(U7-Pad49)")
    (add_net "Net-(U7-Pad50)")
    (add_net "Net-(U7-Pad51)")
    (add_net "Net-(U7-Pad52)")
    (add_net "Net-(U7-Pad54)")
    (add_net "Net-(U7-Pad7)")
    (add_net "Net-(U7-Pad8)")
    (add_net "Net-(U7-Pad9)")
    (add_net V3V)
    (add_net V6V)
    (add_net VMOT)
  )

  (module Pin_Headers:Pin_Header_Straight_1x04_Pitch2.54mm (layer F.Cu) (tedit 59650532) (tstamp 609DD0CA)
    (at 228.54 51.77)
    (descr "Through hole straight pin header, 1x04, 2.54mm pitch, single row")
    (tags "Through hole pin header THT 1x04 2.54mm single row")
    (path /60A1BE73)
    (fp_text reference J3 (at 0 -2.33) (layer F.SilkS)
      (effects (font (size 1 1) (thickness 0.15)))
    )
    (fp_text value Conn_01x04_Female-reordered (at 0 9.95) (layer F.Fab)
      (effects (font (size 1 1) (thickness 0.15)))
    )
    (fp_text user %R (at 0 3.81 90) (layer F.Fab)
      (effects (font (size 1 1) (thickness 0.15)))
    )
    (fp_line (start 1.8 -1.8) (end -1.8 -1.8) (layer F.CrtYd) (width 0.05))
    (fp_line (start 1.8 9.4) (end 1.8 -1.8) (layer F.CrtYd) (width 0.05))
    (fp_line (start -1.8 9.4) (end 1.8 9.4) (layer F.CrtYd) (width 0.05))
    (fp_line (start -1.8 -1.8) (end -1.8 9.4) (layer F.CrtYd) (width 0.05))
    (fp_line (start -1.33 -1.33) (end 0 -1.33) (layer F.SilkS) (width 0.12))
    (fp_line (start -1.33 0) (end -1.33 -1.33) (layer F.SilkS) (width 0.12))
    (fp_line (start -1.33 1.27) (end 1.33 1.27) (layer F.SilkS) (width 0.12))
    (fp_line (start 1.33 1.27) (end 1.33 8.95) (layer F.SilkS) (width 0.12))
    (fp_line (start -1.33 1.27) (end -1.33 8.95) (layer F.SilkS) (width 0.12))
    (fp_line (start -1.33 8.95) (end 1.33 8.95) (layer F.SilkS) (width 0.12))
    (fp_line (start -1.27 -0.635) (end -0.635 -1.27) (layer F.Fab) (width 0.1))
    (fp_line (start -1.27 8.89) (end -1.27 -0.635) (layer F.Fab) (width 0.1))
    (fp_line (start 1.27 8.89) (end -1.27 8.89) (layer F.Fab) (width 0.1))
    (fp_line (start 1.27 -1.27) (end 1.27 8.89) (layer F.Fab) (width 0.1))
    (fp_line (start -0.635 -1.27) (end 1.27 -1.27) (layer F.Fab) (width 0.1))
    (pad 4 thru_hole oval (at 0 7.62) (size 1.7 1.7) (drill 1) (layers *.Cu *.Mask)
      (net 84 "Net-(J3-Pad4)"))
    (pad 3 thru_hole oval (at 0 5.08) (size 1.7 1.7) (drill 1) (layers *.Cu *.Mask)
      (net 83 "Net-(J3-Pad3)"))
    (pad 2 thru_hole oval (at 0 2.54) (size 1.7 1.7) (drill 1) (layers *.Cu *.Mask)
      (net 82 "Net-(J3-Pad2)"))
    (pad 1 thru_hole rect (at 0 0) (size 1.7 1.7) (drill 1) (layers *.Cu *.Mask)
      (net 81 "Net-(J3-Pad1)"))
    (model ${KISYS3DMOD}/Pin_Headers.3dshapes/Pin_Header_Straight_1x04_Pitch2.54mm.wrl
      (at (xyz 0 0 0))
      (scale (xyz 1 1 1))
      (rotate (xyz 0 0 0))
    )
  )

  (module Pin_Headers:Pin_Header_Straight_1x04_Pitch2.54mm (layer F.Cu) (tedit 59650532) (tstamp 609DC006)
    (at 181.63 50.66)
    (descr "Through hole straight pin header, 1x04, 2.54mm pitch, single row")
    (tags "Through hole pin header THT 1x04 2.54mm single row")
    (path /60AA9565)
    (fp_text reference J2 (at 0 -2.33) (layer F.SilkS)
      (effects (font (size 1 1) (thickness 0.15)))
    )
    (fp_text value Conn_01x04_Female-reordered (at 0 9.95) (layer F.Fab)
      (effects (font (size 1 1) (thickness 0.15)))
    )
    (fp_text user %R (at -0.28 3.07 90) (layer F.Fab)
      (effects (font (size 1 1) (thickness 0.15)))
    )
    (fp_line (start 1.8 -1.8) (end -1.8 -1.8) (layer F.CrtYd) (width 0.05))
    (fp_line (start 1.8 9.4) (end 1.8 -1.8) (layer F.CrtYd) (width 0.05))
    (fp_line (start -1.8 9.4) (end 1.8 9.4) (layer F.CrtYd) (width 0.05))
    (fp_line (start -1.8 -1.8) (end -1.8 9.4) (layer F.CrtYd) (width 0.05))
    (fp_line (start -1.33 -1.33) (end 0 -1.33) (layer F.SilkS) (width 0.12))
    (fp_line (start -1.33 0) (end -1.33 -1.33) (layer F.SilkS) (width 0.12))
    (fp_line (start -1.33 1.27) (end 1.33 1.27) (layer F.SilkS) (width 0.12))
    (fp_line (start 1.33 1.27) (end 1.33 8.95) (layer F.SilkS) (width 0.12))
    (fp_line (start -1.33 1.27) (end -1.33 8.95) (layer F.SilkS) (width 0.12))
    (fp_line (start -1.33 8.95) (end 1.33 8.95) (layer F.SilkS) (width 0.12))
    (fp_line (start -1.27 -0.635) (end -0.635 -1.27) (layer F.Fab) (width 0.1))
    (fp_line (start -1.27 8.89) (end -1.27 -0.635) (layer F.Fab) (width 0.1))
    (fp_line (start 1.27 8.89) (end -1.27 8.89) (layer F.Fab) (width 0.1))
    (fp_line (start 1.27 -1.27) (end 1.27 8.89) (layer F.Fab) (width 0.1))
    (fp_line (start -0.635 -1.27) (end 1.27 -1.27) (layer F.Fab) (width 0.1))
    (pad 4 thru_hole oval (at 0 7.62) (size 1.7 1.7) (drill 1) (layers *.Cu *.Mask)
      (net 76 "Net-(J2-Pad4)"))
    (pad 3 thru_hole oval (at 0 5.08) (size 1.7 1.7) (drill 1) (layers *.Cu *.Mask)
      (net 77 "Net-(J2-Pad3)"))
    (pad 2 thru_hole oval (at 0 2.54) (size 1.7 1.7) (drill 1) (layers *.Cu *.Mask)
      (net 78 "Net-(J2-Pad2)"))
    (pad 1 thru_hole rect (at 0 0) (size 1.7 1.7) (drill 1) (layers *.Cu *.Mask)
      (net 79 "Net-(J2-Pad1)"))
    (model ${KISYS3DMOD}/Pin_Headers.3dshapes/Pin_Header_Straight_1x04_Pitch2.54mm.wrl
      (at (xyz 0 0 0))
      (scale (xyz 1 1 1))
      (rotate (xyz 0 0 0))
    )
  )

  (module multispeq:K30_co2_sensor (layer F.Cu) (tedit 609C5FF8) (tstamp 5D80F93F)
    (at 224.72 57.74 90)
    (descr "Through hole straight pin header, 1x04, 2.54mm pitch, single row")
    (tags "Through hole pin header THT 1x04 2.54mm single row")
    (path /5D6DA2E0)
    (fp_text reference J1 (at -46.371 -45.4042 180) (layer F.SilkS)
      (effects (font (size 1 1) (thickness 0.15)))
    )
    (fp_text value "K30 co2 sensor UART Conn" (at -41.38 -48.48 270) (layer F.Fab)
      (effects (font (size 1 1) (thickness 0.15)))
    )
    (fp_text user %R (at -33.88 -52.23 90) (layer F.Fab)
      (effects (font (size 1 1) (thickness 0.15)))
    )
    (fp_line (start -34.919 -43.3958) (end -34.919 -46.9958) (layer F.CrtYd) (width 0.05))
    (fp_line (start -46.119 -43.3958) (end -34.919 -43.3958) (layer F.CrtYd) (width 0.05))
    (fp_line (start -46.119 -46.9958) (end -46.119 -43.3958) (layer F.CrtYd) (width 0.05))
    (fp_line (start -34.919 -46.9958) (end -46.119 -46.9958) (layer F.CrtYd) (width 0.05))
    (fp_line (start -35.389 -46.5258) (end -35.389 -45.1958) (layer F.SilkS) (width 0.12))
    (fp_line (start -36.719 -46.5258) (end -35.389 -46.5258) (layer F.SilkS) (width 0.12))
    (fp_line (start -37.989 -46.5258) (end -37.989 -43.8658) (layer F.SilkS) (width 0.12))
    (fp_line (start -37.989 -43.8658) (end -45.669 -43.8658) (layer F.SilkS) (width 0.12))
    (fp_line (start -37.989 -46.5258) (end -45.669 -46.5258) (layer F.SilkS) (width 0.12))
    (fp_line (start -45.669 -46.5258) (end -45.669 -43.8658) (layer F.SilkS) (width 0.12))
    (fp_line (start -36.084 -46.4658) (end -35.449 -45.8308) (layer F.Fab) (width 0.1))
    (fp_line (start -45.609 -46.4658) (end -36.084 -46.4658) (layer F.Fab) (width 0.1))
    (fp_line (start -45.609 -43.9258) (end -45.609 -46.4658) (layer F.Fab) (width 0.1))
    (fp_line (start -35.449 -43.9258) (end -45.609 -43.9258) (layer F.Fab) (width 0.1))
    (fp_line (start -35.449 -45.8308) (end -35.449 -43.9258) (layer F.Fab) (width 0.1))
    (pad 4 thru_hole oval (at -44.339 -45.1958) (size 1.7 1.7) (drill 1) (layers *.Cu *.Mask)
      (net 6 GND))
    (pad 3 thru_hole oval (at -41.799 -45.1958 90) (size 1.7 1.7) (drill 1) (layers *.Cu *.Mask)
      (net 45 V6V))
    (pad 2 thru_hole oval (at -39.259 -45.1958) (size 1.7 1.7) (drill 1) (layers *.Cu *.Mask)
      (net 2 "Net-(J1-Pad2)"))
    (pad 1 thru_hole rect (at -36.719 -45.1958) (size 1.7 1.7) (drill 1) (layers *.Cu *.Mask)
      (net 1 "Net-(J1-Pad1)"))
    (model ${KISYS3DMOD}/Connector_PinHeader_2.54mm.3dshapes/PinHeader_1x04_P2.54mm_Vertical.wrl
      (at (xyz 0 0 0))
      (scale (xyz 1 1 1))
      (rotate (xyz 0 0 0))
    )
  )

  (module Capacitors_SMD:C_0805_HandSoldering (layer F.Cu) (tedit 58AA84A8) (tstamp 6097A7C8)
    (at 169.35 102.46 270)
    (descr "Capacitor SMD 0805, hand soldering")
    (tags "capacitor 0805")
    (path /60A3AC90)
    (attr smd)
    (fp_text reference C3 (at 0 -1.75 270) (layer F.SilkS)
      (effects (font (size 1 1) (thickness 0.15)))
    )
    (fp_text value CAP_CERAMIC_0805 (at 0 1.75 270) (layer F.Fab)
      (effects (font (size 1 1) (thickness 0.15)))
    )
    (fp_line (start 2.25 0.87) (end -2.25 0.87) (layer F.CrtYd) (width 0.05))
    (fp_line (start 2.25 0.87) (end 2.25 -0.88) (layer F.CrtYd) (width 0.05))
    (fp_line (start -2.25 -0.88) (end -2.25 0.87) (layer F.CrtYd) (width 0.05))
    (fp_line (start -2.25 -0.88) (end 2.25 -0.88) (layer F.CrtYd) (width 0.05))
    (fp_line (start -0.5 0.85) (end 0.5 0.85) (layer F.SilkS) (width 0.12))
    (fp_line (start 0.5 -0.85) (end -0.5 -0.85) (layer F.SilkS) (width 0.12))
    (fp_line (start -1 -0.62) (end 1 -0.62) (layer F.Fab) (width 0.1))
    (fp_line (start 1 -0.62) (end 1 0.62) (layer F.Fab) (width 0.1))
    (fp_line (start 1 0.62) (end -1 0.62) (layer F.Fab) (width 0.1))
    (fp_line (start -1 0.62) (end -1 -0.62) (layer F.Fab) (width 0.1))
    (fp_text user %R (at 0 -1.75 270) (layer F.Fab)
      (effects (font (size 1 1) (thickness 0.15)))
    )
    (pad 2 smd rect (at 1.25 0 270) (size 1.5 1.25) (layers F.Cu F.Paste F.Mask)
      (net 72 VMOT))
    (pad 1 smd rect (at -1.25 0 270) (size 1.5 1.25) (layers F.Cu F.Paste F.Mask)
      (net 6 GND))
    (model Capacitors_SMD.3dshapes/C_0805.wrl
      (at (xyz 0 0 0))
      (scale (xyz 1 1 1))
      (rotate (xyz 0 0 0))
    )
  )

  (module Resistors_SMD:R_0805_HandSoldering (layer F.Cu) (tedit 58E0A804) (tstamp 6097A6CB)
    (at 156.24 101.81)
    (descr "Resistor SMD 0805, hand soldering")
    (tags "resistor 0805")
    (path /609AE388)
    (attr smd)
    (fp_text reference R1 (at 0 -1.7) (layer F.SilkS)
      (effects (font (size 1 1) (thickness 0.15)))
    )
    (fp_text value R (at 0 1.75) (layer F.Fab)
      (effects (font (size 1 1) (thickness 0.15)))
    )
    (fp_line (start 2.35 0.9) (end -2.35 0.9) (layer F.CrtYd) (width 0.05))
    (fp_line (start 2.35 0.9) (end 2.35 -0.9) (layer F.CrtYd) (width 0.05))
    (fp_line (start -2.35 -0.9) (end -2.35 0.9) (layer F.CrtYd) (width 0.05))
    (fp_line (start -2.35 -0.9) (end 2.35 -0.9) (layer F.CrtYd) (width 0.05))
    (fp_line (start -0.6 -0.88) (end 0.6 -0.88) (layer F.SilkS) (width 0.12))
    (fp_line (start 0.6 0.88) (end -0.6 0.88) (layer F.SilkS) (width 0.12))
    (fp_line (start -1 -0.62) (end 1 -0.62) (layer F.Fab) (width 0.1))
    (fp_line (start 1 -0.62) (end 1 0.62) (layer F.Fab) (width 0.1))
    (fp_line (start 1 0.62) (end -1 0.62) (layer F.Fab) (width 0.1))
    (fp_line (start -1 0.62) (end -1 -0.62) (layer F.Fab) (width 0.1))
    (fp_text user %R (at 1.414999 -1.2875) (layer F.Fab)
      (effects (font (size 0.5 0.5) (thickness 0.075)))
    )
    (pad 2 smd rect (at 1.35 0) (size 1.5 1.3) (layers F.Cu F.Paste F.Mask)
      (net 73 "Net-(R1-Pad2)"))
    (pad 1 smd rect (at -1.35 0) (size 1.5 1.3) (layers F.Cu F.Paste F.Mask)
      (net 6 GND))
    (model ${KISYS3DMOD}/Resistors_SMD.3dshapes/R_0805.wrl
      (at (xyz 0 0 0))
      (scale (xyz 1 1 1))
      (rotate (xyz 0 0 0))
    )
  )

  (module multispeq:Teensy30_31_32_All_Pins (layer F.Cu) (tedit 606F5D5F) (tstamp 6097A3F1)
    (at 141.15 109.89 90)
    (descr "Teensy 3.0/3.1/3.2 All Pins")
    (path /609B5A4C)
    (fp_text reference U7 (at 0 -10.16 90) (layer F.SilkS)
      (effects (font (size 1 1) (thickness 0.15)))
    )
    (fp_text value Teensy3.2 (at 0 10.16 90) (layer F.Fab)
      (effects (font (size 1 1) (thickness 0.15)))
    )
    (fp_line (start -5.08 0) (end -2.54 0) (layer F.SilkS) (width 0.15))
    (fp_line (start -5.08 5.08) (end -5.08 0) (layer F.SilkS) (width 0.15))
    (fp_line (start -2.54 5.08) (end -5.08 5.08) (layer F.SilkS) (width 0.15))
    (fp_line (start -2.54 0) (end -2.54 5.08) (layer F.SilkS) (width 0.15))
    (fp_circle (center -3.15 -0.99) (end -2.65 -0.99) (layer F.SilkS) (width 0.15))
    (fp_circle (center -4.47 -0.99) (end -3.97 -0.99) (layer F.SilkS) (width 0.15))
    (fp_line (start -17.78 3.81) (end -19.05 3.81) (layer F.SilkS) (width 0.15))
    (fp_line (start -19.05 3.81) (end -19.05 -3.81) (layer F.SilkS) (width 0.15))
    (fp_line (start -19.05 -3.81) (end -17.78 -3.81) (layer F.SilkS) (width 0.15))
    (fp_line (start -12.7 3.81) (end -12.7 -3.81) (layer F.SilkS) (width 0.15))
    (fp_line (start -12.7 -3.81) (end -17.78 -3.81) (layer F.SilkS) (width 0.15))
    (fp_line (start -12.7 3.81) (end -17.78 3.81) (layer F.SilkS) (width 0.15))
    (fp_line (start 15.24 -2.54) (end 15.24 2.54) (layer F.SilkS) (width 0.15))
    (fp_line (start 15.24 2.54) (end 12.7 2.54) (layer F.SilkS) (width 0.15))
    (fp_line (start 12.7 2.54) (end 12.7 -2.54) (layer F.SilkS) (width 0.15))
    (fp_line (start 12.7 -2.54) (end 15.24 -2.54) (layer F.SilkS) (width 0.15))
    (fp_line (start -17.78 -8.89) (end 17.78 -8.89) (layer F.SilkS) (width 0.15))
    (fp_line (start 17.78 -8.89) (end 17.78 8.89) (layer F.SilkS) (width 0.15))
    (fp_line (start 17.78 8.89) (end -17.78 8.89) (layer F.SilkS) (width 0.15))
    (fp_line (start -17.78 8.89) (end -17.78 -8.89) (layer F.SilkS) (width 0.15))
    (pad 17 thru_hole circle (at 16.51 0 90) (size 1.6 1.6) (drill 1.1) (layers *.Cu *.Mask)
      (net 6 GND))
    (pad 18 thru_hole circle (at 16.51 -2.54 90) (size 1.6 1.6) (drill 1.1) (layers *.Cu *.Mask)
      (net 39 "Net-(U7-Pad18)"))
    (pad 19 thru_hole circle (at 16.51 -5.08 90) (size 1.6 1.6) (drill 1.1) (layers *.Cu *.Mask)
      (net 40 "Net-(U7-Pad19)"))
    (pad 20 thru_hole circle (at 16.51 -7.62 90) (size 1.6 1.6) (drill 1.1) (layers *.Cu *.Mask)
      (net 80 "Net-(U7-Pad20)"))
    (pad 16 thru_hole circle (at 16.51 2.54 90) (size 1.6 1.6) (drill 1.1) (layers *.Cu *.Mask)
      (net 41 V3V))
    (pad 15 thru_hole circle (at 16.51 5.08 90) (size 1.6 1.6) (drill 1.1) (layers *.Cu *.Mask)
      (net 42 "Net-(U7-Pad15)"))
    (pad 14 thru_hole circle (at 16.51 7.62 90) (size 1.6 1.6) (drill 1.1) (layers *.Cu *.Mask)
      (net 43 "Net-(U7-Pad14)"))
    (pad 21 thru_hole circle (at 13.97 -7.62 90) (size 1.6 1.6) (drill 1.1) (layers *.Cu *.Mask)
      (net 81 "Net-(J3-Pad1)"))
    (pad 22 thru_hole circle (at 11.43 -7.62 90) (size 1.6 1.6) (drill 1.1) (layers *.Cu *.Mask)
      (net 82 "Net-(J3-Pad2)"))
    (pad 23 thru_hole circle (at 8.89 -7.62 90) (size 1.6 1.6) (drill 1.1) (layers *.Cu *.Mask)
      (net 83 "Net-(J3-Pad3)"))
    (pad 24 thru_hole circle (at 6.35 -7.62 90) (size 1.6 1.6) (drill 1.1) (layers *.Cu *.Mask)
      (net 84 "Net-(J3-Pad4)"))
    (pad 25 thru_hole circle (at 3.81 -7.62 90) (size 1.6 1.6) (drill 1.1) (layers *.Cu *.Mask)
      (net 27 "Net-(U5-Pad2)"))
    (pad 26 thru_hole circle (at 1.27 -7.62 90) (size 1.6 1.6) (drill 1.1) (layers *.Cu *.Mask)
      (net 28 "Net-(U5-Pad1)"))
    (pad 27 thru_hole circle (at -1.27 -7.62 90) (size 1.6 1.6) (drill 1.1) (layers *.Cu *.Mask)
      (net 13 "Net-(U4-Pad16)"))
    (pad 28 thru_hole circle (at -3.81 -7.62 90) (size 1.6 1.6) (drill 1.1) (layers *.Cu *.Mask)
      (net 10 "Net-(U3-Pad13)"))
    (pad 29 thru_hole circle (at -6.35 -7.62 90) (size 1.6 1.6) (drill 1.1) (layers *.Cu *.Mask)
      (net 12 "Net-(U4-Pad10)"))
    (pad 30 thru_hole circle (at -8.89 -7.62 90) (size 1.6 1.6) (drill 1.1) (layers *.Cu *.Mask)
      (net 7 "Net-(U3-Pad16)"))
    (pad 31 thru_hole circle (at -11.43 -7.62 90) (size 1.6 1.6) (drill 1.1) (layers *.Cu *.Mask)
      (net 41 V3V))
    (pad 32 thru_hole circle (at -13.97 -7.62 90) (size 1.6 1.6) (drill 1.1) (layers *.Cu *.Mask)
      (net 44 "Net-(U7-Pad32)"))
    (pad 33 thru_hole circle (at -16.51 -7.62 90) (size 1.6 1.6) (drill 1.1) (layers *.Cu *.Mask)
      (net 45 V6V))
    (pad 34 thru_hole circle (at -13.97 -5.08 90) (size 1.6 1.6) (drill 1.1) (layers *.Cu *.Mask)
      (net 46 "Net-(U7-Pad34)"))
    (pad 35 thru_hole circle (at -8.89 -5.08 90) (size 1.6 1.6) (drill 1.1) (layers *.Cu *.Mask)
      (net 47 "Net-(U7-Pad35)"))
    (pad 36 thru_hole circle (at -6.35 -5.08 90) (size 1.6 1.6) (drill 1.1) (layers *.Cu *.Mask)
      (net 48 "Net-(U7-Pad36)"))
    (pad 37 thru_hole circle (at -3.81 -5.08 90) (size 1.6 1.6) (drill 1.1) (layers *.Cu *.Mask)
      (net 49 "Net-(U7-Pad37)"))
    (pad 13 thru_hole circle (at 13.97 7.62 90) (size 1.6 1.6) (drill 1.1) (layers *.Cu *.Mask)
      (net 50 "Net-(U7-Pad13)"))
    (pad 12 thru_hole circle (at 11.43 7.62 90) (size 1.6 1.6) (drill 1.1) (layers *.Cu *.Mask)
      (net 2 "Net-(J1-Pad2)"))
    (pad 11 thru_hole circle (at 8.89 7.62 90) (size 1.6 1.6) (drill 1.1) (layers *.Cu *.Mask)
      (net 1 "Net-(J1-Pad1)"))
    (pad 10 thru_hole circle (at 6.35 7.62 90) (size 1.6 1.6) (drill 1.1) (layers *.Cu *.Mask)
      (net 74 "Net-(U7-Pad10)"))
    (pad 9 thru_hole circle (at 3.81 7.62 90) (size 1.6 1.6) (drill 1.1) (layers *.Cu *.Mask)
      (net 75 "Net-(U7-Pad9)"))
    (pad 8 thru_hole circle (at 1.27 7.62 90) (size 1.6 1.6) (drill 1.1) (layers *.Cu *.Mask)
      (net 51 "Net-(U7-Pad8)"))
    (pad 7 thru_hole circle (at -1.27 7.62 90) (size 1.6 1.6) (drill 1.1) (layers *.Cu *.Mask)
      (net 52 "Net-(U7-Pad7)"))
    (pad 6 thru_hole circle (at -3.81 7.62 90) (size 1.6 1.6) (drill 1.1) (layers *.Cu *.Mask)
      (net 15 "Net-(U2-Pad15)"))
    (pad 5 thru_hole circle (at -6.35 7.62 90) (size 1.6 1.6) (drill 1.1) (layers *.Cu *.Mask)
      (net 14 "Net-(U2-Pad16)"))
    (pad 4 thru_hole circle (at -8.89 7.62 90) (size 1.6 1.6) (drill 1.1) (layers *.Cu *.Mask)
      (net 53 "Net-(U7-Pad4)"))
    (pad 3 thru_hole circle (at -11.43 7.62 90) (size 1.6 1.6) (drill 1.1) (layers *.Cu *.Mask)
      (net 54 "Net-(U1-Pad2)"))
    (pad 2 thru_hole circle (at -13.97 7.62 90) (size 1.6 1.6) (drill 1.1) (layers *.Cu *.Mask)
      (net 55 "Net-(U1-Pad1)"))
    (pad 1 thru_hole rect (at -16.51 7.62 90) (size 1.6 1.6) (drill 1.1) (layers *.Cu *.Mask)
      (net 6 GND))
    (pad 39 thru_hole circle (at -15.24 0.23 90) (size 1.6 1.6) (drill 1.1) (layers *.Cu *.Mask)
      (net 56 "Net-(U7-Pad39)"))
    (pad 40 thru_hole circle (at -15.24 -1.9 90) (size 1.6 1.6) (drill 1.1) (layers *.Cu *.Mask)
      (net 57 "Net-(U7-Pad40)"))
    (pad 46 thru_hole circle (at 11.43 -2.54 90) (size 1.6 1.6) (drill 1.1) (layers *.Cu *.Mask)
      (net 58 "Net-(U7-Pad46)"))
    (pad 47 thru_hole circle (at 13.97 -2.54 90) (size 1.6 1.6) (drill 1.1) (layers *.Cu *.Mask)
      (net 59 "Net-(U7-Pad47)"))
    (pad 48 thru_hole circle (at 13.97 0 90) (size 1.6 1.6) (drill 1.1) (layers *.Cu *.Mask)
      (net 60 "Net-(U7-Pad48)"))
    (pad 45 thru_hole circle (at 8.89 -2.54 90) (size 1.6 1.6) (drill 1.1) (layers *.Cu *.Mask)
      (net 61 "Net-(U7-Pad45)"))
    (pad 44 thru_hole circle (at 6.35 -2.54 180) (size 1.6 1.6) (drill 1.1) (layers *.Cu *.Mask)
      (net 62 "Net-(U7-Pad44)"))
    (pad 49 thru_hole circle (at 11.43 0 90) (size 1.6 1.6) (drill 1.1) (layers *.Cu *.Mask)
      (net 63 "Net-(U7-Pad49)"))
    (pad 50 thru_hole circle (at 8.89 0 90) (size 1.6 1.6) (drill 1.1) (layers *.Cu *.Mask)
      (net 64 "Net-(U7-Pad50)"))
    (pad 43 thru_hole circle (at 3.81 -2.54 90) (size 1.6 1.6) (drill 1.1) (layers *.Cu *.Mask)
      (net 65 "Net-(U7-Pad43)"))
    (pad 51 thru_hole circle (at 6.35 0 90) (size 1.6 1.6) (drill 1.1) (layers *.Cu *.Mask)
      (net 66 "Net-(U7-Pad51)"))
    (pad 42 thru_hole circle (at 1.27 -2.54 90) (size 1.6 1.6) (drill 1.1) (layers *.Cu *.Mask)
      (net 67 "Net-(U7-Pad42)"))
    (pad 41 thru_hole circle (at -1.27 -2.54 90) (size 1.6 1.6) (drill 1.1) (layers *.Cu *.Mask)
      (net 68 "Net-(U7-Pad41)"))
    (pad 52 thru_hole circle (at 3.81 0 90) (size 1.6 1.6) (drill 1.1) (layers *.Cu *.Mask)
      (net 69 "Net-(U7-Pad52)"))
    (pad 38 thru_hole circle (at -10.16 0.23 90) (size 1.6 1.6) (drill 1.1) (layers *.Cu *.Mask)
      (net 70 "Net-(U7-Pad38)"))
    (pad 53 thru_hole circle (at 1.27 0 90) (size 1.6 1.6) (drill 1.1) (layers *.Cu *.Mask)
      (net 6 GND))
    (pad 54 thru_hole circle (at -1.27 0 90) (size 1.6 1.6) (drill 1.1) (layers *.Cu *.Mask)
      (net 71 "Net-(U7-Pad54)"))
  )

  (module Capacitors_SMD:C_0805_HandSoldering (layer F.Cu) (tedit 58AA84A8) (tstamp 60978AC9)
    (at 106.08 124.72 180)
    (descr "Capacitor SMD 0805, hand soldering")
    (tags "capacitor 0805")
    (path /60974FC4)
    (attr smd)
    (fp_text reference C2 (at 0 -1.75 180) (layer F.SilkS)
      (effects (font (size 1 1) (thickness 0.15)))
    )
    (fp_text value CAP_CERAMIC_0805 (at 0 1.75 180) (layer F.Fab)
      (effects (font (size 1 1) (thickness 0.15)))
    )
    (fp_text user %R (at 0 -1.75 180) (layer F.Fab)
      (effects (font (size 1 1) (thickness 0.15)))
    )
    (fp_line (start -1 0.62) (end -1 -0.62) (layer F.Fab) (width 0.1))
    (fp_line (start 1 0.62) (end -1 0.62) (layer F.Fab) (width 0.1))
    (fp_line (start 1 -0.62) (end 1 0.62) (layer F.Fab) (width 0.1))
    (fp_line (start -1 -0.62) (end 1 -0.62) (layer F.Fab) (width 0.1))
    (fp_line (start 0.5 -0.85) (end -0.5 -0.85) (layer F.SilkS) (width 0.12))
    (fp_line (start -0.5 0.85) (end 0.5 0.85) (layer F.SilkS) (width 0.12))
    (fp_line (start -2.25 -0.88) (end 2.25 -0.88) (layer F.CrtYd) (width 0.05))
    (fp_line (start -2.25 -0.88) (end -2.25 0.87) (layer F.CrtYd) (width 0.05))
    (fp_line (start 2.25 0.87) (end 2.25 -0.88) (layer F.CrtYd) (width 0.05))
    (fp_line (start 2.25 0.87) (end -2.25 0.87) (layer F.CrtYd) (width 0.05))
    (pad 1 smd rect (at -1.25 0 180) (size 1.5 1.25) (layers F.Cu F.Paste F.Mask)
      (net 45 V6V))
    (pad 2 smd rect (at 1.25 0 180) (size 1.5 1.25) (layers F.Cu F.Paste F.Mask)
      (net 6 GND))
    (model Capacitors_SMD.3dshapes/C_0805.wrl
      (at (xyz 0 0 0))
      (scale (xyz 1 1 1))
      (rotate (xyz 0 0 0))
    )
  )

  (module Capacitors_SMD:C_0805_HandSoldering (layer F.Cu) (tedit 58AA84A8) (tstamp 60978AB8)
    (at 105.9 120.01 180)
    (descr "Capacitor SMD 0805, hand soldering")
    (tags "capacitor 0805")
    (path /6097501C)
    (attr smd)
    (fp_text reference C1 (at 0 -1.75 180) (layer F.SilkS)
      (effects (font (size 1 1) (thickness 0.15)))
    )
    (fp_text value CAP_CERAMIC_0805 (at 0 1.75 180) (layer F.Fab)
      (effects (font (size 1 1) (thickness 0.15)))
    )
    (fp_line (start 2.25 0.87) (end -2.25 0.87) (layer F.CrtYd) (width 0.05))
    (fp_line (start 2.25 0.87) (end 2.25 -0.88) (layer F.CrtYd) (width 0.05))
    (fp_line (start -2.25 -0.88) (end -2.25 0.87) (layer F.CrtYd) (width 0.05))
    (fp_line (start -2.25 -0.88) (end 2.25 -0.88) (layer F.CrtYd) (width 0.05))
    (fp_line (start -0.5 0.85) (end 0.5 0.85) (layer F.SilkS) (width 0.12))
    (fp_line (start 0.5 -0.85) (end -0.5 -0.85) (layer F.SilkS) (width 0.12))
    (fp_line (start -1 -0.62) (end 1 -0.62) (layer F.Fab) (width 0.1))
    (fp_line (start 1 -0.62) (end 1 0.62) (layer F.Fab) (width 0.1))
    (fp_line (start 1 0.62) (end -1 0.62) (layer F.Fab) (width 0.1))
    (fp_line (start -1 0.62) (end -1 -0.62) (layer F.Fab) (width 0.1))
    (fp_text user %R (at 0 -1.75 180) (layer F.Fab)
      (effects (font (size 1 1) (thickness 0.15)))
    )
    (pad 2 smd rect (at 1.25 0 180) (size 1.5 1.25) (layers F.Cu F.Paste F.Mask)
      (net 6 GND))
    (pad 1 smd rect (at -1.25 0 180) (size 1.5 1.25) (layers F.Cu F.Paste F.Mask)
      (net 72 VMOT))
    (model Capacitors_SMD.3dshapes/C_0805.wrl
      (at (xyz 0 0 0))
      (scale (xyz 1 1 1))
      (rotate (xyz 0 0 0))
    )
  )

  (module TO_SOT_Packages_SMD:TO-252-2 (layer F.Cu) (tedit 590079C0) (tstamp 609CD649)
    (at 114.3 122.31)
    (descr "TO-252 / DPAK SMD package, http://www.infineon.com/cms/en/product/packages/PG-TO252/PG-TO252-3-1/")
    (tags "DPAK TO-252 DPAK-3 TO-252-3 SOT-428")
    (path /60974A11)
    (attr smd)
    (fp_text reference U6 (at 0 -4.5) (layer F.SilkS)
      (effects (font (size 1 1) (thickness 0.15)))
    )
    (fp_text value "LF60_TO252 6V regulator" (at 0 4.5) (layer F.Fab)
      (effects (font (size 1 1) (thickness 0.15)))
    )
    (fp_text user %R (at 0 0) (layer F.Fab)
      (effects (font (size 1 1) (thickness 0.15)))
    )
    (fp_line (start 5.55 -3.5) (end -5.55 -3.5) (layer F.CrtYd) (width 0.05))
    (fp_line (start 5.55 3.5) (end 5.55 -3.5) (layer F.CrtYd) (width 0.05))
    (fp_line (start -5.55 3.5) (end 5.55 3.5) (layer F.CrtYd) (width 0.05))
    (fp_line (start -5.55 -3.5) (end -5.55 3.5) (layer F.CrtYd) (width 0.05))
    (fp_line (start -2.47 3.18) (end -3.57 3.18) (layer F.SilkS) (width 0.12))
    (fp_line (start -2.47 3.45) (end -2.47 3.18) (layer F.SilkS) (width 0.12))
    (fp_line (start -0.97 3.45) (end -2.47 3.45) (layer F.SilkS) (width 0.12))
    (fp_line (start -2.47 -3.18) (end -5.3 -3.18) (layer F.SilkS) (width 0.12))
    (fp_line (start -2.47 -3.45) (end -2.47 -3.18) (layer F.SilkS) (width 0.12))
    (fp_line (start -0.97 -3.45) (end -2.47 -3.45) (layer F.SilkS) (width 0.12))
    (fp_line (start -4.97 2.655) (end -2.27 2.655) (layer F.Fab) (width 0.1))
    (fp_line (start -4.97 1.905) (end -4.97 2.655) (layer F.Fab) (width 0.1))
    (fp_line (start -2.27 1.905) (end -4.97 1.905) (layer F.Fab) (width 0.1))
    (fp_line (start -4.97 -1.905) (end -2.27 -1.905) (layer F.Fab) (width 0.1))
    (fp_line (start -4.97 -2.655) (end -4.97 -1.905) (layer F.Fab) (width 0.1))
    (fp_line (start -1.865 -2.655) (end -4.97 -2.655) (layer F.Fab) (width 0.1))
    (fp_line (start -1.27 -3.25) (end 3.95 -3.25) (layer F.Fab) (width 0.1))
    (fp_line (start -2.27 -2.25) (end -1.27 -3.25) (layer F.Fab) (width 0.1))
    (fp_line (start -2.27 3.25) (end -2.27 -2.25) (layer F.Fab) (width 0.1))
    (fp_line (start 3.95 3.25) (end -2.27 3.25) (layer F.Fab) (width 0.1))
    (fp_line (start 3.95 -3.25) (end 3.95 3.25) (layer F.Fab) (width 0.1))
    (fp_line (start 4.95 2.7) (end 3.95 2.7) (layer F.Fab) (width 0.1))
    (fp_line (start 4.95 -2.7) (end 4.95 2.7) (layer F.Fab) (width 0.1))
    (fp_line (start 3.95 -2.7) (end 4.95 -2.7) (layer F.Fab) (width 0.1))
    (pad 2 smd rect (at 0.425 1.525) (size 3.05 2.75) (layers F.Cu F.Paste)
      (net 6 GND))
    (pad 2 smd rect (at 3.775 -1.525) (size 3.05 2.75) (layers F.Cu F.Paste)
      (net 6 GND))
    (pad 2 smd rect (at 0.425 -1.525) (size 3.05 2.75) (layers F.Cu F.Paste)
      (net 6 GND))
    (pad 2 smd rect (at 3.775 1.525) (size 3.05 2.75) (layers F.Cu F.Paste)
      (net 6 GND))
    (pad 2 smd rect (at 2.1 0) (size 6.4 5.8) (layers F.Cu F.Mask)
      (net 6 GND))
    (pad 3 smd rect (at -4.2 2.28) (size 2.2 1.2) (layers F.Cu F.Paste F.Mask)
      (net 45 V6V))
    (pad 1 smd rect (at -4.2 -2.28) (size 2.2 1.2) (layers F.Cu F.Paste F.Mask)
      (net 72 VMOT))
    (model ${KISYS3DMOD}/TO_SOT_Packages_SMD.3dshapes/TO-252-2.wrl
      (at (xyz 0 0 0))
      (scale (xyz 1 1 1))
      (rotate (xyz 0 0 0))
    )
  )

  (module TerminalBlock_4UCON:TerminalBlock_4UCON_19963_02x3.5mm_Straight (layer F.Cu) (tedit 596E7C65) (tstamp 6097893B)
    (at 99.49 120.36 270)
    (descr "2-way 3.5mm pitch terminal block, https://cdn-shop.adafruit.com/datasheets/19963.pdf")
    (tags "screw terminal block")
    (path /609758AC)
    (fp_text reference J5 (at 1.75 -4.6 270) (layer F.SilkS)
      (effects (font (size 1 1) (thickness 0.15)))
    )
    (fp_text value Barrel_Jack (at 2.33 13.64 270) (layer F.Fab)
      (effects (font (size 1 1) (thickness 0.15)))
    )
    (fp_text user %R (at 1.75 0.1 270) (layer F.Fab)
      (effects (font (size 1 1) (thickness 0.15)))
    )
    (fp_line (start -2.09 3.94) (end 0 3.94) (layer F.SilkS) (width 0.12))
    (fp_line (start -2.09 1.85) (end -2.09 3.94) (layer F.SilkS) (width 0.12))
    (fp_line (start 1.75 3.2) (end 1.75 3.6) (layer F.SilkS) (width 0.12))
    (fp_line (start 5.35 -3.5) (end 5.35 3.7) (layer F.SilkS) (width 0.12))
    (fp_line (start -1.85 -3.5) (end 5.35 -3.5) (layer F.SilkS) (width 0.12))
    (fp_line (start -1.85 3.7) (end -1.85 -3.5) (layer F.SilkS) (width 0.12))
    (fp_line (start -1.85 3.2) (end 5.35 3.2) (layer F.SilkS) (width 0.12))
    (fp_line (start -1.85 2.1) (end 5.35 2.1) (layer F.SilkS) (width 0.12))
    (fp_line (start -2.09 3.94) (end 0 3.94) (layer F.Fab) (width 0.1))
    (fp_line (start -2.09 1.85) (end -2.09 3.94) (layer F.Fab) (width 0.1))
    (fp_line (start 1.75 3.2) (end 1.75 3.6) (layer F.Fab) (width 0.1))
    (fp_line (start 5.25 -3.4) (end 5.25 3.6) (layer F.Fab) (width 0.1))
    (fp_line (start -1.75 -3.4) (end 5.25 -3.4) (layer F.Fab) (width 0.1))
    (fp_line (start -1.75 3.6) (end -1.75 -3.4) (layer F.Fab) (width 0.1))
    (fp_line (start -1.75 3.2) (end 5.25 3.2) (layer F.Fab) (width 0.1))
    (fp_line (start -1.75 2.1) (end 5.25 2.1) (layer F.Fab) (width 0.1))
    (fp_line (start 5.75 -3.9) (end -2.25 -3.9) (layer F.CrtYd) (width 0.05))
    (fp_line (start 5.75 4.1) (end 5.75 -3.9) (layer F.CrtYd) (width 0.05))
    (fp_line (start -2.25 4.1) (end 5.75 4.1) (layer F.CrtYd) (width 0.05))
    (fp_line (start -2.25 -3.9) (end -2.25 4.1) (layer F.CrtYd) (width 0.05))
    (pad 2 thru_hole circle (at 3.5 0 270) (size 2.4 2.4) (drill 1.2) (layers *.Cu *.Mask)
      (net 6 GND))
    (pad 1 thru_hole rect (at 0 0 270) (size 2.4 2.4) (drill 1.2) (layers *.Cu *.Mask)
      (net 72 VMOT))
    (model ${KISYS3DMOD}/Connectors_Terminal_Blocks.3dshapes/TerminalBlock_4UCON_19963_02x3.5mm_Straight.wrl
      (at (xyz 0 0 0))
      (scale (xyz 1 1 1))
      (rotate (xyz 0 0 0))
    )
  )

  (module multispeq:SparkFun_Qwiic_Scale (layer F.Cu) (tedit 60971548) (tstamp 60978782)
    (at 128.22 115.3 90)
    (path /6096FFAD)
    (fp_text reference U5 (at 0 0.5 90) (layer F.SilkS)
      (effects (font (size 1 1) (thickness 0.15)))
    )
    (fp_text value SparkFun_Qwiik_Scale_PCB (at 0.635 -1.135 90) (layer F.Fab)
      (effects (font (size 1 1) (thickness 0.15)))
    )
    (fp_line (start 0 0) (end 25.4 0) (layer F.SilkS) (width 0.15))
    (fp_line (start 25.4 0) (end 25.4 -35.56) (layer F.SilkS) (width 0.15))
    (fp_line (start 25.4 -35.56) (end 0 -35.56) (layer F.SilkS) (width 0.15))
    (fp_line (start 0 -35.56) (end 0 0) (layer F.SilkS) (width 0.15))
    (fp_circle (center 22.86 -2.54) (end 24.13 -1.27) (layer F.SilkS) (width 0.15))
    (fp_circle (center 2.54 -2.54) (end 3.81 -1.27) (layer F.SilkS) (width 0.15))
    (fp_circle (center 2.54 -33.02) (end 3.81 -31.75) (layer F.SilkS) (width 0.15))
    (fp_circle (center 22.86 -33.02) (end 24.13 -31.75) (layer F.SilkS) (width 0.15))
    (fp_poly (pts (xy 8.89 -12.7) (xy 17.78 -12.7) (xy 17.78 -7.62) (xy 7.62 -7.62)
      (xy 7.62 -12.7)) (layer F.SilkS) (width 0.15))
    (fp_poly (pts (xy 21.59 -15.24) (xy 24.13 -15.24) (xy 24.13 -11.43) (xy 21.59 -11.43)) (layer F.SilkS) (width 0.15))
    (fp_poly (pts (xy 1.27 -15.24) (xy 3.81 -15.24) (xy 3.81 -11.43) (xy 1.27 -11.43)) (layer F.SilkS) (width 0.15))
    (fp_poly (pts (xy 7.62 -31.75) (xy 19.05 -31.75) (xy 19.05 -21.59) (xy 6.35 -21.59)
      (xy 6.35 -31.75)) (layer F.SilkS) (width 0.15))
    (pad 3 thru_hole circle (at 8.89 -1.905 90) (size 1.524 1.524) (drill 0.762) (layers *.Cu *.Mask)
      (net 41 V3V))
    (pad 2 thru_hole circle (at 11.43 -1.905 90) (size 1.524 1.524) (drill 0.762) (layers *.Cu *.Mask)
      (net 27 "Net-(U5-Pad2)"))
    (pad 1 thru_hole circle (at 13.97 -1.905 90) (size 1.524 1.524) (drill 0.762) (layers *.Cu *.Mask)
      (net 28 "Net-(U5-Pad1)"))
    (pad 6 thru_hole circle (at 16.51 -1.905 90) (size 1.524 1.524) (drill 0.762) (layers *.Cu *.Mask)
      (net 29 "Net-(U5-Pad6)"))
    (pad 5 thru_hole circle (at 19.05 -1.905 90) (size 1.524 1.524) (drill 0.762) (layers *.Cu *.Mask)
      (net 30 "Net-(U5-Pad5)"))
    (pad 4 thru_hole circle (at 6.35 -1.905 90) (size 1.524 1.524) (drill 0.762) (layers *.Cu *.Mask)
      (net 31 "Net-(U5-Pad4)"))
    (pad 8 thru_hole circle (at 17.78 -19.685 90) (size 1.524 1.524) (drill 0.762) (layers *.Cu *.Mask)
      (net 32 "Net-(U5-Pad8)"))
    (pad 11 thru_hole circle (at 10.16 -19.685 90) (size 1.524 1.524) (drill 0.762) (layers *.Cu *.Mask)
      (net 33 "Net-(U5-Pad11)"))
    (pad 12 thru_hole circle (at 7.62 -19.685 90) (size 1.524 1.524) (drill 0.762) (layers *.Cu *.Mask)
      (net 34 "Net-(U5-Pad12)"))
    (pad 13 thru_hole circle (at 5.08 -19.685 90) (size 1.524 1.524) (drill 0.762) (layers *.Cu *.Mask)
      (net 35 "Net-(U5-Pad13)"))
    (pad 9 thru_hole circle (at 15.24 -19.685 90) (size 1.524 1.524) (drill 0.762) (layers *.Cu *.Mask)
      (net 36 "Net-(U5-Pad9)"))
    (pad 10 thru_hole circle (at 12.7 -19.685 90) (size 1.524 1.524) (drill 0.762) (layers *.Cu *.Mask)
      (net 37 "Net-(U5-Pad10)"))
    (pad 7 thru_hole circle (at 20.32 -19.685 90) (size 1.524 1.524) (drill 0.762) (layers *.Cu *.Mask)
      (net 38 "Net-(U5-Pad7)"))
  )

  (module TerminalBlock_4UCON:TerminalBlock_4UCON_19963_02x3.5mm_Straight (layer F.Cu) (tedit 596E7C65) (tstamp 60975D1A)
    (at 142.22 45.8 180)
    (descr "2-way 3.5mm pitch terminal block, https://cdn-shop.adafruit.com/datasheets/19963.pdf")
    (tags "screw terminal block")
    (path /60970AF7)
    (fp_text reference M4 (at 1.75 -4.6 180) (layer F.SilkS)
      (effects (font (size 1 1) (thickness 0.15)))
    )
    (fp_text value Motor_DC (at 1.75 5.1 180) (layer F.Fab)
      (effects (font (size 1 1) (thickness 0.15)))
    )
    (fp_line (start -2.25 -3.9) (end -2.25 4.1) (layer F.CrtYd) (width 0.05))
    (fp_line (start -2.25 4.1) (end 5.75 4.1) (layer F.CrtYd) (width 0.05))
    (fp_line (start 5.75 4.1) (end 5.75 -3.9) (layer F.CrtYd) (width 0.05))
    (fp_line (start 5.75 -3.9) (end -2.25 -3.9) (layer F.CrtYd) (width 0.05))
    (fp_line (start -1.75 2.1) (end 5.25 2.1) (layer F.Fab) (width 0.1))
    (fp_line (start -1.75 3.2) (end 5.25 3.2) (layer F.Fab) (width 0.1))
    (fp_line (start -1.75 3.6) (end -1.75 -3.4) (layer F.Fab) (width 0.1))
    (fp_line (start -1.75 -3.4) (end 5.25 -3.4) (layer F.Fab) (width 0.1))
    (fp_line (start 5.25 -3.4) (end 5.25 3.6) (layer F.Fab) (width 0.1))
    (fp_line (start 1.75 3.2) (end 1.75 3.6) (layer F.Fab) (width 0.1))
    (fp_line (start -2.09 1.85) (end -2.09 3.94) (layer F.Fab) (width 0.1))
    (fp_line (start -2.09 3.94) (end 0 3.94) (layer F.Fab) (width 0.1))
    (fp_line (start -1.85 2.1) (end 5.35 2.1) (layer F.SilkS) (width 0.12))
    (fp_line (start -1.85 3.2) (end 5.35 3.2) (layer F.SilkS) (width 0.12))
    (fp_line (start -1.85 3.7) (end -1.85 -3.5) (layer F.SilkS) (width 0.12))
    (fp_line (start -1.85 -3.5) (end 5.35 -3.5) (layer F.SilkS) (width 0.12))
    (fp_line (start 5.35 -3.5) (end 5.35 3.7) (layer F.SilkS) (width 0.12))
    (fp_line (start 1.75 3.2) (end 1.75 3.6) (layer F.SilkS) (width 0.12))
    (fp_line (start -2.09 1.85) (end -2.09 3.94) (layer F.SilkS) (width 0.12))
    (fp_line (start -2.09 3.94) (end 0 3.94) (layer F.SilkS) (width 0.12))
    (fp_text user %R (at 1.75 0.1 180) (layer F.Fab)
      (effects (font (size 1 1) (thickness 0.15)))
    )
    (pad 1 thru_hole rect (at 0 0 180) (size 2.4 2.4) (drill 1.2) (layers *.Cu *.Mask)
      (net 25 "Net-(M4-Pad1)"))
    (pad 2 thru_hole circle (at 3.5 0 180) (size 2.4 2.4) (drill 1.2) (layers *.Cu *.Mask)
      (net 26 "Net-(M4-Pad2)"))
    (model ${KISYS3DMOD}/Connectors_Terminal_Blocks.3dshapes/TerminalBlock_4UCON_19963_02x3.5mm_Straight.wrl
      (at (xyz 0 0 0))
      (scale (xyz 1 1 1))
      (rotate (xyz 0 0 0))
    )
  )

  (module TerminalBlock_4UCON:TerminalBlock_4UCON_19963_02x3.5mm_Straight (layer F.Cu) (tedit 596E7C65) (tstamp 60975CFF)
    (at 106.93 46 180)
    (descr "2-way 3.5mm pitch terminal block, https://cdn-shop.adafruit.com/datasheets/19963.pdf")
    (tags "screw terminal block")
    (path /60970AA0)
    (fp_text reference M3 (at 1.75 -4.6 180) (layer F.SilkS)
      (effects (font (size 1 1) (thickness 0.15)))
    )
    (fp_text value Motor_DC (at 1.75 5.1 180) (layer F.Fab)
      (effects (font (size 1 1) (thickness 0.15)))
    )
    (fp_text user %R (at 1.75 0.1 270) (layer F.Fab)
      (effects (font (size 1 1) (thickness 0.15)))
    )
    (fp_line (start -2.09 3.94) (end 0 3.94) (layer F.SilkS) (width 0.12))
    (fp_line (start -2.09 1.85) (end -2.09 3.94) (layer F.SilkS) (width 0.12))
    (fp_line (start 1.75 3.2) (end 1.75 3.6) (layer F.SilkS) (width 0.12))
    (fp_line (start 5.35 -3.5) (end 5.35 3.7) (layer F.SilkS) (width 0.12))
    (fp_line (start -1.85 -3.5) (end 5.35 -3.5) (layer F.SilkS) (width 0.12))
    (fp_line (start -1.85 3.7) (end -1.85 -3.5) (layer F.SilkS) (width 0.12))
    (fp_line (start -1.85 3.2) (end 5.35 3.2) (layer F.SilkS) (width 0.12))
    (fp_line (start -1.85 2.1) (end 5.35 2.1) (layer F.SilkS) (width 0.12))
    (fp_line (start -2.09 3.94) (end 0 3.94) (layer F.Fab) (width 0.1))
    (fp_line (start -2.09 1.85) (end -2.09 3.94) (layer F.Fab) (width 0.1))
    (fp_line (start 1.75 3.2) (end 1.75 3.6) (layer F.Fab) (width 0.1))
    (fp_line (start 5.25 -3.4) (end 5.25 3.6) (layer F.Fab) (width 0.1))
    (fp_line (start -1.75 -3.4) (end 5.25 -3.4) (layer F.Fab) (width 0.1))
    (fp_line (start -1.75 3.6) (end -1.75 -3.4) (layer F.Fab) (width 0.1))
    (fp_line (start -1.75 3.2) (end 5.25 3.2) (layer F.Fab) (width 0.1))
    (fp_line (start -1.75 2.1) (end 5.25 2.1) (layer F.Fab) (width 0.1))
    (fp_line (start 5.75 -3.9) (end -2.25 -3.9) (layer F.CrtYd) (width 0.05))
    (fp_line (start 5.75 4.1) (end 5.75 -3.9) (layer F.CrtYd) (width 0.05))
    (fp_line (start -2.25 4.1) (end 5.75 4.1) (layer F.CrtYd) (width 0.05))
    (fp_line (start -2.25 -3.9) (end -2.25 4.1) (layer F.CrtYd) (width 0.05))
    (pad 2 thru_hole circle (at 3.5 0 180) (size 2.4 2.4) (drill 1.2) (layers *.Cu *.Mask)
      (net 23 "Net-(M3-Pad2)"))
    (pad 1 thru_hole rect (at 0 0 180) (size 2.4 2.4) (drill 1.2) (layers *.Cu *.Mask)
      (net 24 "Net-(M3-Pad1)"))
    (model ${KISYS3DMOD}/Connectors_Terminal_Blocks.3dshapes/TerminalBlock_4UCON_19963_02x3.5mm_Straight.wrl
      (at (xyz 0 0 0))
      (scale (xyz 1 1 1))
      (rotate (xyz 0 0 0))
    )
  )

  (module TerminalBlock_4UCON:TerminalBlock_4UCON_19963_04x3.5mm_Straight (layer F.Cu) (tedit 5971E3D8) (tstamp 60975CB0)
    (at 179.76 112.71 270)
    (descr "4-way 3.5mm pitch terminal block, https://cdn-shop.adafruit.com/datasheets/19963.pdf")
    (tags "screw terminal block")
    (path /60970858)
    (fp_text reference M1 (at 5.25 -4.6 270) (layer F.SilkS)
      (effects (font (size 1 1) (thickness 0.15)))
    )
    (fp_text value Stepper_Motor_bipolar (at 5.25 5.1 270) (layer F.Fab)
      (effects (font (size 1 1) (thickness 0.15)))
    )
    (fp_text user %R (at 5.25 0.1) (layer F.Fab)
      (effects (font (size 1 1) (thickness 0.15)))
    )
    (fp_line (start -2.09 3.94) (end 0 3.94) (layer F.SilkS) (width 0.12))
    (fp_line (start -2.09 1.85) (end -2.09 3.94) (layer F.SilkS) (width 0.12))
    (fp_line (start 8.75 3.2) (end 8.75 3.6) (layer F.SilkS) (width 0.12))
    (fp_line (start 5.25 3.2) (end 5.25 3.6) (layer F.SilkS) (width 0.12))
    (fp_line (start 1.75 3.2) (end 1.75 3.6) (layer F.SilkS) (width 0.12))
    (fp_line (start 12.35 -3.5) (end 12.35 3.7) (layer F.SilkS) (width 0.12))
    (fp_line (start -1.85 -3.5) (end 12.35 -3.5) (layer F.SilkS) (width 0.12))
    (fp_line (start -1.85 3.7) (end -1.85 -3.5) (layer F.SilkS) (width 0.12))
    (fp_line (start -1.85 3.2) (end 12.35 3.2) (layer F.SilkS) (width 0.12))
    (fp_line (start -1.85 2.1) (end 12.35 2.1) (layer F.SilkS) (width 0.12))
    (fp_line (start -2.09 3.94) (end 0 3.94) (layer F.Fab) (width 0.1))
    (fp_line (start -2.09 1.85) (end -2.09 3.94) (layer F.Fab) (width 0.1))
    (fp_line (start 8.75 3.2) (end 8.75 3.6) (layer F.Fab) (width 0.1))
    (fp_line (start 5.25 3.2) (end 5.25 3.6) (layer F.Fab) (width 0.1))
    (fp_line (start 1.75 3.2) (end 1.75 3.6) (layer F.Fab) (width 0.1))
    (fp_line (start 12.25 -3.4) (end 12.25 3.6) (layer F.Fab) (width 0.1))
    (fp_line (start -1.75 -3.4) (end 12.25 -3.4) (layer F.Fab) (width 0.1))
    (fp_line (start -1.75 3.6) (end -1.75 -3.4) (layer F.Fab) (width 0.1))
    (fp_line (start -1.75 3.2) (end 12.25 3.2) (layer F.Fab) (width 0.1))
    (fp_line (start -1.75 2.1) (end 12.25 2.1) (layer F.Fab) (width 0.1))
    (fp_line (start 12.75 -3.9) (end -2.25 -3.9) (layer F.CrtYd) (width 0.05))
    (fp_line (start 12.75 4.1) (end 12.75 -3.9) (layer F.CrtYd) (width 0.05))
    (fp_line (start -2.25 4.1) (end 12.75 4.1) (layer F.CrtYd) (width 0.05))
    (fp_line (start -2.25 -3.9) (end -2.25 4.1) (layer F.CrtYd) (width 0.05))
    (pad 4 thru_hole circle (at 10.5 0 270) (size 2.4 2.4) (drill 1.2) (layers *.Cu *.Mask)
      (net 19 "Net-(M1-Pad4)"))
    (pad 3 thru_hole circle (at 7 0 270) (size 2.4 2.4) (drill 1.2) (layers *.Cu *.Mask)
      (net 20 "Net-(M1-Pad3)"))
    (pad 2 thru_hole circle (at 3.5 0 270) (size 2.4 2.4) (drill 1.2) (layers *.Cu *.Mask)
      (net 21 "Net-(M1-Pad2)"))
    (pad 1 thru_hole rect (at 0 0 270) (size 2.4 2.4) (drill 1.2) (layers *.Cu *.Mask)
      (net 22 "Net-(M1-Pad1)"))
    (model ${KISYS3DMOD}/Connectors_Terminal_Blocks.3dshapes/TerminalBlock_4UCON_19963_04x3.5mm_Straight.wrl
      (at (xyz 0 0 0))
      (scale (xyz 1 1 1))
      (rotate (xyz 0 0 0))
    )
  )

  (module TerminalBlock_4UCON:TerminalBlock_4UCON_19963_02x3.5mm_Straight (layer F.Cu) (tedit 596E7C65) (tstamp 609757B7)
    (at 123.43 45.68 180)
    (descr "2-way 3.5mm pitch terminal block, https://cdn-shop.adafruit.com/datasheets/19963.pdf")
    (tags "screw terminal block")
    (path /60970A38)
    (fp_text reference M2 (at 1.75 -4.6 180) (layer F.SilkS)
      (effects (font (size 1 1) (thickness 0.15)))
    )
    (fp_text value Motor_DC (at 1.75 5.1 180) (layer F.Fab)
      (effects (font (size 1 1) (thickness 0.15)))
    )
    (fp_text user %R (at 1.75 0.1 180) (layer F.Fab)
      (effects (font (size 1 1) (thickness 0.15)))
    )
    (fp_line (start -2.09 3.94) (end 0 3.94) (layer F.SilkS) (width 0.12))
    (fp_line (start -2.09 1.85) (end -2.09 3.94) (layer F.SilkS) (width 0.12))
    (fp_line (start 1.75 3.2) (end 1.75 3.6) (layer F.SilkS) (width 0.12))
    (fp_line (start 5.35 -3.5) (end 5.35 3.7) (layer F.SilkS) (width 0.12))
    (fp_line (start -1.85 -3.5) (end 5.35 -3.5) (layer F.SilkS) (width 0.12))
    (fp_line (start -1.85 3.7) (end -1.85 -3.5) (layer F.SilkS) (width 0.12))
    (fp_line (start -1.85 3.2) (end 5.35 3.2) (layer F.SilkS) (width 0.12))
    (fp_line (start -1.85 2.1) (end 5.35 2.1) (layer F.SilkS) (width 0.12))
    (fp_line (start -2.09 3.94) (end 0 3.94) (layer F.Fab) (width 0.1))
    (fp_line (start -2.09 1.85) (end -2.09 3.94) (layer F.Fab) (width 0.1))
    (fp_line (start 1.75 3.2) (end 1.75 3.6) (layer F.Fab) (width 0.1))
    (fp_line (start 5.25 -3.4) (end 5.25 3.6) (layer F.Fab) (width 0.1))
    (fp_line (start -1.75 -3.4) (end 5.25 -3.4) (layer F.Fab) (width 0.1))
    (fp_line (start -1.75 3.6) (end -1.75 -3.4) (layer F.Fab) (width 0.1))
    (fp_line (start -1.75 3.2) (end 5.25 3.2) (layer F.Fab) (width 0.1))
    (fp_line (start -1.75 2.1) (end 5.25 2.1) (layer F.Fab) (width 0.1))
    (fp_line (start 5.75 -3.9) (end -2.25 -3.9) (layer F.CrtYd) (width 0.05))
    (fp_line (start 5.75 4.1) (end 5.75 -3.9) (layer F.CrtYd) (width 0.05))
    (fp_line (start -2.25 4.1) (end 5.75 4.1) (layer F.CrtYd) (width 0.05))
    (fp_line (start -2.25 -3.9) (end -2.25 4.1) (layer F.CrtYd) (width 0.05))
    (pad 2 thru_hole circle (at 3.5 0 180) (size 2.4 2.4) (drill 1.2) (layers *.Cu *.Mask)
      (net 17 "Net-(M2-Pad2)"))
    (pad 1 thru_hole rect (at 0 0 180) (size 2.4 2.4) (drill 1.2) (layers *.Cu *.Mask)
      (net 18 "Net-(M2-Pad1)"))
    (model ${KISYS3DMOD}/Connectors_Terminal_Blocks.3dshapes/TerminalBlock_4UCON_19963_02x3.5mm_Straight.wrl
      (at (xyz 0 0 0))
      (scale (xyz 1 1 1))
      (rotate (xyz 0 0 0))
    )
  )

  (module multispeq:Pololu_Stepper_Driver_PCB (layer F.Cu) (tedit 6096E70F) (tstamp 60975276)
    (at 155.72 126.33)
    (descr "Pololu Breakout 16-pin 15.2x20.3mm 0.6x0.8\\")
    (path /609706FB)
    (fp_text reference U2 (at 8.049529 0.75834 180) (layer F.SilkS)
      (effects (font (size 1 1) (thickness 0.15)))
    )
    (fp_text value Pololu_Stepper_Driver_A4988 (at 7.17 3.48) (layer F.Fab)
      (effects (font (size 1 1) (thickness 0.15)))
    )
    (fp_line (start 0.189529 -21.08166) (end 15.929529 -21.08166) (layer F.CrtYd) (width 0.05))
    (fp_line (start 0.189529 -21.08166) (end 0.189529 -0.26166) (layer F.CrtYd) (width 0.05))
    (fp_line (start 15.929529 -0.26166) (end 15.929529 -21.08166) (layer F.CrtYd) (width 0.05))
    (fp_line (start 15.929529 -0.26166) (end 0.189529 -0.26166) (layer F.CrtYd) (width 0.05))
    (fp_line (start 15.669529 -20.83166) (end 15.669529 -1.78166) (layer F.Fab) (width 0.1))
    (fp_line (start 0.429529 -20.83166) (end 15.669529 -20.83166) (layer F.Fab) (width 0.1))
    (fp_line (start 0.429529 -0.51166) (end 0.429529 -20.83166) (layer F.Fab) (width 0.1))
    (fp_line (start 14.399529 -0.51166) (end 0.429529 -0.51166) (layer F.Fab) (width 0.1))
    (fp_line (start 15.669529 -1.78166) (end 14.399529 -0.51166) (layer F.Fab) (width 0.1))
    (fp_line (start 0.299529 -0.38166) (end 13.129529 -0.38166) (layer F.SilkS) (width 0.12))
    (fp_line (start 0.299529 -20.96166) (end 0.299529 -0.38166) (layer F.SilkS) (width 0.12))
    (fp_line (start 15.799529 -20.96166) (end 0.299529 -20.96166) (layer F.SilkS) (width 0.12))
    (fp_line (start 15.799529 -3.05166) (end 15.799529 -20.96166) (layer F.SilkS) (width 0.12))
    (fp_line (start 13.129529 -3.05166) (end 15.799529 -3.05166) (layer F.SilkS) (width 0.12))
    (fp_line (start 13.129529 -0.38166) (end 13.129529 -3.05166) (layer F.SilkS) (width 0.12))
    (fp_line (start 15.799529 -0.38166) (end 15.799529 -1.78166) (layer F.SilkS) (width 0.12))
    (fp_line (start 14.399529 -0.38166) (end 15.799529 -0.38166) (layer F.SilkS) (width 0.12))
    (fp_line (start 13.129529 -3.05166) (end 13.129529 -20.96166) (layer F.SilkS) (width 0.12))
    (fp_line (start 2.969529 -0.38166) (end 2.969529 -20.96166) (layer F.SilkS) (width 0.12))
    (fp_text user %R (at 8.049529 -1.78166 180) (layer F.Fab)
      (effects (font (size 1 1) (thickness 0.15)))
    )
    (fp_line (start 4.064 -14.478) (end 8.636 -14.478) (layer F.SilkS) (width 0.15))
    (fp_line (start 8.636 -14.478) (end 8.636 -9.398) (layer F.SilkS) (width 0.15))
    (fp_line (start 8.636 -9.398) (end 4.064 -9.398) (layer F.SilkS) (width 0.15))
    (fp_line (start 4.064 -9.398) (end 4.064 -14.478) (layer F.SilkS) (width 0.15))
    (fp_circle (center 9.398 -2.54) (end 10.414 -1.524) (layer F.SilkS) (width 0.15))
    (fp_line (start 11.938 -19.812) (end 9.906 -19.812) (layer F.SilkS) (width 0.15))
    (fp_line (start 9.906 -19.812) (end 9.906 -18.542) (layer F.SilkS) (width 0.15))
    (fp_line (start 9.906 -18.542) (end 11.938 -18.542) (layer F.SilkS) (width 0.15))
    (fp_line (start 11.938 -18.542) (end 11.938 -19.812) (layer F.SilkS) (width 0.15))
    (pad 16 thru_hole oval (at 1.699529 -1.78166 180) (size 1.6 1.6) (drill 0.8) (layers *.Cu *.Mask)
      (net 14 "Net-(U2-Pad16)"))
    (pad 8 thru_hole oval (at 14.399529 -19.56166 180) (size 1.6 1.6) (drill 0.8) (layers *.Cu *.Mask)
      (net 72 VMOT))
    (pad 15 thru_hole oval (at 1.699529 -4.32166 180) (size 1.6 1.6) (drill 0.8) (layers *.Cu *.Mask)
      (net 15 "Net-(U2-Pad15)"))
    (pad 7 thru_hole oval (at 14.399529 -17.02166 180) (size 1.6 1.6) (drill 0.8) (layers *.Cu *.Mask)
      (net 6 GND))
    (pad 14 thru_hole oval (at 1.699529 -6.86166 180) (size 1.6 1.6) (drill 0.8) (layers *.Cu *.Mask)
      (net 16 "Net-(U2-Pad13)"))
    (pad 6 thru_hole oval (at 14.399529 -14.48166 180) (size 1.6 1.6) (drill 0.8) (layers *.Cu *.Mask)
      (net 22 "Net-(M1-Pad1)"))
    (pad 13 thru_hole oval (at 1.699529 -9.40166 180) (size 1.6 1.6) (drill 0.8) (layers *.Cu *.Mask)
      (net 16 "Net-(U2-Pad13)"))
    (pad 5 thru_hole oval (at 14.399529 -11.94166 180) (size 1.6 1.6) (drill 0.8) (layers *.Cu *.Mask)
      (net 21 "Net-(M1-Pad2)"))
    (pad 12 thru_hole oval (at 1.699529 -11.94166 180) (size 1.6 1.6) (drill 0.8) (layers *.Cu *.Mask)
      (net 41 V3V))
    (pad 4 thru_hole oval (at 14.399529 -9.40166 180) (size 1.6 1.6) (drill 0.8) (layers *.Cu *.Mask)
      (net 20 "Net-(M1-Pad3)"))
    (pad 11 thru_hole oval (at 1.699529 -14.48166 180) (size 1.6 1.6) (drill 0.8) (layers *.Cu *.Mask)
      (net 41 V3V))
    (pad 3 thru_hole oval (at 14.399529 -6.86166 180) (size 1.6 1.6) (drill 0.8) (layers *.Cu *.Mask)
      (net 19 "Net-(M1-Pad4)"))
    (pad 10 thru_hole oval (at 1.699529 -17.02166 180) (size 1.6 1.6) (drill 0.8) (layers *.Cu *.Mask)
      (net 41 V3V))
    (pad 2 thru_hole oval (at 14.399529 -4.32166 180) (size 1.6 1.6) (drill 0.8) (layers *.Cu *.Mask)
      (net 41 V3V))
    (pad 9 thru_hole oval (at 1.699529 -19.56166 180) (size 1.6 1.6) (drill 0.8) (layers *.Cu *.Mask)
      (net 73 "Net-(R1-Pad2)"))
    (pad 1 thru_hole rect (at 14.399529 -1.78166 180) (size 1.6 1.6) (drill 0.8) (layers *.Cu *.Mask)
      (net 6 GND))
  )

  (module multispeq:SparkFunMotorDriver_Dual_TB6612FNG (layer F.Cu) (tedit 6096FC30) (tstamp 60975245)
    (at 123.79 86.55 90)
    (descr "Pololu Breakout 16-pin 15.2x20.3mm 0.6x0.8\\")
    (path /6096F279)
    (fp_text reference U4 (at 8.887729 -7.62366 270) (layer F.SilkS)
      (effects (font (size 1 1) (thickness 0.15)))
    )
    (fp_text value SparkFunMotorDriver_Dual_TB6612FNG (at 6.35 20.17 90) (layer F.Fab)
      (effects (font (size 1 1) (thickness 0.15)))
    )
    (fp_poly (pts (xy 10.668 -25.908) (xy 14.732 -25.908) (xy 14.732 -23.622) (xy 10.668 -23.622)) (layer F.SilkS) (width 0.15))
    (fp_poly (pts (xy 9.144 -21.59) (xy 16.51 -21.59) (xy 16.51 -14.732) (xy 9.144 -14.732)) (layer F.SilkS) (width 0.15))
    (fp_text user DRIVER (at 13.208 -11.176 90) (layer F.SilkS)
      (effects (font (size 1 1) (thickness 0.15)))
    )
    (fp_text user MOTOR (at 13.208 -12.7 90) (layer F.SilkS)
      (effects (font (size 1 1) (thickness 0.15)))
    )
    (fp_text user %R (at 8.887729 -10.16366 270) (layer F.Fab)
      (effects (font (size 1 1) (thickness 0.15)))
    )
    (fp_line (start 24.257729 -8.76366) (end 24.257729 -29.34366) (layer F.SilkS) (width 0.12))
    (fp_line (start 24.257729 -29.34366) (end 1.137729 -29.34366) (layer F.SilkS) (width 0.12))
    (fp_line (start 1.137729 -29.34366) (end 1.137729 -8.76366) (layer F.SilkS) (width 0.12))
    (fp_line (start 1.137729 -8.76366) (end 24.257729 -8.76366) (layer F.SilkS) (width 0.12))
    (fp_line (start 24.127729 -8.89366) (end 1.267729 -8.89366) (layer F.Fab) (width 0.1))
    (fp_line (start 1.267729 -8.89366) (end 1.267729 -29.21366) (layer F.Fab) (width 0.1))
    (fp_line (start 1.267729 -29.21366) (end 24.127729 -29.21366) (layer F.Fab) (width 0.1))
    (fp_line (start 24.127729 -29.21366) (end 24.127729 -8.76366) (layer F.Fab) (width 0.1))
    (fp_line (start 24.387729 -8.64366) (end 1.027729 -8.64366) (layer F.CrtYd) (width 0.05))
    (fp_line (start 24.387729 -8.64366) (end 24.387729 -29.46366) (layer F.CrtYd) (width 0.05))
    (fp_line (start 1.027729 -29.46366) (end 1.027729 -8.64366) (layer F.CrtYd) (width 0.05))
    (fp_line (start 1.027729 -29.46366) (end 24.387729 -29.46366) (layer F.CrtYd) (width 0.05))
    (pad 1 thru_hole rect (at 22.86 -10.16366 270) (size 1.6 1.6) (drill 0.8) (layers *.Cu *.Mask)
      (net 72 VMOT))
    (pad 9 thru_hole oval (at 2.537729 -27.94366 270) (size 1.6 1.6) (drill 0.8) (layers *.Cu *.Mask)
      (net 6 GND))
    (pad 2 thru_hole oval (at 22.857729 -12.70366 270) (size 1.6 1.6) (drill 0.8) (layers *.Cu *.Mask)
      (net 41 V3V))
    (pad 10 thru_hole oval (at 2.537729 -25.40366 270) (size 1.6 1.6) (drill 0.8) (layers *.Cu *.Mask)
      (net 12 "Net-(U4-Pad10)"))
    (pad 3 thru_hole oval (at 22.857729 -15.24366 270) (size 1.6 1.6) (drill 0.8) (layers *.Cu *.Mask)
      (net 6 GND))
    (pad 11 thru_hole oval (at 2.537729 -22.86366 270) (size 1.6 1.6) (drill 0.8) (layers *.Cu *.Mask)
      (net 6 GND))
    (pad 4 thru_hole oval (at 22.857729 -17.78366 270) (size 1.6 1.6) (drill 0.8) (layers *.Cu *.Mask)
      (net 18 "Net-(M2-Pad1)"))
    (pad 12 thru_hole oval (at 2.537729 -20.32366 270) (size 1.6 1.6) (drill 0.8) (layers *.Cu *.Mask)
      (net 41 V3V))
    (pad 5 thru_hole oval (at 22.857729 -20.32366 270) (size 1.6 1.6) (drill 0.8) (layers *.Cu *.Mask)
      (net 17 "Net-(M2-Pad2)"))
    (pad 13 thru_hole oval (at 2.537729 -17.78366 270) (size 1.6 1.6) (drill 0.8) (layers *.Cu *.Mask)
      (net 10 "Net-(U3-Pad13)"))
    (pad 6 thru_hole oval (at 22.857729 -22.86366 270) (size 1.6 1.6) (drill 0.8) (layers *.Cu *.Mask)
      (net 24 "Net-(M3-Pad1)"))
    (pad 14 thru_hole oval (at 2.537729 -15.24366 270) (size 1.6 1.6) (drill 0.8) (layers *.Cu *.Mask)
      (net 41 V3V))
    (pad 7 thru_hole oval (at 22.857729 -25.40366 270) (size 1.6 1.6) (drill 0.8) (layers *.Cu *.Mask)
      (net 23 "Net-(M3-Pad2)"))
    (pad 15 thru_hole oval (at 2.537729 -12.70366 270) (size 1.6 1.6) (drill 0.8) (layers *.Cu *.Mask)
      (net 6 GND))
    (pad 8 thru_hole oval (at 22.86 -27.94 270) (size 1.6 1.6) (drill 0.8) (layers *.Cu *.Mask)
      (net 6 GND))
    (pad 16 thru_hole oval (at 2.537729 -10.16366 270) (size 1.6 1.6) (drill 0.8) (layers *.Cu *.Mask)
      (net 13 "Net-(U4-Pad16)"))
  )

  (module multispeq:SparkFunMotorDriver_Dual_TB6612FNG (layer F.Cu) (tedit 6096FC30) (tstamp 60975220)
    (at 158.39 84.89 90)
    (descr "Pololu Breakout 16-pin 15.2x20.3mm 0.6x0.8\\")
    (path /6096F22B)
    (fp_text reference U3 (at 8.887729 -7.62366 270) (layer F.SilkS)
      (effects (font (size 1 1) (thickness 0.15)))
    )
    (fp_text value SparkFunMotorDriver_Dual_TB6612FNG (at 34.29 4.35 90) (layer F.Fab)
      (effects (font (size 1 1) (thickness 0.15)))
    )
    (fp_line (start 1.027729 -29.46366) (end 24.387729 -29.46366) (layer F.CrtYd) (width 0.05))
    (fp_line (start 1.027729 -29.46366) (end 1.027729 -8.64366) (layer F.CrtYd) (width 0.05))
    (fp_line (start 24.387729 -8.64366) (end 24.387729 -29.46366) (layer F.CrtYd) (width 0.05))
    (fp_line (start 24.387729 -8.64366) (end 1.027729 -8.64366) (layer F.CrtYd) (width 0.05))
    (fp_line (start 24.127729 -29.21366) (end 24.127729 -8.76366) (layer F.Fab) (width 0.1))
    (fp_line (start 1.267729 -29.21366) (end 24.127729 -29.21366) (layer F.Fab) (width 0.1))
    (fp_line (start 1.267729 -8.89366) (end 1.267729 -29.21366) (layer F.Fab) (width 0.1))
    (fp_line (start 24.127729 -8.89366) (end 1.267729 -8.89366) (layer F.Fab) (width 0.1))
    (fp_line (start 1.137729 -8.76366) (end 24.257729 -8.76366) (layer F.SilkS) (width 0.12))
    (fp_line (start 1.137729 -29.34366) (end 1.137729 -8.76366) (layer F.SilkS) (width 0.12))
    (fp_line (start 24.257729 -29.34366) (end 1.137729 -29.34366) (layer F.SilkS) (width 0.12))
    (fp_line (start 24.257729 -8.76366) (end 24.257729 -29.34366) (layer F.SilkS) (width 0.12))
    (fp_text user %R (at 8.887729 -10.16366 270) (layer F.Fab)
      (effects (font (size 1 1) (thickness 0.15)))
    )
    (fp_text user MOTOR (at 13.208 -12.7 90) (layer F.SilkS)
      (effects (font (size 1 1) (thickness 0.15)))
    )
    (fp_text user DRIVER (at 13.208 -11.176 90) (layer F.SilkS)
      (effects (font (size 1 1) (thickness 0.15)))
    )
    (fp_poly (pts (xy 9.144 -21.59) (xy 16.51 -21.59) (xy 16.51 -14.732) (xy 9.144 -14.732)) (layer F.SilkS) (width 0.15))
    (fp_poly (pts (xy 10.668 -25.908) (xy 14.732 -25.908) (xy 14.732 -23.622) (xy 10.668 -23.622)) (layer F.SilkS) (width 0.15))
    (pad 16 thru_hole oval (at 2.537729 -10.16366 270) (size 1.6 1.6) (drill 0.8) (layers *.Cu *.Mask)
      (net 7 "Net-(U3-Pad16)"))
    (pad 8 thru_hole oval (at 22.86 -27.94 270) (size 1.6 1.6) (drill 0.8) (layers *.Cu *.Mask)
      (net 6 GND))
    (pad 15 thru_hole oval (at 2.537729 -12.70366 270) (size 1.6 1.6) (drill 0.8) (layers *.Cu *.Mask)
      (net 6 GND))
    (pad 7 thru_hole oval (at 22.857729 -25.40366 270) (size 1.6 1.6) (drill 0.8) (layers *.Cu *.Mask)
      (net 8 "Net-(U3-Pad7)"))
    (pad 14 thru_hole oval (at 2.537729 -15.24366 270) (size 1.6 1.6) (drill 0.8) (layers *.Cu *.Mask)
      (net 41 V3V))
    (pad 6 thru_hole oval (at 22.857729 -22.86366 270) (size 1.6 1.6) (drill 0.8) (layers *.Cu *.Mask)
      (net 9 "Net-(U3-Pad6)"))
    (pad 13 thru_hole oval (at 2.537729 -17.78366 270) (size 1.6 1.6) (drill 0.8) (layers *.Cu *.Mask)
      (net 10 "Net-(U3-Pad13)"))
    (pad 5 thru_hole oval (at 22.857729 -20.32366 270) (size 1.6 1.6) (drill 0.8) (layers *.Cu *.Mask)
      (net 26 "Net-(M4-Pad2)"))
    (pad 12 thru_hole oval (at 2.537729 -20.32366 270) (size 1.6 1.6) (drill 0.8) (layers *.Cu *.Mask)
      (net 41 V3V))
    (pad 4 thru_hole oval (at 22.857729 -17.78366 270) (size 1.6 1.6) (drill 0.8) (layers *.Cu *.Mask)
      (net 25 "Net-(M4-Pad1)"))
    (pad 11 thru_hole oval (at 2.537729 -22.86366 270) (size 1.6 1.6) (drill 0.8) (layers *.Cu *.Mask)
      (net 6 GND))
    (pad 3 thru_hole oval (at 22.857729 -15.24366 270) (size 1.6 1.6) (drill 0.8) (layers *.Cu *.Mask)
      (net 6 GND))
    (pad 10 thru_hole oval (at 2.537729 -25.40366 270) (size 1.6 1.6) (drill 0.8) (layers *.Cu *.Mask)
      (net 11 "Net-(U3-Pad10)"))
    (pad 2 thru_hole oval (at 22.857729 -12.70366 270) (size 1.6 1.6) (drill 0.8) (layers *.Cu *.Mask)
      (net 41 V3V))
    (pad 9 thru_hole oval (at 2.537729 -27.94366 270) (size 1.6 1.6) (drill 0.8) (layers *.Cu *.Mask)
      (net 6 GND))
    (pad 1 thru_hole rect (at 22.86 -10.16366 270) (size 1.6 1.6) (drill 0.8) (layers *.Cu *.Mask)
      (net 72 VMOT))
  )

  (module multispeq:HC_05_Bluetooth (layer F.Cu) (tedit 578916FB) (tstamp 5D8D93CD)
    (at 174.03 73 270)
    (path /609E57BF)
    (fp_text reference U1 (at 2.65 15.725 270) (layer F.SilkS)
      (effects (font (size 1 1) (thickness 0.15)))
    )
    (fp_text value ITEAD_HC-05_fewerpin (at -1.125 15.675 270) (layer F.SilkS)
      (effects (font (size 1 1) (thickness 0.15)))
    )
    (fp_text user GND (at 5.16 16.04 270) (layer F.SilkS)
      (effects (font (size 0.8 0.8) (thickness 0.15)))
    )
    (fp_text user GND (at -5.21 16.08 270) (layer F.SilkS)
      (effects (font (size 0.8 0.8) (thickness 0.15)))
    )
    (fp_text user GND (at 5.975 10.25 270) (layer F.SilkS)
      (effects (font (size 0.8 0.8) (thickness 0.15)))
    )
    (fp_text user LED1 (at 3.575 -1.78 270) (layer F.SilkS)
      (effects (font (size 0.8 0.8) (thickness 0.15)))
    )
    (fp_text user LED2 (at 3.575 -3.28 270) (layer F.SilkS)
      (effects (font (size 0.8 0.8) (thickness 0.15)))
    )
    (fp_text user "KEY (34)" (at 2.375 -6.29 270) (layer F.SilkS)
      (effects (font (size 0.8 0.8) (thickness 0.15)))
    )
    (fp_text user TX (at -9.08 -6.13 270) (layer F.SilkS)
      (effects (font (size 0.8 0.8) (thickness 0.15)))
    )
    (fp_text user RX (at -9.15 -4.75 270) (layer F.SilkS)
      (effects (font (size 0.8 0.8) (thickness 0.15)))
    )
    (fp_text user 3.3V (at -9.59 10.33 270) (layer F.SilkS)
      (effects (font (size 0.8 0.8) (thickness 0.15)))
    )
    (fp_text user GND (at -9.47 11.8 270) (layer F.SilkS)
      (effects (font (size 0.8 0.8) (thickness 0.15)))
    )
    (fp_line (start -7.5 14.45) (end 7.5 14.45) (layer F.SilkS) (width 0.15))
    (fp_line (start 7.5 14.45) (end 7.5 -14.45) (layer F.SilkS) (width 0.15))
    (fp_line (start 7.5 -14.45) (end -7.5 -14.45) (layer F.SilkS) (width 0.15))
    (fp_line (start -7.5 -14.45) (end -7.5 14.45) (layer F.SilkS) (width 0.15))
    (pad 21 smd rect (at 5.2 13.85) (size 2.5 1) (layers F.Cu F.Paste F.Mask)
      (net 6 GND))
    (pad 14 smd rect (at -5.23 13.85) (size 2.5 1) (layers F.Cu F.Paste F.Mask)
      (net 6 GND))
    (pad 22 smd rect (at 6.8 11.66 270) (size 2.5 1) (layers F.Cu F.Paste F.Mask)
      (net 6 GND))
    (pad 31 smd rect (at 6.8 -1.84 270) (size 2.5 1) (layers F.Cu F.Paste F.Mask)
      (net 3 "Net-(U1-Pad31)"))
    (pad 32 smd rect (at 6.8 -3.34 270) (size 2.5 1) (layers F.Cu F.Paste F.Mask)
      (net 4 "Net-(U1-Pad32)"))
    (pad 34 smd rect (at 6.8 -6.34 270) (size 2.5 1) (layers F.Cu F.Paste F.Mask)
      (net 5 "Net-(U1-Pad34)"))
    (pad 1 smd rect (at -6.8 -6.34 270) (size 2.5 1) (layers F.Cu F.Paste F.Mask)
      (net 55 "Net-(U1-Pad1)"))
    (pad 2 smd rect (at -6.8 -4.84 270) (size 2.5 1) (layers F.Cu F.Paste F.Mask)
      (net 54 "Net-(U1-Pad2)"))
    (pad 12 smd rect (at -6.8 10.16 270) (size 2.5 1) (layers F.Cu F.Paste F.Mask)
      (net 41 V3V))
    (pad 13 smd rect (at -6.8 11.66 270) (size 2.5 1) (layers F.Cu F.Paste F.Mask)
      (net 6 GND))
  )

  (gr_text "moved co2 sensor pins to left, to align correctly\n" (at 83.33 57.82) (layer F.SilkS)
    (effects (font (size 1.5 1.5) (thickness 0.3)))
  )
  (gr_text "SOIL RESPIRATION v1.1\nOur Sci" (at 123.36 137.75) (layer F.SilkS)
    (effects (font (size 1.5 1.5) (thickness 0.3)) (justify left))
  )

)
