(module Seoul_Z7 (layer F.Cu) (tedit 4FAB6C98)
  (descr "Seoul Z7")
  (attr smd)
  (fp_text reference LD? (at 0 -4.20116) (layer F.SilkS)
    (effects (font (size 0.99822 0.99822) (thickness 0.14986)))
  )
  (fp_text value Seoul_Z7 (at 0 4.09956) (layer F.SilkS)
    (effects (font (size 0.5207 0.5207) (thickness 0.09906)))
  )
  (fp_circle (center 3.79984 -3.0988) (end 3.59918 -3.0988) (layer F.SilkS) (width 0.254))
  (fp_circle (center 0 0) (end -2.79908 0) (layer F.SilkS) (width 0.254))
  (fp_line (start -4.50088 -3.50012) (end 4.50088 -3.50012) (layer F.SilkS) (width 0.254))
  (fp_line (start 4.50088 -3.50012) (end 4.50088 3.50012) (layer F.SilkS) (width 0.254))
  (fp_line (start 4.50088 3.50012) (end -4.50088 3.50012) (layer F.SilkS) (width 0.254))
  (fp_line (start -4.50088 3.50012) (end -4.50088 -3.50012) (layer F.SilkS) (width 0.254))
  (pad 3 smd rect (at 3.70078 0.7747) (size 1.2573 1.05918) (layers F.Cu F.Paste F.Mask)
    (solder_mask_margin 0.04826) (solder_paste_margin -0.04826))
  (pad 9 smd rect (at 0 0) (size 4.58978 6.67766) (layers F.Cu F.Paste F.Mask)
    (solder_mask_margin 0.0508) (solder_paste_margin -0.0508))
  (pad 1 smd rect (at 3.70078 -2.3495) (size 1.2573 1.05918) (layers F.Cu F.Paste F.Mask)
    (solder_mask_margin 0.04826) (solder_paste_margin -0.04826))
  (pad 2 smd rect (at 3.70078 -0.7747) (size 1.2573 1.05918) (layers F.Cu F.Paste F.Mask)
    (solder_mask_margin 0.04826) (solder_paste_margin -0.04826))
  (pad 4 smd rect (at 3.70078 2.3495) (size 1.2573 1.05918) (layers F.Cu F.Paste F.Mask)
    (solder_mask_margin 0.04826) (solder_paste_margin -0.04826))
  (pad 5 smd rect (at -3.70078 2.3495) (size 1.2573 1.05918) (layers F.Cu F.Paste F.Mask)
    (solder_mask_margin 0.04826) (solder_paste_margin -0.04826))
  (pad 6 smd rect (at -3.70078 0.7747) (size 1.2573 1.05918) (layers F.Cu F.Paste F.Mask)
    (solder_mask_margin 0.04826) (solder_paste_margin -0.04826))
  (pad 7 smd rect (at -3.70078 -0.7747) (size 1.2573 1.05918) (layers F.Cu F.Paste F.Mask)
    (solder_mask_margin 0.04826) (solder_paste_margin -0.04826))
  (pad 8 smd rect (at -3.70078 -2.3495) (size 1.2573 1.05918) (layers F.Cu F.Paste F.Mask)
    (solder_mask_margin 0.04826) (solder_paste_margin -0.04826))
  (model walter\smd_leds\seoul_z7.wrl
    (at (xyz 0 0 0))
    (scale (xyz 1 1 1))
    (rotate (xyz 0 0 0))
  )
)
