(module conn_usb_B_micro_smd-4_tape (layer F.Cu) (tedit 5B96DA3F)
  (descr "10118194-0001LF  USB B micro SMD connector with retention pins")
  (tags "USB, B, micro, SMD, connector")
  (attr smd)
  (fp_text reference P4 (at 2.603871 -0.024843 90) (layer F.SilkS)
    (effects (font (size 0.4 0.4) (thickness 0.1)))
  )
  (fp_text value USB_MICRO (at -3.997589 -0.024843 90) (layer F.SilkS)
    (effects (font (size 0.4 0.4) (thickness 0.1)))
  )
  (fp_line (start 2.001891 4.176317) (end 2.001891 -4.226003) (layer F.SilkS) (width 0.20066))
  (fp_line (start 2.103491 4.176317) (end 2.103491 -4.226003) (layer F.SilkS) (width 0.20066))
  (fp_line (start 2.253491 -3.926003) (end 2.052831 -3.926003) (layer F.SilkS) (width 0.20066))
  (fp_line (start 1.452911 -4.226003) (end 1.452911 4.176317) (layer F.SilkS) (width 0.20066))
  (fp_line (start 2.052831 3.876317) (end 2.253491 3.876317) (layer F.SilkS) (width 0.20066))
  (fp_line (start 2.003491 4.274057) (end -2.997769 4.274057) (layer F.SilkS) (width 0.20066))
  (fp_line (start -3.297769 3.874057) (end -3.297769 -3.923743) (layer F.SilkS) (width 0.20066))
  (fp_line (start -2.897769 -4.323743) (end 2.103491 -4.323743) (layer F.SilkS) (width 0.20066))
  (pad "" smd rect (at 0.002911 1.174037 90) (size 1.89738 1.89738) (layers F.Cu F.Paste F.Mask))
  (pad "" smd rect (at 0.002911 -1.223723 90) (size 1.89738 1.89738) (layers F.Cu F.Paste F.Mask))
  (pad "" smd rect (at 0.002911 -3.524843 90) (size 1.65 1.55) (layers F.Cu F.Paste F.Mask))
  (pad "" smd rect (at 0.002911 3.475157 90) (size 1.65 1.55) (layers F.Cu F.Paste F.Mask))
  (pad 1 smd rect (at -2.671709 1.275637 90) (size 0.39878 1.34874) (layers F.Cu F.Paste F.Mask))
  (pad 2 smd rect (at -2.671709 0.622857 90) (size 0.39878 1.3462) (layers F.Cu F.Paste F.Mask))
  (pad 3 smd rect (at -2.671709 -0.024843 90) (size 0.39878 1.3462) (layers F.Cu F.Paste F.Mask))
  (pad 4 smd rect (at -2.671709 -0.672543 90) (size 0.39878 1.3462) (layers F.Cu F.Paste F.Mask))
  (pad 5 smd rect (at -2.671709 -1.325323 90) (size 0.39878 1.3462) (layers F.Cu F.Paste F.Mask))
  (pad "" thru_hole oval (at -2.671709 -2.524843 90) (size 1.25 0.95) (drill oval 0.85 0.55) (layers *.Cu *.Mask F.SilkS))
  (pad "" thru_hole oval (at -2.671709 2.475157 90) (size 1.25 0.95) (drill oval 0.85 0.55) (layers *.Cu *.Mask F.SilkS))
  (pad "" thru_hole oval (at 0.002911 -3.524843 90) (size 1 1.524) (drill oval 0.5 1.15) (layers *.Cu *.Mask F.SilkS))
  (pad "" thru_hole oval (at 0.002911 3.475157 90) (size 1 1.524) (drill oval 0.5 1.15) (layers *.Cu *.Mask F.SilkS))
  (model walter\conn_pc\usb_B_micro_smd-2.wrl
    (at (xyz 0 0 0))
    (scale (xyz 1 1 1))
    (rotate (xyz 0 0 0))
  )
)
