(module Seoul_5630 (layer F.Cu) (tedit 4F5DD0AC)
  (descr "Seoul 5630")
  (fp_text reference LD** (at 0 -2.49936) (layer F.SilkS)
    (effects (font (size 0.8001 0.8001) (thickness 0.14986)))
  )
  (fp_text value Seoul_5630 (at 0 2.60096) (layer F.SilkS)
    (effects (font (size 0.8001 0.8001) (thickness 0.14986)))
  )
  (fp_line (start -2.60096 0.29972) (end -2.79908 0.29972) (layer F.SilkS) (width 0.127))
  (fp_line (start -2.79908 0.29972) (end -2.79908 1.19888) (layer F.SilkS) (width 0.127))
  (fp_line (start -2.79908 1.19888) (end -2.60096 1.19888) (layer F.SilkS) (width 0.127))
  (fp_line (start -2.60096 -1.19888) (end -2.79908 -1.19888) (layer F.SilkS) (width 0.127))
  (fp_line (start -2.79908 -1.19888) (end -2.79908 -0.29972) (layer F.SilkS) (width 0.127))
  (fp_line (start -2.79908 -0.29972) (end -2.60096 -0.29972) (layer F.SilkS) (width 0.127))
  (fp_line (start 2.60096 -0.29972) (end 2.79908 -0.29972) (layer F.SilkS) (width 0.127))
  (fp_line (start 2.79908 -0.29972) (end 2.79908 -1.19888) (layer F.SilkS) (width 0.127))
  (fp_line (start 2.79908 -1.19888) (end 2.60096 -1.19888) (layer F.SilkS) (width 0.127))
  (fp_line (start 2.60096 1.19888) (end 2.79908 1.19888) (layer F.SilkS) (width 0.127))
  (fp_line (start 2.79908 1.19888) (end 2.79908 0.29972) (layer F.SilkS) (width 0.127))
  (fp_line (start 2.79908 0.29972) (end 2.60096 0.29972) (layer F.SilkS) (width 0.127))
  (fp_line (start 1.84912 -1.30048) (end -1.84912 -1.30048) (layer F.SilkS) (width 0.127))
  (fp_line (start 2.19964 0.94996) (end 2.19964 -0.94996) (layer F.SilkS) (width 0.127))
  (fp_line (start -1.84912 1.30048) (end 1.84912 1.30048) (layer F.SilkS) (width 0.127))
  (fp_line (start -2.19964 -0.94996) (end -2.19964 0.94996) (layer F.SilkS) (width 0.127))
  (fp_line (start -1.99898 -1.50114) (end -2.10058 -1.50114) (layer F.SilkS) (width 0.127))
  (fp_line (start -2.10058 -1.50114) (end -2.60096 -1.00076) (layer F.SilkS) (width 0.127))
  (fp_line (start -2.60096 -1.00076) (end -2.60096 -1.09982) (layer F.SilkS) (width 0.127))
  (fp_line (start -2.60096 -1.09982) (end -2.19964 -1.50114) (layer F.SilkS) (width 0.127))
  (fp_line (start -2.19964 -1.50114) (end -2.30124 -1.50114) (layer F.SilkS) (width 0.127))
  (fp_line (start -2.30124 -1.50114) (end -2.60096 -1.19888) (layer F.SilkS) (width 0.127))
  (fp_line (start -2.60096 -1.19888) (end -2.60096 -1.30048) (layer F.SilkS) (width 0.127))
  (fp_line (start -2.60096 -1.30048) (end -2.4003 -1.50114) (layer F.SilkS) (width 0.127))
  (fp_line (start -2.60096 -0.89916) (end -1.99898 -1.50114) (layer F.SilkS) (width 0.127))
  (fp_line (start -2.60096 -1.50114) (end -2.60096 1.50114) (layer F.SilkS) (width 0.127))
  (fp_line (start -2.60096 1.50114) (end 2.60096 1.50114) (layer F.SilkS) (width 0.127))
  (fp_line (start 2.60096 1.50114) (end 2.60096 -1.50114) (layer F.SilkS) (width 0.127))
  (fp_line (start 2.60096 -1.50114) (end -2.60096 -1.50114) (layer F.SilkS) (width 0.127))
  (fp_line (start 2.19964 0.94742) (end 2.15138 1.09728) (layer F.SilkS) (width 0.127))
  (fp_line (start 2.15138 1.09982) (end 2.00152 1.24968) (layer F.SilkS) (width 0.127))
  (fp_line (start -2.19964 0.94996) (end -2.15138 1.09982) (layer F.SilkS) (width 0.127))
  (fp_line (start -2.15138 1.09982) (end -2.00152 1.24968) (layer F.SilkS) (width 0.127))
  (fp_line (start 2.19964 -0.94742) (end 2.15138 -1.09728) (layer F.SilkS) (width 0.127))
  (fp_line (start 2.15138 -1.09982) (end 2.00152 -1.24968) (layer F.SilkS) (width 0.127))
  (fp_line (start 1.85166 1.29794) (end 2.00152 1.24714) (layer F.SilkS) (width 0.127))
  (fp_line (start -1.84912 1.29794) (end -1.99898 1.24714) (layer F.SilkS) (width 0.127))
  (fp_line (start 2.00152 -1.24714) (end 1.85166 -1.29794) (layer F.SilkS) (width 0.127))
  (fp_line (start -1.84912 -1.30048) (end -1.99898 -1.24968) (layer F.SilkS) (width 0.127))
  (fp_line (start -2.00152 -1.24714) (end -2.15138 -1.09728) (layer F.SilkS) (width 0.127))
  (fp_line (start -2.15138 -1.09982) (end -2.19964 -0.94996) (layer F.SilkS) (width 0.127))
  (pad 5 smd rect (at 2.52476 0.7493) (size 0.94996 1.09982) (layers F.Cu F.Paste F.Mask)
    (solder_mask_margin 0.0508) (solder_paste_margin -0.0508))
  (pad 1 smd rect (at 2.52476 -0.7493) (size 0.94996 1.09982) (layers F.Cu F.Paste F.Mask)
    (solder_mask_margin 0.0508) (solder_paste_margin -0.0508))
  (pad 2 smd rect (at -2.52476 0.7493) (size 0.94996 1.09982) (layers F.Cu F.Paste F.Mask)
    (solder_mask_margin 0.0508) (solder_paste_margin -0.0508))
  (pad 4 smd rect (at -2.52476 -0.7493) (size 0.94996 1.09982) (layers F.Cu F.Paste F.Mask)
    (solder_mask_margin 0.0508) (solder_paste_margin -0.0508))
  (pad 3 smd rect (at 0 0) (size 2.79908 1.80086) (layers F.Cu F.Paste F.Mask)
    (solder_mask_margin 0.0508) (solder_paste_margin -0.0508))
  (model walter\smd_leds\seoul_5630.wrl
    (at (xyz 0 0 0))
    (scale (xyz 1 1 1))
    (rotate (xyz 0 0 0))
  )
)
