%TF.GenerationSoftware,KiCad,Pcbnew,(2015-08-27 BZR 6130, Git 51a6d38)-product*%
%TF.CreationDate,2015-10-15T16:23:36-04:00*%
%TF.JobID,det-pulse,6465742D70756C73652E6B696361645F,rev?*%
%TF.FileFunction,Copper,L1,Top,Signal*%
%FSLAX46Y46*%
G04 Gerber Fmt 4.6, Leading zero omitted, Abs format (unit mm)*
G04 Created by KiCad (PCBNEW (2015-08-27 BZR 6130, Git 51a6d38)-product) date 10/15/2015 4:23:36 PM*
%MOMM*%
G01*
G04 APERTURE LIST*
%ADD10C,0.100000*%
%ADD11R,1.500000X1.250000*%
%ADD12R,1.250000X1.500000*%
%ADD13R,2.199640X1.524000*%
%ADD14O,2.199640X1.524000*%
%ADD15O,1.506220X3.014980*%
%ADD16C,1.143000*%
%ADD17R,1.727200X1.727200*%
%ADD18O,1.727200X1.727200*%
%ADD19R,1.500000X1.300000*%
%ADD20R,1.300000X1.500000*%
%ADD21R,0.300000X0.730000*%
%ADD22R,0.730000X0.300000*%
%ADD23R,1.250000X1.250000*%
%ADD24R,1.500000X0.600000*%
%ADD25C,0.600000*%
%ADD26C,0.250000*%
%ADD27C,0.254000*%
G04 APERTURE END LIST*
D10*
D11*
X145344200Y-101549200D03*
X142844200Y-101549200D03*
X152265700Y-109283500D03*
X149765700Y-109283500D03*
D12*
X155879800Y-99232400D03*
X155879800Y-101732400D03*
X156540200Y-108476100D03*
X156540200Y-105976100D03*
X167538400Y-106700000D03*
X167538400Y-109200000D03*
X170078400Y-106700000D03*
X170078400Y-109200000D03*
X164998400Y-105811000D03*
X164998400Y-108311000D03*
X165760400Y-98278000D03*
X165760400Y-95778000D03*
D13*
X140339600Y-106730800D03*
D14*
X140339600Y-101650800D03*
D15*
X155879800Y-94894400D03*
X158419800Y-94894400D03*
X153187400Y-117094000D03*
X155727400Y-117094000D03*
D16*
X162331400Y-95504000D03*
D17*
X177952400Y-99949000D03*
D18*
X180492400Y-99949000D03*
X177952400Y-102489000D03*
X180492400Y-102489000D03*
X177952400Y-105029000D03*
X180492400Y-105029000D03*
X177952400Y-107569000D03*
X180492400Y-107569000D03*
D19*
X146117300Y-107124500D03*
X143417300Y-107124500D03*
D20*
X143395700Y-109330500D03*
X143395700Y-112030500D03*
D19*
X145456900Y-99237800D03*
X142756900Y-99237800D03*
X159711400Y-102616000D03*
X162411400Y-102616000D03*
D21*
X166538400Y-104327000D03*
X167038400Y-104327000D03*
X167538400Y-104327000D03*
X168038400Y-104327000D03*
X168538400Y-104327000D03*
D22*
X169503400Y-103362000D03*
X169503400Y-102862000D03*
X169503400Y-102362000D03*
X169503400Y-101862000D03*
X169503400Y-101362000D03*
D21*
X168538400Y-100397000D03*
X168038400Y-100397000D03*
X167538400Y-100397000D03*
X167038400Y-100397000D03*
X166538400Y-100397000D03*
D22*
X165573400Y-101362000D03*
X165573400Y-101862000D03*
X165573400Y-102362000D03*
X165573400Y-102862000D03*
X165573400Y-103362000D03*
D23*
X168163400Y-101737000D03*
X166913400Y-101737000D03*
X168163400Y-102987000D03*
X166913400Y-102987000D03*
D24*
X148315700Y-99250500D03*
X148315700Y-100520500D03*
X148315700Y-101790500D03*
X148315700Y-103060500D03*
X148315700Y-104330500D03*
X148315700Y-105600500D03*
X148315700Y-106870500D03*
X153715700Y-106870500D03*
X153715700Y-105600500D03*
X153715700Y-104330500D03*
X153715700Y-103060500D03*
X153715700Y-101790500D03*
X153715700Y-100520500D03*
X153715700Y-99250500D03*
D25*
X183921400Y-91694000D03*
X157226000Y-101485700D03*
X152984200Y-112268000D03*
X179857400Y-95758000D03*
X167157400Y-95758000D03*
X179527200Y-109956600D03*
X148247100Y-98107500D03*
X146862800Y-99148900D03*
X161023300Y-93675200D03*
X145046700Y-112090200D03*
X169951400Y-110871000D03*
X164998400Y-102616000D03*
X164871400Y-101092000D03*
X164998400Y-109855000D03*
X169316400Y-104775000D03*
X167538400Y-110744000D03*
X170205400Y-104521000D03*
D26*
X155879800Y-99232400D02*
X153733800Y-99232400D01*
X153733800Y-99232400D02*
X153715700Y-99250500D01*
X155879800Y-99232400D02*
X160065400Y-99232400D01*
X162237100Y-105811000D02*
X164998400Y-105811000D01*
X161036000Y-104609900D02*
X162237100Y-105811000D01*
X161036000Y-100203000D02*
X161036000Y-104609900D01*
X160065400Y-99232400D02*
X161036000Y-100203000D01*
X155879800Y-94894400D02*
X156006800Y-99105400D01*
X156006800Y-99105400D02*
X155879800Y-99232400D01*
X165569400Y-103358000D02*
X165573400Y-103362000D01*
X164998400Y-105811000D02*
X164998400Y-103937000D01*
X164998400Y-103937000D02*
X165573400Y-103362000D01*
X165573400Y-103362000D02*
X166538400Y-104327000D01*
X166538400Y-104327000D02*
X166538400Y-105160000D01*
X166538400Y-105160000D02*
X164998400Y-105811000D01*
X155899800Y-99085400D02*
X156026800Y-99212400D01*
X155879800Y-101732400D02*
X156979300Y-101732400D01*
X156979300Y-101732400D02*
X157226000Y-101485700D01*
X148315700Y-99250500D02*
X149402800Y-99250500D01*
X151104600Y-110388400D02*
X152984200Y-112268000D01*
X151104600Y-104749600D02*
X151104600Y-110388400D01*
X149758400Y-103403400D02*
X151104600Y-104749600D01*
X149758400Y-99606100D02*
X149758400Y-103403400D01*
X149402800Y-99250500D02*
X149758400Y-99606100D01*
X180492400Y-102489000D02*
X180492400Y-102311200D01*
X180492400Y-102311200D02*
X181940200Y-100863400D01*
X167030400Y-95885000D02*
X165760400Y-95778000D01*
X167030400Y-95885000D02*
X167157400Y-95758000D01*
X179857400Y-95758000D02*
X167157400Y-95758000D01*
X181013100Y-95758000D02*
X179857400Y-95758000D01*
X181940200Y-96685100D02*
X181013100Y-95758000D01*
X181940200Y-100863400D02*
X181940200Y-96685100D01*
X180492400Y-102489000D02*
X180200300Y-102489000D01*
X180200300Y-102489000D02*
X179247800Y-103441500D01*
X179463700Y-109956600D02*
X179527200Y-109956600D01*
X179247800Y-109740700D02*
X179463700Y-109956600D01*
X179247800Y-103441500D02*
X179247800Y-109740700D01*
X145456900Y-99237800D02*
X146773900Y-99237800D01*
X148315700Y-98176100D02*
X148315700Y-99250500D01*
X148247100Y-98107500D02*
X148315700Y-98176100D01*
X146773900Y-99237800D02*
X146862800Y-99148900D01*
X158419800Y-94894400D02*
X159804100Y-94894400D01*
X159804100Y-94894400D02*
X161023300Y-93675200D01*
X153715700Y-100520500D02*
X154667900Y-100520500D01*
X154667900Y-100520500D02*
X155879800Y-101732400D01*
X145469600Y-99250500D02*
X145456900Y-99237800D01*
X143395700Y-112030500D02*
X144987000Y-112030500D01*
X144987000Y-112030500D02*
X145046700Y-112090200D01*
X169951400Y-110871000D02*
X180492400Y-110871000D01*
X170078400Y-110744000D02*
X169951400Y-110871000D01*
X170078400Y-109200000D02*
X170078400Y-110744000D01*
X180492400Y-110871000D02*
X183921400Y-107442000D01*
X164998400Y-102616000D02*
X164744400Y-102616000D01*
X165125400Y-102489000D02*
X164998400Y-102616000D01*
X165573400Y-102362000D02*
X165125400Y-102489000D01*
X164744400Y-102616000D02*
X162712400Y-104648000D01*
X165573400Y-101362000D02*
X165141400Y-101362000D01*
X165141400Y-101362000D02*
X164871400Y-101092000D01*
X164998400Y-108311000D02*
X164998400Y-109855000D01*
X180492400Y-102489000D02*
X180365400Y-102489000D01*
X145456900Y-99237800D02*
X145456900Y-99444800D01*
X168554400Y-104816998D02*
X169274402Y-104816998D01*
X169274402Y-104816998D02*
X169316400Y-104775000D01*
X168538400Y-104816998D02*
X168554400Y-104816998D01*
X168554400Y-104816998D02*
X168766402Y-104816998D01*
X169443400Y-104140000D02*
X169256400Y-104327000D01*
X169443400Y-104140000D02*
X169379900Y-104140000D01*
X168766402Y-104816998D02*
X169256400Y-104327000D01*
X168038400Y-104327000D02*
X168038400Y-104824998D01*
X168538400Y-104816998D02*
X168538400Y-104327000D01*
X168554400Y-104832998D02*
X168538400Y-104816998D01*
X168046400Y-104832998D02*
X168554400Y-104832998D01*
X168038400Y-104824998D02*
X168046400Y-104832998D01*
X169503400Y-103362000D02*
X170459400Y-103362000D01*
X169503400Y-102862000D02*
X170459400Y-102862000D01*
X170459400Y-102862000D02*
X170459400Y-102870000D01*
X169503400Y-102362000D02*
X170459400Y-102362000D01*
X169503400Y-101862000D02*
X170459400Y-101862000D01*
X170459400Y-101862000D02*
X170459400Y-101854000D01*
X169503400Y-101362000D02*
X170570400Y-101362000D01*
X170459400Y-101473000D02*
X170459400Y-101854000D01*
X170459400Y-101854000D02*
X170459400Y-102362000D01*
X170459400Y-102362000D02*
X170459400Y-102870000D01*
X170459400Y-102870000D02*
X170459400Y-103362000D01*
X170459400Y-103362000D02*
X170459400Y-104140000D01*
X170570400Y-101362000D02*
X170459400Y-101473000D01*
X167538400Y-109200000D02*
X167538400Y-110744000D01*
X169379900Y-104140000D02*
X169379900Y-104203500D01*
X169379900Y-104203500D02*
X170205400Y-104521000D01*
X165573400Y-102362000D02*
X165573400Y-102862000D01*
X165573400Y-102862000D02*
X165565400Y-102870000D01*
X169379900Y-104140000D02*
X170459400Y-104140000D01*
X170459400Y-104140000D02*
X170459400Y-104140000D01*
X172892400Y-109200000D02*
X170078400Y-109200000D01*
X173634400Y-108458000D02*
X172892400Y-109200000D01*
X173634400Y-107315000D02*
X173634400Y-108458000D01*
X170459400Y-104140000D02*
X173634400Y-107315000D01*
X169503400Y-103362000D02*
X169570400Y-103429000D01*
X167538400Y-109200000D02*
X170078400Y-109200000D01*
X145344200Y-101549200D02*
X145757900Y-101549200D01*
X145757900Y-101549200D02*
X146786600Y-100520500D01*
X146786600Y-100520500D02*
X148315700Y-100520500D01*
X148188700Y-100647500D02*
X148315700Y-100520500D01*
X145344200Y-101549200D02*
X145344200Y-101442200D01*
X145344200Y-101549200D02*
X145618200Y-101549200D01*
X142844200Y-101549200D02*
X140441200Y-101549200D01*
X140441200Y-101549200D02*
X140339600Y-101650800D01*
X140441200Y-101765100D02*
X140403100Y-101803200D01*
X142756900Y-99237800D02*
X142756900Y-101461900D01*
X142756900Y-101461900D02*
X142844200Y-101549200D01*
X142629900Y-99364800D02*
X142856900Y-99591800D01*
X142856900Y-99591800D02*
X142844200Y-101549200D01*
X159711400Y-102616000D02*
X158521400Y-102616000D01*
X156806900Y-104330500D02*
X153715700Y-104330500D01*
X158521400Y-102616000D02*
X156806900Y-104330500D01*
X153715700Y-104330500D02*
X152666700Y-104330500D01*
X152265700Y-104731500D02*
X152265700Y-109283500D01*
X152666700Y-104330500D02*
X152265700Y-104731500D01*
X167038400Y-104327000D02*
X167038400Y-106200000D01*
X167038400Y-106200000D02*
X167538400Y-106700000D01*
X167538400Y-104327000D02*
X167538400Y-105283000D01*
X168554400Y-105283000D02*
X169971400Y-106700000D01*
X167538400Y-105283000D02*
X168554400Y-105283000D01*
X169971400Y-106700000D02*
X170078400Y-106700000D01*
X166538400Y-100397000D02*
X166538400Y-99056000D01*
X166538400Y-99056000D02*
X165760400Y-98278000D01*
X165760400Y-98278000D02*
X165232400Y-98278000D01*
X165232400Y-98278000D02*
X166470758Y-97282000D01*
X177825400Y-97282000D02*
X180492400Y-99949000D01*
X166470758Y-97282000D02*
X177825400Y-97282000D01*
X143417300Y-107124500D02*
X140733300Y-107124500D01*
X140733300Y-107124500D02*
X140339600Y-106730800D01*
X143417300Y-107124500D02*
X143417300Y-109308900D01*
X143417300Y-109308900D02*
X143395700Y-109330500D01*
X142960100Y-106667300D02*
X143417300Y-107124500D01*
X143417300Y-107124500D02*
X143417300Y-106714300D01*
X167038400Y-100397000D02*
X167038400Y-98417000D01*
X175920400Y-97917000D02*
X177952400Y-99949000D01*
X167538400Y-97917000D02*
X175920400Y-97917000D01*
X167038400Y-98417000D02*
X167538400Y-97917000D01*
X167538400Y-100397000D02*
X167538400Y-98621002D01*
X173888400Y-98425000D02*
X177952400Y-102489000D01*
X167734402Y-98425000D02*
X173888400Y-98425000D01*
X167538400Y-98621002D02*
X167734402Y-98425000D01*
X168038400Y-100397000D02*
X168038400Y-99195000D01*
X171856400Y-98933000D02*
X177952400Y-105029000D01*
X168300400Y-98933000D02*
X171856400Y-98933000D01*
X168038400Y-99195000D02*
X168300400Y-98933000D01*
X168538400Y-100397000D02*
X168538400Y-99838000D01*
X169951400Y-99568000D02*
X177952400Y-107569000D01*
X168808400Y-99568000D02*
X169951400Y-99568000D01*
X168538400Y-99838000D02*
X168808400Y-99568000D01*
X148315700Y-105600500D02*
X149618700Y-105600500D01*
X149765700Y-105747500D02*
X149765700Y-109283500D01*
X149618700Y-105600500D02*
X149765700Y-105747500D01*
X148315700Y-104330500D02*
X146443700Y-104330500D01*
X148315700Y-103060500D02*
X146697700Y-103060500D01*
X146697700Y-103060500D02*
X146443700Y-103314500D01*
X148315700Y-101790500D02*
X147586700Y-101790500D01*
X147586700Y-101790500D02*
X146443700Y-103060500D01*
X146443700Y-103060500D02*
X146443700Y-103314500D01*
X146443700Y-103314500D02*
X146443700Y-104330500D01*
X146443700Y-104330500D02*
X146443700Y-105219500D01*
X146443700Y-105219500D02*
X146951700Y-105727500D01*
X146951700Y-105727500D02*
X148315700Y-105600500D01*
X156540200Y-105976100D02*
X156456700Y-105976100D01*
X156456700Y-105976100D02*
X155244800Y-107188000D01*
X156197300Y-114376200D02*
X156197300Y-116624100D01*
X155244800Y-113423700D02*
X156197300Y-114376200D01*
X155244800Y-107188000D02*
X155244800Y-113423700D01*
X156197300Y-116624100D02*
X155727400Y-117094000D01*
X151269700Y-113855500D02*
X154647900Y-113855500D01*
X145656300Y-107124500D02*
X151269700Y-113855500D01*
X155727400Y-114935000D02*
X155727400Y-117094000D01*
X154647900Y-113855500D02*
X155727400Y-114935000D01*
X153715700Y-105600500D02*
X156164600Y-105600500D01*
X156164600Y-105600500D02*
X156540200Y-105976100D01*
X146117300Y-107124500D02*
X145656300Y-107124500D01*
X162411400Y-102616000D02*
X162411400Y-95584000D01*
X162411400Y-95584000D02*
X162331400Y-95504000D01*
X162411400Y-102616000D02*
X163728400Y-102616000D01*
X164482400Y-101862000D02*
X165573400Y-101862000D01*
X163728400Y-102616000D02*
X164482400Y-101862000D01*
X153715700Y-103060500D02*
X151828500Y-103060500D01*
X151828500Y-91567000D02*
X152463500Y-91567000D01*
X150342600Y-93052900D02*
X151828500Y-91567000D01*
X150342600Y-101574600D02*
X150342600Y-93052900D01*
X151828500Y-103060500D02*
X150342600Y-101574600D01*
X183515000Y-104546400D02*
X180492400Y-107569000D01*
X183515000Y-94716600D02*
X183515000Y-104546400D01*
X180365400Y-91567000D02*
X183515000Y-94716600D01*
X152463500Y-91567000D02*
X180365400Y-91567000D01*
X153098500Y-92456000D02*
X151409400Y-94145100D01*
X152311100Y-101790500D02*
X153715700Y-101790500D01*
X151409400Y-100888800D02*
X152311100Y-101790500D01*
X151409400Y-94145100D02*
X151409400Y-100888800D01*
X182562500Y-102958900D02*
X180492400Y-105029000D01*
X182562500Y-95034100D02*
X182562500Y-102958900D01*
X179984400Y-92456000D02*
X182562500Y-95034100D01*
X153098500Y-92456000D02*
X179984400Y-92456000D01*
D27*
G36*
X184315000Y-90845034D02*
X184108199Y-90759162D01*
X183736233Y-90758838D01*
X183392457Y-90900883D01*
X183129208Y-91163673D01*
X182986562Y-91507201D01*
X182986238Y-91879167D01*
X183128283Y-92222943D01*
X183391073Y-92486192D01*
X183734601Y-92628838D01*
X184106567Y-92629162D01*
X184315000Y-92543039D01*
X184315000Y-124315000D01*
X135685000Y-124315000D01*
X135685000Y-117221000D01*
X151799290Y-117221000D01*
X151799290Y-117975380D01*
X151953554Y-118496919D01*
X152295660Y-118919724D01*
X152773525Y-119179427D01*
X152845726Y-119193783D01*
X153060400Y-119071162D01*
X153060400Y-117221000D01*
X151799290Y-117221000D01*
X135685000Y-117221000D01*
X135685000Y-116212620D01*
X151799290Y-116212620D01*
X151799290Y-116967000D01*
X153060400Y-116967000D01*
X153060400Y-115116838D01*
X152845726Y-114994217D01*
X152773525Y-115008573D01*
X152295660Y-115268276D01*
X151953554Y-115691081D01*
X151799290Y-116212620D01*
X135685000Y-116212620D01*
X135685000Y-112316250D01*
X142110700Y-112316250D01*
X142110700Y-112906809D01*
X142207373Y-113140198D01*
X142386001Y-113318827D01*
X142619390Y-113415500D01*
X143109950Y-113415500D01*
X143268700Y-113256750D01*
X143268700Y-112157500D01*
X143522700Y-112157500D01*
X143522700Y-113256750D01*
X143681450Y-113415500D01*
X144172010Y-113415500D01*
X144405399Y-113318827D01*
X144584027Y-113140198D01*
X144680700Y-112906809D01*
X144680700Y-112316250D01*
X144521950Y-112157500D01*
X143522700Y-112157500D01*
X143268700Y-112157500D01*
X142269450Y-112157500D01*
X142110700Y-112316250D01*
X135685000Y-112316250D01*
X135685000Y-101650800D01*
X138570793Y-101650800D01*
X138677133Y-102185409D01*
X138979965Y-102638628D01*
X139433184Y-102941460D01*
X139967793Y-103047800D01*
X140711407Y-103047800D01*
X141246016Y-102941460D01*
X141673896Y-102655559D01*
X141842310Y-102770631D01*
X142094200Y-102821640D01*
X143594200Y-102821640D01*
X143829517Y-102777362D01*
X144045641Y-102638290D01*
X144093334Y-102568489D01*
X144130110Y-102625641D01*
X144342310Y-102770631D01*
X144594200Y-102821640D01*
X145725112Y-102821640D01*
X145708802Y-102934303D01*
X145683700Y-103060500D01*
X145683700Y-105219500D01*
X145741552Y-105510339D01*
X145906299Y-105756901D01*
X145976458Y-105827060D01*
X145367300Y-105827060D01*
X145131983Y-105871338D01*
X144915859Y-106010410D01*
X144770869Y-106222610D01*
X144768219Y-106235697D01*
X144631390Y-106023059D01*
X144419190Y-105878069D01*
X144167300Y-105827060D01*
X142667300Y-105827060D01*
X142431983Y-105871338D01*
X142215859Y-106010410D01*
X142086860Y-106199206D01*
X142086860Y-105968800D01*
X142042582Y-105733483D01*
X141903510Y-105517359D01*
X141691310Y-105372369D01*
X141439420Y-105321360D01*
X139239780Y-105321360D01*
X139004463Y-105365638D01*
X138788339Y-105504710D01*
X138643349Y-105716910D01*
X138592340Y-105968800D01*
X138592340Y-107492800D01*
X138636618Y-107728117D01*
X138775690Y-107944241D01*
X138987890Y-108089231D01*
X139239780Y-108140240D01*
X141439420Y-108140240D01*
X141674737Y-108095962D01*
X141890861Y-107956890D01*
X141940323Y-107884500D01*
X142040558Y-107884500D01*
X142064138Y-108009817D01*
X142203210Y-108225941D01*
X142214261Y-108233492D01*
X142149269Y-108328610D01*
X142098260Y-108580500D01*
X142098260Y-110080500D01*
X142142538Y-110315817D01*
X142281610Y-110531941D01*
X142493810Y-110676931D01*
X142527190Y-110683691D01*
X142386001Y-110742173D01*
X142207373Y-110920802D01*
X142110700Y-111154191D01*
X142110700Y-111744750D01*
X142269450Y-111903500D01*
X143268700Y-111903500D01*
X143268700Y-111883500D01*
X143522700Y-111883500D01*
X143522700Y-111903500D01*
X144521950Y-111903500D01*
X144680700Y-111744750D01*
X144680700Y-111154191D01*
X144584027Y-110920802D01*
X144405399Y-110742173D01*
X144269413Y-110685846D01*
X144281017Y-110683662D01*
X144497141Y-110544590D01*
X144642131Y-110332390D01*
X144693140Y-110080500D01*
X144693140Y-108580500D01*
X144648862Y-108345183D01*
X144591536Y-108256096D01*
X144618741Y-108238590D01*
X144763731Y-108026390D01*
X144766381Y-108013303D01*
X144903210Y-108225941D01*
X145115410Y-108370931D01*
X145367300Y-108421940D01*
X145748711Y-108421940D01*
X150686032Y-114342257D01*
X150713025Y-114364056D01*
X150732299Y-114392901D01*
X150827578Y-114456564D01*
X150916735Y-114528564D01*
X150950014Y-114538373D01*
X150978861Y-114557648D01*
X151091255Y-114580005D01*
X151201174Y-114612404D01*
X151235672Y-114608731D01*
X151269700Y-114615500D01*
X154333098Y-114615500D01*
X154918408Y-115200810D01*
X154745858Y-115316104D01*
X154444954Y-115766439D01*
X154444384Y-115769306D01*
X154421246Y-115691081D01*
X154079140Y-115268276D01*
X153601275Y-115008573D01*
X153529074Y-114994217D01*
X153314400Y-115116838D01*
X153314400Y-116967000D01*
X153334400Y-116967000D01*
X153334400Y-117221000D01*
X153314400Y-117221000D01*
X153314400Y-119071162D01*
X153529074Y-119193783D01*
X153601275Y-119179427D01*
X154079140Y-118919724D01*
X154421246Y-118496919D01*
X154444384Y-118418694D01*
X154444954Y-118421561D01*
X154745858Y-118871896D01*
X155196193Y-119172800D01*
X155727400Y-119278464D01*
X156258607Y-119172800D01*
X156708942Y-118871896D01*
X157009846Y-118421561D01*
X157115510Y-117890354D01*
X157115510Y-116297646D01*
X157009846Y-115766439D01*
X156957300Y-115687798D01*
X156957300Y-114376200D01*
X156899448Y-114085361D01*
X156899448Y-114085360D01*
X156734701Y-113838799D01*
X156004800Y-113108898D01*
X156004800Y-109861100D01*
X156254450Y-109861100D01*
X156413200Y-109702350D01*
X156413200Y-108603100D01*
X156667200Y-108603100D01*
X156667200Y-109702350D01*
X156825950Y-109861100D01*
X157291510Y-109861100D01*
X157524899Y-109764427D01*
X157703527Y-109585798D01*
X157800200Y-109352409D01*
X157800200Y-108761850D01*
X157641450Y-108603100D01*
X156667200Y-108603100D01*
X156413200Y-108603100D01*
X156393200Y-108603100D01*
X156393200Y-108596750D01*
X163738400Y-108596750D01*
X163738400Y-109187309D01*
X163835073Y-109420698D01*
X164013701Y-109599327D01*
X164247090Y-109696000D01*
X164712650Y-109696000D01*
X164871400Y-109537250D01*
X164871400Y-108438000D01*
X165125400Y-108438000D01*
X165125400Y-109537250D01*
X165284150Y-109696000D01*
X165749710Y-109696000D01*
X165983099Y-109599327D01*
X166096675Y-109485750D01*
X166278400Y-109485750D01*
X166278400Y-110076309D01*
X166375073Y-110309698D01*
X166553701Y-110488327D01*
X166787090Y-110585000D01*
X167252650Y-110585000D01*
X167411400Y-110426250D01*
X167411400Y-109327000D01*
X167665400Y-109327000D01*
X167665400Y-110426250D01*
X167824150Y-110585000D01*
X168289710Y-110585000D01*
X168523099Y-110488327D01*
X168701727Y-110309698D01*
X168798400Y-110076309D01*
X168798400Y-109485750D01*
X168818400Y-109485750D01*
X168818400Y-110076309D01*
X168915073Y-110309698D01*
X169093701Y-110488327D01*
X169327090Y-110585000D01*
X169792650Y-110585000D01*
X169951400Y-110426250D01*
X169951400Y-109327000D01*
X170205400Y-109327000D01*
X170205400Y-110426250D01*
X170364150Y-110585000D01*
X170829710Y-110585000D01*
X171063099Y-110488327D01*
X171241727Y-110309698D01*
X171338400Y-110076309D01*
X171338400Y-109485750D01*
X171179650Y-109327000D01*
X170205400Y-109327000D01*
X169951400Y-109327000D01*
X168977150Y-109327000D01*
X168818400Y-109485750D01*
X168798400Y-109485750D01*
X168639650Y-109327000D01*
X167665400Y-109327000D01*
X167411400Y-109327000D01*
X166437150Y-109327000D01*
X166278400Y-109485750D01*
X166096675Y-109485750D01*
X166161727Y-109420698D01*
X166258400Y-109187309D01*
X166258400Y-108596750D01*
X166099650Y-108438000D01*
X165125400Y-108438000D01*
X164871400Y-108438000D01*
X163897150Y-108438000D01*
X163738400Y-108596750D01*
X156393200Y-108596750D01*
X156393200Y-108349100D01*
X156413200Y-108349100D01*
X156413200Y-108329100D01*
X156667200Y-108329100D01*
X156667200Y-108349100D01*
X157641450Y-108349100D01*
X157800200Y-108190350D01*
X157800200Y-107599791D01*
X157703527Y-107366402D01*
X157562290Y-107225164D01*
X157616641Y-107190190D01*
X157761631Y-106977990D01*
X157812640Y-106726100D01*
X157812640Y-105226100D01*
X157768362Y-104990783D01*
X157629290Y-104774659D01*
X157515377Y-104696825D01*
X158496312Y-103715890D01*
X158497310Y-103717441D01*
X158709510Y-103862431D01*
X158961400Y-103913440D01*
X160276000Y-103913440D01*
X160276000Y-104609900D01*
X160333852Y-104900739D01*
X160498599Y-105147301D01*
X161699699Y-106348401D01*
X161946261Y-106513148D01*
X162237100Y-106571000D01*
X163727842Y-106571000D01*
X163770238Y-106796317D01*
X163909310Y-107012441D01*
X163977406Y-107058969D01*
X163835073Y-107201302D01*
X163738400Y-107434691D01*
X163738400Y-108025250D01*
X163897150Y-108184000D01*
X164871400Y-108184000D01*
X164871400Y-108164000D01*
X165125400Y-108164000D01*
X165125400Y-108184000D01*
X166099650Y-108184000D01*
X166258400Y-108025250D01*
X166258400Y-107434691D01*
X166161727Y-107201302D01*
X166020490Y-107060064D01*
X166074841Y-107025090D01*
X166219831Y-106812890D01*
X166265960Y-106585098D01*
X166265960Y-107450000D01*
X166310238Y-107685317D01*
X166449310Y-107901441D01*
X166517406Y-107947969D01*
X166375073Y-108090302D01*
X166278400Y-108323691D01*
X166278400Y-108914250D01*
X166437150Y-109073000D01*
X167411400Y-109073000D01*
X167411400Y-109053000D01*
X167665400Y-109053000D01*
X167665400Y-109073000D01*
X168639650Y-109073000D01*
X168798400Y-108914250D01*
X168798400Y-108323691D01*
X168701727Y-108090302D01*
X168560490Y-107949064D01*
X168614841Y-107914090D01*
X168759831Y-107701890D01*
X168808310Y-107462491D01*
X168850238Y-107685317D01*
X168989310Y-107901441D01*
X169057406Y-107947969D01*
X168915073Y-108090302D01*
X168818400Y-108323691D01*
X168818400Y-108914250D01*
X168977150Y-109073000D01*
X169951400Y-109073000D01*
X169951400Y-109053000D01*
X170205400Y-109053000D01*
X170205400Y-109073000D01*
X171179650Y-109073000D01*
X171338400Y-108914250D01*
X171338400Y-108323691D01*
X171241727Y-108090302D01*
X171100490Y-107949064D01*
X171154841Y-107914090D01*
X171299831Y-107701890D01*
X171350840Y-107450000D01*
X171350840Y-105950000D01*
X171306562Y-105714683D01*
X171167490Y-105498559D01*
X170955290Y-105353569D01*
X170703400Y-105302560D01*
X169648762Y-105302560D01*
X169276862Y-104930660D01*
X169323400Y-104818309D01*
X169323400Y-104612750D01*
X169164650Y-104454000D01*
X168391400Y-104454000D01*
X168391400Y-104259440D01*
X168788400Y-104259440D01*
X169023717Y-104215162D01*
X169047279Y-104200000D01*
X169164650Y-104200000D01*
X169376400Y-103988250D01*
X169376400Y-103876229D01*
X169384831Y-103863890D01*
X169435840Y-103612000D01*
X169435840Y-101112000D01*
X169391562Y-100876683D01*
X169376400Y-100853121D01*
X169376400Y-100735750D01*
X169335840Y-100695190D01*
X169335840Y-100328000D01*
X169636598Y-100328000D01*
X169885598Y-100577000D01*
X169789150Y-100577000D01*
X169630400Y-100735750D01*
X169630400Y-103988250D01*
X169789150Y-104147000D01*
X169994709Y-104147000D01*
X170228098Y-104050327D01*
X170406727Y-103871699D01*
X170503400Y-103638310D01*
X170503400Y-103595750D01*
X170344650Y-103437000D01*
X170341426Y-103437000D01*
X170406727Y-103371699D01*
X170503400Y-103138310D01*
X170503400Y-103085690D01*
X170410744Y-102862000D01*
X170503400Y-102638310D01*
X170503400Y-102585690D01*
X170410744Y-102362000D01*
X170503400Y-102138310D01*
X170503400Y-102085690D01*
X170410744Y-101862000D01*
X170503400Y-101638310D01*
X170503400Y-101585690D01*
X170406727Y-101352301D01*
X170341426Y-101287000D01*
X170344650Y-101287000D01*
X170470124Y-101161526D01*
X176499625Y-107191027D01*
X176424441Y-107569000D01*
X176538515Y-108142489D01*
X176863371Y-108628670D01*
X177349552Y-108953526D01*
X177923041Y-109067600D01*
X177981759Y-109067600D01*
X178555248Y-108953526D01*
X179041429Y-108628670D01*
X179222400Y-108357828D01*
X179403371Y-108628670D01*
X179889552Y-108953526D01*
X180463041Y-109067600D01*
X180521759Y-109067600D01*
X181095248Y-108953526D01*
X181581429Y-108628670D01*
X181906285Y-108142489D01*
X182020359Y-107569000D01*
X181945175Y-107191027D01*
X184052401Y-105083801D01*
X184217148Y-104837239D01*
X184275000Y-104546400D01*
X184275000Y-94716600D01*
X184217148Y-94425761D01*
X184052401Y-94179199D01*
X180902801Y-91029599D01*
X180656239Y-90864852D01*
X180365400Y-90807000D01*
X151828500Y-90807000D01*
X151537661Y-90864852D01*
X151291099Y-91029599D01*
X149805199Y-92515499D01*
X149640452Y-92762061D01*
X149582600Y-93052900D01*
X149582600Y-98569374D01*
X149425398Y-98412173D01*
X149192009Y-98315500D01*
X148601450Y-98315500D01*
X148442700Y-98474250D01*
X148442700Y-99123500D01*
X148462700Y-99123500D01*
X148462700Y-99377500D01*
X148442700Y-99377500D01*
X148442700Y-99397500D01*
X148188700Y-99397500D01*
X148188700Y-99377500D01*
X147089450Y-99377500D01*
X146930700Y-99536250D01*
X146930700Y-99676810D01*
X146965366Y-99760500D01*
X146841900Y-99760500D01*
X146841900Y-99523550D01*
X146683150Y-99364800D01*
X145583900Y-99364800D01*
X145583900Y-99384800D01*
X145329900Y-99384800D01*
X145329900Y-99364800D01*
X145309900Y-99364800D01*
X145309900Y-99110800D01*
X145329900Y-99110800D01*
X145329900Y-98111550D01*
X145583900Y-98111550D01*
X145583900Y-99110800D01*
X146683150Y-99110800D01*
X146841900Y-98952050D01*
X146841900Y-98824190D01*
X146930700Y-98824190D01*
X146930700Y-98964750D01*
X147089450Y-99123500D01*
X148188700Y-99123500D01*
X148188700Y-98474250D01*
X148029950Y-98315500D01*
X147439391Y-98315500D01*
X147206002Y-98412173D01*
X147027373Y-98590801D01*
X146930700Y-98824190D01*
X146841900Y-98824190D01*
X146841900Y-98461490D01*
X146745227Y-98228101D01*
X146566598Y-98049473D01*
X146333209Y-97952800D01*
X145742650Y-97952800D01*
X145583900Y-98111550D01*
X145329900Y-98111550D01*
X145171150Y-97952800D01*
X144580591Y-97952800D01*
X144347202Y-98049473D01*
X144168573Y-98228101D01*
X144112246Y-98364087D01*
X144110062Y-98352483D01*
X143970990Y-98136359D01*
X143758790Y-97991369D01*
X143506900Y-97940360D01*
X142006900Y-97940360D01*
X141771583Y-97984638D01*
X141555459Y-98123710D01*
X141410469Y-98335910D01*
X141359460Y-98587800D01*
X141359460Y-99887800D01*
X141403738Y-100123117D01*
X141542810Y-100339241D01*
X141682387Y-100434610D01*
X141642759Y-100460110D01*
X141565298Y-100573478D01*
X141246016Y-100360140D01*
X140711407Y-100253800D01*
X139967793Y-100253800D01*
X139433184Y-100360140D01*
X138979965Y-100662972D01*
X138677133Y-101116191D01*
X138570793Y-101650800D01*
X135685000Y-101650800D01*
X135685000Y-90685000D01*
X184315000Y-90685000D01*
X184315000Y-90845034D01*
X184315000Y-90845034D01*
G37*
X184315000Y-90845034D02*
X184108199Y-90759162D01*
X183736233Y-90758838D01*
X183392457Y-90900883D01*
X183129208Y-91163673D01*
X182986562Y-91507201D01*
X182986238Y-91879167D01*
X183128283Y-92222943D01*
X183391073Y-92486192D01*
X183734601Y-92628838D01*
X184106567Y-92629162D01*
X184315000Y-92543039D01*
X184315000Y-124315000D01*
X135685000Y-124315000D01*
X135685000Y-117221000D01*
X151799290Y-117221000D01*
X151799290Y-117975380D01*
X151953554Y-118496919D01*
X152295660Y-118919724D01*
X152773525Y-119179427D01*
X152845726Y-119193783D01*
X153060400Y-119071162D01*
X153060400Y-117221000D01*
X151799290Y-117221000D01*
X135685000Y-117221000D01*
X135685000Y-116212620D01*
X151799290Y-116212620D01*
X151799290Y-116967000D01*
X153060400Y-116967000D01*
X153060400Y-115116838D01*
X152845726Y-114994217D01*
X152773525Y-115008573D01*
X152295660Y-115268276D01*
X151953554Y-115691081D01*
X151799290Y-116212620D01*
X135685000Y-116212620D01*
X135685000Y-112316250D01*
X142110700Y-112316250D01*
X142110700Y-112906809D01*
X142207373Y-113140198D01*
X142386001Y-113318827D01*
X142619390Y-113415500D01*
X143109950Y-113415500D01*
X143268700Y-113256750D01*
X143268700Y-112157500D01*
X143522700Y-112157500D01*
X143522700Y-113256750D01*
X143681450Y-113415500D01*
X144172010Y-113415500D01*
X144405399Y-113318827D01*
X144584027Y-113140198D01*
X144680700Y-112906809D01*
X144680700Y-112316250D01*
X144521950Y-112157500D01*
X143522700Y-112157500D01*
X143268700Y-112157500D01*
X142269450Y-112157500D01*
X142110700Y-112316250D01*
X135685000Y-112316250D01*
X135685000Y-101650800D01*
X138570793Y-101650800D01*
X138677133Y-102185409D01*
X138979965Y-102638628D01*
X139433184Y-102941460D01*
X139967793Y-103047800D01*
X140711407Y-103047800D01*
X141246016Y-102941460D01*
X141673896Y-102655559D01*
X141842310Y-102770631D01*
X142094200Y-102821640D01*
X143594200Y-102821640D01*
X143829517Y-102777362D01*
X144045641Y-102638290D01*
X144093334Y-102568489D01*
X144130110Y-102625641D01*
X144342310Y-102770631D01*
X144594200Y-102821640D01*
X145725112Y-102821640D01*
X145708802Y-102934303D01*
X145683700Y-103060500D01*
X145683700Y-105219500D01*
X145741552Y-105510339D01*
X145906299Y-105756901D01*
X145976458Y-105827060D01*
X145367300Y-105827060D01*
X145131983Y-105871338D01*
X144915859Y-106010410D01*
X144770869Y-106222610D01*
X144768219Y-106235697D01*
X144631390Y-106023059D01*
X144419190Y-105878069D01*
X144167300Y-105827060D01*
X142667300Y-105827060D01*
X142431983Y-105871338D01*
X142215859Y-106010410D01*
X142086860Y-106199206D01*
X142086860Y-105968800D01*
X142042582Y-105733483D01*
X141903510Y-105517359D01*
X141691310Y-105372369D01*
X141439420Y-105321360D01*
X139239780Y-105321360D01*
X139004463Y-105365638D01*
X138788339Y-105504710D01*
X138643349Y-105716910D01*
X138592340Y-105968800D01*
X138592340Y-107492800D01*
X138636618Y-107728117D01*
X138775690Y-107944241D01*
X138987890Y-108089231D01*
X139239780Y-108140240D01*
X141439420Y-108140240D01*
X141674737Y-108095962D01*
X141890861Y-107956890D01*
X141940323Y-107884500D01*
X142040558Y-107884500D01*
X142064138Y-108009817D01*
X142203210Y-108225941D01*
X142214261Y-108233492D01*
X142149269Y-108328610D01*
X142098260Y-108580500D01*
X142098260Y-110080500D01*
X142142538Y-110315817D01*
X142281610Y-110531941D01*
X142493810Y-110676931D01*
X142527190Y-110683691D01*
X142386001Y-110742173D01*
X142207373Y-110920802D01*
X142110700Y-111154191D01*
X142110700Y-111744750D01*
X142269450Y-111903500D01*
X143268700Y-111903500D01*
X143268700Y-111883500D01*
X143522700Y-111883500D01*
X143522700Y-111903500D01*
X144521950Y-111903500D01*
X144680700Y-111744750D01*
X144680700Y-111154191D01*
X144584027Y-110920802D01*
X144405399Y-110742173D01*
X144269413Y-110685846D01*
X144281017Y-110683662D01*
X144497141Y-110544590D01*
X144642131Y-110332390D01*
X144693140Y-110080500D01*
X144693140Y-108580500D01*
X144648862Y-108345183D01*
X144591536Y-108256096D01*
X144618741Y-108238590D01*
X144763731Y-108026390D01*
X144766381Y-108013303D01*
X144903210Y-108225941D01*
X145115410Y-108370931D01*
X145367300Y-108421940D01*
X145748711Y-108421940D01*
X150686032Y-114342257D01*
X150713025Y-114364056D01*
X150732299Y-114392901D01*
X150827578Y-114456564D01*
X150916735Y-114528564D01*
X150950014Y-114538373D01*
X150978861Y-114557648D01*
X151091255Y-114580005D01*
X151201174Y-114612404D01*
X151235672Y-114608731D01*
X151269700Y-114615500D01*
X154333098Y-114615500D01*
X154918408Y-115200810D01*
X154745858Y-115316104D01*
X154444954Y-115766439D01*
X154444384Y-115769306D01*
X154421246Y-115691081D01*
X154079140Y-115268276D01*
X153601275Y-115008573D01*
X153529074Y-114994217D01*
X153314400Y-115116838D01*
X153314400Y-116967000D01*
X153334400Y-116967000D01*
X153334400Y-117221000D01*
X153314400Y-117221000D01*
X153314400Y-119071162D01*
X153529074Y-119193783D01*
X153601275Y-119179427D01*
X154079140Y-118919724D01*
X154421246Y-118496919D01*
X154444384Y-118418694D01*
X154444954Y-118421561D01*
X154745858Y-118871896D01*
X155196193Y-119172800D01*
X155727400Y-119278464D01*
X156258607Y-119172800D01*
X156708942Y-118871896D01*
X157009846Y-118421561D01*
X157115510Y-117890354D01*
X157115510Y-116297646D01*
X157009846Y-115766439D01*
X156957300Y-115687798D01*
X156957300Y-114376200D01*
X156899448Y-114085361D01*
X156899448Y-114085360D01*
X156734701Y-113838799D01*
X156004800Y-113108898D01*
X156004800Y-109861100D01*
X156254450Y-109861100D01*
X156413200Y-109702350D01*
X156413200Y-108603100D01*
X156667200Y-108603100D01*
X156667200Y-109702350D01*
X156825950Y-109861100D01*
X157291510Y-109861100D01*
X157524899Y-109764427D01*
X157703527Y-109585798D01*
X157800200Y-109352409D01*
X157800200Y-108761850D01*
X157641450Y-108603100D01*
X156667200Y-108603100D01*
X156413200Y-108603100D01*
X156393200Y-108603100D01*
X156393200Y-108596750D01*
X163738400Y-108596750D01*
X163738400Y-109187309D01*
X163835073Y-109420698D01*
X164013701Y-109599327D01*
X164247090Y-109696000D01*
X164712650Y-109696000D01*
X164871400Y-109537250D01*
X164871400Y-108438000D01*
X165125400Y-108438000D01*
X165125400Y-109537250D01*
X165284150Y-109696000D01*
X165749710Y-109696000D01*
X165983099Y-109599327D01*
X166096675Y-109485750D01*
X166278400Y-109485750D01*
X166278400Y-110076309D01*
X166375073Y-110309698D01*
X166553701Y-110488327D01*
X166787090Y-110585000D01*
X167252650Y-110585000D01*
X167411400Y-110426250D01*
X167411400Y-109327000D01*
X167665400Y-109327000D01*
X167665400Y-110426250D01*
X167824150Y-110585000D01*
X168289710Y-110585000D01*
X168523099Y-110488327D01*
X168701727Y-110309698D01*
X168798400Y-110076309D01*
X168798400Y-109485750D01*
X168818400Y-109485750D01*
X168818400Y-110076309D01*
X168915073Y-110309698D01*
X169093701Y-110488327D01*
X169327090Y-110585000D01*
X169792650Y-110585000D01*
X169951400Y-110426250D01*
X169951400Y-109327000D01*
X170205400Y-109327000D01*
X170205400Y-110426250D01*
X170364150Y-110585000D01*
X170829710Y-110585000D01*
X171063099Y-110488327D01*
X171241727Y-110309698D01*
X171338400Y-110076309D01*
X171338400Y-109485750D01*
X171179650Y-109327000D01*
X170205400Y-109327000D01*
X169951400Y-109327000D01*
X168977150Y-109327000D01*
X168818400Y-109485750D01*
X168798400Y-109485750D01*
X168639650Y-109327000D01*
X167665400Y-109327000D01*
X167411400Y-109327000D01*
X166437150Y-109327000D01*
X166278400Y-109485750D01*
X166096675Y-109485750D01*
X166161727Y-109420698D01*
X166258400Y-109187309D01*
X166258400Y-108596750D01*
X166099650Y-108438000D01*
X165125400Y-108438000D01*
X164871400Y-108438000D01*
X163897150Y-108438000D01*
X163738400Y-108596750D01*
X156393200Y-108596750D01*
X156393200Y-108349100D01*
X156413200Y-108349100D01*
X156413200Y-108329100D01*
X156667200Y-108329100D01*
X156667200Y-108349100D01*
X157641450Y-108349100D01*
X157800200Y-108190350D01*
X157800200Y-107599791D01*
X157703527Y-107366402D01*
X157562290Y-107225164D01*
X157616641Y-107190190D01*
X157761631Y-106977990D01*
X157812640Y-106726100D01*
X157812640Y-105226100D01*
X157768362Y-104990783D01*
X157629290Y-104774659D01*
X157515377Y-104696825D01*
X158496312Y-103715890D01*
X158497310Y-103717441D01*
X158709510Y-103862431D01*
X158961400Y-103913440D01*
X160276000Y-103913440D01*
X160276000Y-104609900D01*
X160333852Y-104900739D01*
X160498599Y-105147301D01*
X161699699Y-106348401D01*
X161946261Y-106513148D01*
X162237100Y-106571000D01*
X163727842Y-106571000D01*
X163770238Y-106796317D01*
X163909310Y-107012441D01*
X163977406Y-107058969D01*
X163835073Y-107201302D01*
X163738400Y-107434691D01*
X163738400Y-108025250D01*
X163897150Y-108184000D01*
X164871400Y-108184000D01*
X164871400Y-108164000D01*
X165125400Y-108164000D01*
X165125400Y-108184000D01*
X166099650Y-108184000D01*
X166258400Y-108025250D01*
X166258400Y-107434691D01*
X166161727Y-107201302D01*
X166020490Y-107060064D01*
X166074841Y-107025090D01*
X166219831Y-106812890D01*
X166265960Y-106585098D01*
X166265960Y-107450000D01*
X166310238Y-107685317D01*
X166449310Y-107901441D01*
X166517406Y-107947969D01*
X166375073Y-108090302D01*
X166278400Y-108323691D01*
X166278400Y-108914250D01*
X166437150Y-109073000D01*
X167411400Y-109073000D01*
X167411400Y-109053000D01*
X167665400Y-109053000D01*
X167665400Y-109073000D01*
X168639650Y-109073000D01*
X168798400Y-108914250D01*
X168798400Y-108323691D01*
X168701727Y-108090302D01*
X168560490Y-107949064D01*
X168614841Y-107914090D01*
X168759831Y-107701890D01*
X168808310Y-107462491D01*
X168850238Y-107685317D01*
X168989310Y-107901441D01*
X169057406Y-107947969D01*
X168915073Y-108090302D01*
X168818400Y-108323691D01*
X168818400Y-108914250D01*
X168977150Y-109073000D01*
X169951400Y-109073000D01*
X169951400Y-109053000D01*
X170205400Y-109053000D01*
X170205400Y-109073000D01*
X171179650Y-109073000D01*
X171338400Y-108914250D01*
X171338400Y-108323691D01*
X171241727Y-108090302D01*
X171100490Y-107949064D01*
X171154841Y-107914090D01*
X171299831Y-107701890D01*
X171350840Y-107450000D01*
X171350840Y-105950000D01*
X171306562Y-105714683D01*
X171167490Y-105498559D01*
X170955290Y-105353569D01*
X170703400Y-105302560D01*
X169648762Y-105302560D01*
X169276862Y-104930660D01*
X169323400Y-104818309D01*
X169323400Y-104612750D01*
X169164650Y-104454000D01*
X168391400Y-104454000D01*
X168391400Y-104259440D01*
X168788400Y-104259440D01*
X169023717Y-104215162D01*
X169047279Y-104200000D01*
X169164650Y-104200000D01*
X169376400Y-103988250D01*
X169376400Y-103876229D01*
X169384831Y-103863890D01*
X169435840Y-103612000D01*
X169435840Y-101112000D01*
X169391562Y-100876683D01*
X169376400Y-100853121D01*
X169376400Y-100735750D01*
X169335840Y-100695190D01*
X169335840Y-100328000D01*
X169636598Y-100328000D01*
X169885598Y-100577000D01*
X169789150Y-100577000D01*
X169630400Y-100735750D01*
X169630400Y-103988250D01*
X169789150Y-104147000D01*
X169994709Y-104147000D01*
X170228098Y-104050327D01*
X170406727Y-103871699D01*
X170503400Y-103638310D01*
X170503400Y-103595750D01*
X170344650Y-103437000D01*
X170341426Y-103437000D01*
X170406727Y-103371699D01*
X170503400Y-103138310D01*
X170503400Y-103085690D01*
X170410744Y-102862000D01*
X170503400Y-102638310D01*
X170503400Y-102585690D01*
X170410744Y-102362000D01*
X170503400Y-102138310D01*
X170503400Y-102085690D01*
X170410744Y-101862000D01*
X170503400Y-101638310D01*
X170503400Y-101585690D01*
X170406727Y-101352301D01*
X170341426Y-101287000D01*
X170344650Y-101287000D01*
X170470124Y-101161526D01*
X176499625Y-107191027D01*
X176424441Y-107569000D01*
X176538515Y-108142489D01*
X176863371Y-108628670D01*
X177349552Y-108953526D01*
X177923041Y-109067600D01*
X177981759Y-109067600D01*
X178555248Y-108953526D01*
X179041429Y-108628670D01*
X179222400Y-108357828D01*
X179403371Y-108628670D01*
X179889552Y-108953526D01*
X180463041Y-109067600D01*
X180521759Y-109067600D01*
X181095248Y-108953526D01*
X181581429Y-108628670D01*
X181906285Y-108142489D01*
X182020359Y-107569000D01*
X181945175Y-107191027D01*
X184052401Y-105083801D01*
X184217148Y-104837239D01*
X184275000Y-104546400D01*
X184275000Y-94716600D01*
X184217148Y-94425761D01*
X184052401Y-94179199D01*
X180902801Y-91029599D01*
X180656239Y-90864852D01*
X180365400Y-90807000D01*
X151828500Y-90807000D01*
X151537661Y-90864852D01*
X151291099Y-91029599D01*
X149805199Y-92515499D01*
X149640452Y-92762061D01*
X149582600Y-93052900D01*
X149582600Y-98569374D01*
X149425398Y-98412173D01*
X149192009Y-98315500D01*
X148601450Y-98315500D01*
X148442700Y-98474250D01*
X148442700Y-99123500D01*
X148462700Y-99123500D01*
X148462700Y-99377500D01*
X148442700Y-99377500D01*
X148442700Y-99397500D01*
X148188700Y-99397500D01*
X148188700Y-99377500D01*
X147089450Y-99377500D01*
X146930700Y-99536250D01*
X146930700Y-99676810D01*
X146965366Y-99760500D01*
X146841900Y-99760500D01*
X146841900Y-99523550D01*
X146683150Y-99364800D01*
X145583900Y-99364800D01*
X145583900Y-99384800D01*
X145329900Y-99384800D01*
X145329900Y-99364800D01*
X145309900Y-99364800D01*
X145309900Y-99110800D01*
X145329900Y-99110800D01*
X145329900Y-98111550D01*
X145583900Y-98111550D01*
X145583900Y-99110800D01*
X146683150Y-99110800D01*
X146841900Y-98952050D01*
X146841900Y-98824190D01*
X146930700Y-98824190D01*
X146930700Y-98964750D01*
X147089450Y-99123500D01*
X148188700Y-99123500D01*
X148188700Y-98474250D01*
X148029950Y-98315500D01*
X147439391Y-98315500D01*
X147206002Y-98412173D01*
X147027373Y-98590801D01*
X146930700Y-98824190D01*
X146841900Y-98824190D01*
X146841900Y-98461490D01*
X146745227Y-98228101D01*
X146566598Y-98049473D01*
X146333209Y-97952800D01*
X145742650Y-97952800D01*
X145583900Y-98111550D01*
X145329900Y-98111550D01*
X145171150Y-97952800D01*
X144580591Y-97952800D01*
X144347202Y-98049473D01*
X144168573Y-98228101D01*
X144112246Y-98364087D01*
X144110062Y-98352483D01*
X143970990Y-98136359D01*
X143758790Y-97991369D01*
X143506900Y-97940360D01*
X142006900Y-97940360D01*
X141771583Y-97984638D01*
X141555459Y-98123710D01*
X141410469Y-98335910D01*
X141359460Y-98587800D01*
X141359460Y-99887800D01*
X141403738Y-100123117D01*
X141542810Y-100339241D01*
X141682387Y-100434610D01*
X141642759Y-100460110D01*
X141565298Y-100573478D01*
X141246016Y-100360140D01*
X140711407Y-100253800D01*
X139967793Y-100253800D01*
X139433184Y-100360140D01*
X138979965Y-100662972D01*
X138677133Y-101116191D01*
X138570793Y-101650800D01*
X135685000Y-101650800D01*
X135685000Y-90685000D01*
X184315000Y-90685000D01*
X184315000Y-90845034D01*
G36*
X154484800Y-113095500D02*
X151625494Y-113095500D01*
X149507596Y-110555940D01*
X150515700Y-110555940D01*
X150751017Y-110511662D01*
X150967141Y-110372590D01*
X151014834Y-110302789D01*
X151051610Y-110359941D01*
X151263810Y-110504931D01*
X151515700Y-110555940D01*
X153015700Y-110555940D01*
X153251017Y-110511662D01*
X153467141Y-110372590D01*
X153612131Y-110160390D01*
X153663140Y-109908500D01*
X153663140Y-108658500D01*
X153618862Y-108423183D01*
X153479790Y-108207059D01*
X153267590Y-108062069D01*
X153025700Y-108013085D01*
X153025700Y-107817940D01*
X154465700Y-107817940D01*
X154484800Y-107814346D01*
X154484800Y-113095500D01*
X154484800Y-113095500D01*
G37*
X154484800Y-113095500D02*
X151625494Y-113095500D01*
X149507596Y-110555940D01*
X150515700Y-110555940D01*
X150751017Y-110511662D01*
X150967141Y-110372590D01*
X151014834Y-110302789D01*
X151051610Y-110359941D01*
X151263810Y-110504931D01*
X151515700Y-110555940D01*
X153015700Y-110555940D01*
X153251017Y-110511662D01*
X153467141Y-110372590D01*
X153612131Y-110160390D01*
X153663140Y-109908500D01*
X153663140Y-108658500D01*
X153618862Y-108423183D01*
X153479790Y-108207059D01*
X153267590Y-108062069D01*
X153025700Y-108013085D01*
X153025700Y-107817940D01*
X154465700Y-107817940D01*
X154484800Y-107814346D01*
X154484800Y-113095500D01*
G36*
X149805199Y-102112001D02*
X151291099Y-103597901D01*
X151537661Y-103762648D01*
X151828500Y-103820500D01*
X152101898Y-103820500D01*
X151728299Y-104194099D01*
X151563552Y-104440661D01*
X151505700Y-104731500D01*
X151505700Y-108012942D01*
X151280383Y-108055338D01*
X151064259Y-108194410D01*
X151016566Y-108264211D01*
X150979790Y-108207059D01*
X150767590Y-108062069D01*
X150525700Y-108013085D01*
X150525700Y-105747500D01*
X150476182Y-105498559D01*
X150467848Y-105456660D01*
X150303101Y-105210099D01*
X150156101Y-105063099D01*
X149909539Y-104898352D01*
X149668604Y-104850427D01*
X149713140Y-104630500D01*
X149713140Y-104030500D01*
X149668862Y-103795183D01*
X149605022Y-103695972D01*
X149662131Y-103612390D01*
X149713140Y-103360500D01*
X149713140Y-102760500D01*
X149668862Y-102525183D01*
X149605022Y-102425972D01*
X149662131Y-102342390D01*
X149713140Y-102090500D01*
X149713140Y-101974225D01*
X149805199Y-102112001D01*
X149805199Y-102112001D01*
G37*
X149805199Y-102112001D02*
X151291099Y-103597901D01*
X151537661Y-103762648D01*
X151828500Y-103820500D01*
X152101898Y-103820500D01*
X151728299Y-104194099D01*
X151563552Y-104440661D01*
X151505700Y-104731500D01*
X151505700Y-108012942D01*
X151280383Y-108055338D01*
X151064259Y-108194410D01*
X151016566Y-108264211D01*
X150979790Y-108207059D01*
X150767590Y-108062069D01*
X150525700Y-108013085D01*
X150525700Y-105747500D01*
X150476182Y-105498559D01*
X150467848Y-105456660D01*
X150303101Y-105210099D01*
X150156101Y-105063099D01*
X149909539Y-104898352D01*
X149668604Y-104850427D01*
X149713140Y-104630500D01*
X149713140Y-104030500D01*
X149668862Y-103795183D01*
X149605022Y-103695972D01*
X149662131Y-103612390D01*
X149713140Y-103360500D01*
X149713140Y-102760500D01*
X149668862Y-102525183D01*
X149605022Y-102425972D01*
X149662131Y-102342390D01*
X149713140Y-102090500D01*
X149713140Y-101974225D01*
X149805199Y-102112001D01*
G36*
X164670073Y-102871699D02*
X164671442Y-102873068D01*
X164611969Y-102960110D01*
X164587320Y-103081830D01*
X164573400Y-103095750D01*
X164573400Y-103138310D01*
X164575067Y-103142335D01*
X164560960Y-103212000D01*
X164560960Y-103299638D01*
X164460999Y-103399599D01*
X164296252Y-103646161D01*
X164238400Y-103937000D01*
X164238400Y-104438962D01*
X164138083Y-104457838D01*
X163921959Y-104596910D01*
X163776969Y-104809110D01*
X163727985Y-105051000D01*
X162551902Y-105051000D01*
X161796000Y-104295098D01*
X161796000Y-103913440D01*
X163161400Y-103913440D01*
X163396717Y-103869162D01*
X163612841Y-103730090D01*
X163757831Y-103517890D01*
X163789006Y-103363945D01*
X164019239Y-103318148D01*
X164265801Y-103153401D01*
X164634173Y-102785029D01*
X164670073Y-102871699D01*
X164670073Y-102871699D01*
G37*
X164670073Y-102871699D02*
X164671442Y-102873068D01*
X164611969Y-102960110D01*
X164587320Y-103081830D01*
X164573400Y-103095750D01*
X164573400Y-103138310D01*
X164575067Y-103142335D01*
X164560960Y-103212000D01*
X164560960Y-103299638D01*
X164460999Y-103399599D01*
X164296252Y-103646161D01*
X164238400Y-103937000D01*
X164238400Y-104438962D01*
X164138083Y-104457838D01*
X163921959Y-104596910D01*
X163776969Y-104809110D01*
X163727985Y-105051000D01*
X162551902Y-105051000D01*
X161796000Y-104295098D01*
X161796000Y-103913440D01*
X163161400Y-103913440D01*
X163396717Y-103869162D01*
X163612841Y-103730090D01*
X163757831Y-103517890D01*
X163789006Y-103363945D01*
X164019239Y-103318148D01*
X164265801Y-103153401D01*
X164634173Y-102785029D01*
X164670073Y-102871699D01*
G36*
X179603910Y-103695821D02*
X179726628Y-103753336D01*
X179403371Y-103969330D01*
X179222400Y-104240172D01*
X179041429Y-103969330D01*
X178726648Y-103759000D01*
X179041429Y-103548670D01*
X179222392Y-103277839D01*
X179603910Y-103695821D01*
X179603910Y-103695821D01*
G37*
X179603910Y-103695821D02*
X179726628Y-103753336D01*
X179403371Y-103969330D01*
X179222400Y-104240172D01*
X179041429Y-103969330D01*
X178726648Y-103759000D01*
X179041429Y-103548670D01*
X179222392Y-103277839D01*
X179603910Y-103695821D01*
G36*
X160276000Y-100517802D02*
X160276000Y-101318560D01*
X158961400Y-101318560D01*
X158726083Y-101362838D01*
X158509959Y-101501910D01*
X158364969Y-101714110D01*
X158328464Y-101894378D01*
X158230561Y-101913852D01*
X157983999Y-102078599D01*
X156492098Y-103570500D01*
X155070614Y-103570500D01*
X155113140Y-103360500D01*
X155113140Y-103111042D01*
X155128490Y-103117400D01*
X155594050Y-103117400D01*
X155752800Y-102958650D01*
X155752800Y-101859400D01*
X156006800Y-101859400D01*
X156006800Y-102958650D01*
X156165550Y-103117400D01*
X156631110Y-103117400D01*
X156864499Y-103020727D01*
X157043127Y-102842098D01*
X157139800Y-102608709D01*
X157139800Y-102018150D01*
X156981050Y-101859400D01*
X156006800Y-101859400D01*
X155752800Y-101859400D01*
X155732800Y-101859400D01*
X155732800Y-101605400D01*
X155752800Y-101605400D01*
X155752800Y-101585400D01*
X156006800Y-101585400D01*
X156006800Y-101605400D01*
X156981050Y-101605400D01*
X157139800Y-101446650D01*
X157139800Y-100856091D01*
X157043127Y-100622702D01*
X156901890Y-100481464D01*
X156956241Y-100446490D01*
X157101231Y-100234290D01*
X157150215Y-99992400D01*
X159750598Y-99992400D01*
X160276000Y-100517802D01*
X160276000Y-100517802D01*
G37*
X160276000Y-100517802D02*
X160276000Y-101318560D01*
X158961400Y-101318560D01*
X158726083Y-101362838D01*
X158509959Y-101501910D01*
X158364969Y-101714110D01*
X158328464Y-101894378D01*
X158230561Y-101913852D01*
X157983999Y-102078599D01*
X156492098Y-103570500D01*
X155070614Y-103570500D01*
X155113140Y-103360500D01*
X155113140Y-103111042D01*
X155128490Y-103117400D01*
X155594050Y-103117400D01*
X155752800Y-102958650D01*
X155752800Y-101859400D01*
X156006800Y-101859400D01*
X156006800Y-102958650D01*
X156165550Y-103117400D01*
X156631110Y-103117400D01*
X156864499Y-103020727D01*
X157043127Y-102842098D01*
X157139800Y-102608709D01*
X157139800Y-102018150D01*
X156981050Y-101859400D01*
X156006800Y-101859400D01*
X155752800Y-101859400D01*
X155732800Y-101859400D01*
X155732800Y-101605400D01*
X155752800Y-101605400D01*
X155752800Y-101585400D01*
X156006800Y-101585400D01*
X156006800Y-101605400D01*
X156981050Y-101605400D01*
X157139800Y-101446650D01*
X157139800Y-100856091D01*
X157043127Y-100622702D01*
X156901890Y-100481464D01*
X156956241Y-100446490D01*
X157101231Y-100234290D01*
X157150215Y-99992400D01*
X159750598Y-99992400D01*
X160276000Y-100517802D01*
G36*
X180619400Y-102362000D02*
X180639400Y-102362000D01*
X180639400Y-102616000D01*
X180619400Y-102616000D01*
X180619400Y-102636000D01*
X180365400Y-102636000D01*
X180365400Y-102616000D01*
X180345400Y-102616000D01*
X180345400Y-102362000D01*
X180365400Y-102362000D01*
X180365400Y-102342000D01*
X180619400Y-102342000D01*
X180619400Y-102362000D01*
X180619400Y-102362000D01*
G37*
X180619400Y-102362000D02*
X180639400Y-102362000D01*
X180639400Y-102616000D01*
X180619400Y-102616000D01*
X180619400Y-102636000D01*
X180365400Y-102636000D01*
X180365400Y-102616000D01*
X180345400Y-102616000D01*
X180345400Y-102362000D01*
X180365400Y-102362000D01*
X180365400Y-102342000D01*
X180619400Y-102342000D01*
X180619400Y-102362000D01*
G36*
X181802500Y-95348902D02*
X181802500Y-99220186D01*
X181581429Y-98889330D01*
X181095248Y-98564474D01*
X180521759Y-98450400D01*
X180463041Y-98450400D01*
X180134044Y-98515842D01*
X178362801Y-96744599D01*
X178116239Y-96579852D01*
X177825400Y-96522000D01*
X167020400Y-96522000D01*
X167020400Y-96063750D01*
X166861650Y-95905000D01*
X165887400Y-95905000D01*
X165887400Y-95925000D01*
X165633400Y-95925000D01*
X165633400Y-95905000D01*
X164659150Y-95905000D01*
X164500400Y-96063750D01*
X164500400Y-96654309D01*
X164597073Y-96887698D01*
X164738310Y-97028936D01*
X164683959Y-97063910D01*
X164538969Y-97276110D01*
X164487960Y-97528000D01*
X164487960Y-98160623D01*
X164476832Y-98196044D01*
X164480488Y-98237339D01*
X164472400Y-98278000D01*
X164487960Y-98356225D01*
X164487960Y-99028000D01*
X164532238Y-99263317D01*
X164671310Y-99479441D01*
X164883510Y-99624431D01*
X165135400Y-99675440D01*
X165778400Y-99675440D01*
X165778400Y-99847116D01*
X165740960Y-100032000D01*
X165740960Y-100695190D01*
X165700400Y-100735750D01*
X165700400Y-100847771D01*
X165691969Y-100860110D01*
X165650567Y-101064560D01*
X165446400Y-101064560D01*
X165446400Y-100735750D01*
X165287650Y-100577000D01*
X165082091Y-100577000D01*
X164848702Y-100673673D01*
X164670073Y-100852301D01*
X164573400Y-101085690D01*
X164573400Y-101102000D01*
X164482400Y-101102000D01*
X164191561Y-101159852D01*
X163944999Y-101324599D01*
X163676213Y-101593385D01*
X163625490Y-101514559D01*
X163413290Y-101369569D01*
X163171400Y-101320585D01*
X163171400Y-96370227D01*
X163353625Y-96188320D01*
X163537690Y-95745041D01*
X163538109Y-95265065D01*
X163387967Y-94901691D01*
X164500400Y-94901691D01*
X164500400Y-95492250D01*
X164659150Y-95651000D01*
X165633400Y-95651000D01*
X165633400Y-94551750D01*
X165887400Y-94551750D01*
X165887400Y-95651000D01*
X166861650Y-95651000D01*
X167020400Y-95492250D01*
X167020400Y-94901691D01*
X166923727Y-94668302D01*
X166745099Y-94489673D01*
X166511710Y-94393000D01*
X166046150Y-94393000D01*
X165887400Y-94551750D01*
X165633400Y-94551750D01*
X165474650Y-94393000D01*
X165009090Y-94393000D01*
X164775701Y-94489673D01*
X164597073Y-94668302D01*
X164500400Y-94901691D01*
X163387967Y-94901691D01*
X163354818Y-94821465D01*
X163015720Y-94481775D01*
X162572441Y-94297710D01*
X162092465Y-94297291D01*
X161648865Y-94480582D01*
X161309175Y-94819680D01*
X161125110Y-95262959D01*
X161124691Y-95742935D01*
X161307982Y-96186535D01*
X161647080Y-96526225D01*
X161651400Y-96528019D01*
X161651400Y-99782333D01*
X161573401Y-99665599D01*
X160602801Y-98694999D01*
X160356239Y-98530252D01*
X160065400Y-98472400D01*
X157150358Y-98472400D01*
X157107962Y-98247083D01*
X156968890Y-98030959D01*
X156756690Y-97885969D01*
X156730207Y-97880606D01*
X156697076Y-96782055D01*
X156861342Y-96672296D01*
X157162246Y-96221961D01*
X157162816Y-96219094D01*
X157185954Y-96297319D01*
X157528060Y-96720124D01*
X158005925Y-96979827D01*
X158078126Y-96994183D01*
X158292800Y-96871562D01*
X158292800Y-95021400D01*
X158546800Y-95021400D01*
X158546800Y-96871562D01*
X158761474Y-96994183D01*
X158833675Y-96979827D01*
X159311540Y-96720124D01*
X159653646Y-96297319D01*
X159807910Y-95775780D01*
X159807910Y-95021400D01*
X158546800Y-95021400D01*
X158292800Y-95021400D01*
X158272800Y-95021400D01*
X158272800Y-94767400D01*
X158292800Y-94767400D01*
X158292800Y-94747400D01*
X158546800Y-94747400D01*
X158546800Y-94767400D01*
X159807910Y-94767400D01*
X159807910Y-94013020D01*
X159653646Y-93491481D01*
X159430745Y-93216000D01*
X179669598Y-93216000D01*
X181802500Y-95348902D01*
X181802500Y-95348902D01*
G37*
X181802500Y-95348902D02*
X181802500Y-99220186D01*
X181581429Y-98889330D01*
X181095248Y-98564474D01*
X180521759Y-98450400D01*
X180463041Y-98450400D01*
X180134044Y-98515842D01*
X178362801Y-96744599D01*
X178116239Y-96579852D01*
X177825400Y-96522000D01*
X167020400Y-96522000D01*
X167020400Y-96063750D01*
X166861650Y-95905000D01*
X165887400Y-95905000D01*
X165887400Y-95925000D01*
X165633400Y-95925000D01*
X165633400Y-95905000D01*
X164659150Y-95905000D01*
X164500400Y-96063750D01*
X164500400Y-96654309D01*
X164597073Y-96887698D01*
X164738310Y-97028936D01*
X164683959Y-97063910D01*
X164538969Y-97276110D01*
X164487960Y-97528000D01*
X164487960Y-98160623D01*
X164476832Y-98196044D01*
X164480488Y-98237339D01*
X164472400Y-98278000D01*
X164487960Y-98356225D01*
X164487960Y-99028000D01*
X164532238Y-99263317D01*
X164671310Y-99479441D01*
X164883510Y-99624431D01*
X165135400Y-99675440D01*
X165778400Y-99675440D01*
X165778400Y-99847116D01*
X165740960Y-100032000D01*
X165740960Y-100695190D01*
X165700400Y-100735750D01*
X165700400Y-100847771D01*
X165691969Y-100860110D01*
X165650567Y-101064560D01*
X165446400Y-101064560D01*
X165446400Y-100735750D01*
X165287650Y-100577000D01*
X165082091Y-100577000D01*
X164848702Y-100673673D01*
X164670073Y-100852301D01*
X164573400Y-101085690D01*
X164573400Y-101102000D01*
X164482400Y-101102000D01*
X164191561Y-101159852D01*
X163944999Y-101324599D01*
X163676213Y-101593385D01*
X163625490Y-101514559D01*
X163413290Y-101369569D01*
X163171400Y-101320585D01*
X163171400Y-96370227D01*
X163353625Y-96188320D01*
X163537690Y-95745041D01*
X163538109Y-95265065D01*
X163387967Y-94901691D01*
X164500400Y-94901691D01*
X164500400Y-95492250D01*
X164659150Y-95651000D01*
X165633400Y-95651000D01*
X165633400Y-94551750D01*
X165887400Y-94551750D01*
X165887400Y-95651000D01*
X166861650Y-95651000D01*
X167020400Y-95492250D01*
X167020400Y-94901691D01*
X166923727Y-94668302D01*
X166745099Y-94489673D01*
X166511710Y-94393000D01*
X166046150Y-94393000D01*
X165887400Y-94551750D01*
X165633400Y-94551750D01*
X165474650Y-94393000D01*
X165009090Y-94393000D01*
X164775701Y-94489673D01*
X164597073Y-94668302D01*
X164500400Y-94901691D01*
X163387967Y-94901691D01*
X163354818Y-94821465D01*
X163015720Y-94481775D01*
X162572441Y-94297710D01*
X162092465Y-94297291D01*
X161648865Y-94480582D01*
X161309175Y-94819680D01*
X161125110Y-95262959D01*
X161124691Y-95742935D01*
X161307982Y-96186535D01*
X161647080Y-96526225D01*
X161651400Y-96528019D01*
X161651400Y-99782333D01*
X161573401Y-99665599D01*
X160602801Y-98694999D01*
X160356239Y-98530252D01*
X160065400Y-98472400D01*
X157150358Y-98472400D01*
X157107962Y-98247083D01*
X156968890Y-98030959D01*
X156756690Y-97885969D01*
X156730207Y-97880606D01*
X156697076Y-96782055D01*
X156861342Y-96672296D01*
X157162246Y-96221961D01*
X157162816Y-96219094D01*
X157185954Y-96297319D01*
X157528060Y-96720124D01*
X158005925Y-96979827D01*
X158078126Y-96994183D01*
X158292800Y-96871562D01*
X158292800Y-95021400D01*
X158546800Y-95021400D01*
X158546800Y-96871562D01*
X158761474Y-96994183D01*
X158833675Y-96979827D01*
X159311540Y-96720124D01*
X159653646Y-96297319D01*
X159807910Y-95775780D01*
X159807910Y-95021400D01*
X158546800Y-95021400D01*
X158292800Y-95021400D01*
X158272800Y-95021400D01*
X158272800Y-94767400D01*
X158292800Y-94767400D01*
X158292800Y-94747400D01*
X158546800Y-94747400D01*
X158546800Y-94767400D01*
X159807910Y-94767400D01*
X159807910Y-94013020D01*
X159653646Y-93491481D01*
X159430745Y-93216000D01*
X179669598Y-93216000D01*
X181802500Y-95348902D01*
G36*
X154597354Y-93566839D02*
X154491690Y-94098046D01*
X154491690Y-95690754D01*
X154597354Y-96221961D01*
X154898258Y-96672296D01*
X155178726Y-96859698D01*
X155208402Y-97843690D01*
X155019483Y-97879238D01*
X154803359Y-98018310D01*
X154658369Y-98230510D01*
X154636666Y-98337682D01*
X154465700Y-98303060D01*
X152965700Y-98303060D01*
X152730383Y-98347338D01*
X152514259Y-98486410D01*
X152369269Y-98698610D01*
X152318260Y-98950500D01*
X152318260Y-99550500D01*
X152362538Y-99785817D01*
X152420878Y-99876480D01*
X152330700Y-100094190D01*
X152330700Y-100234750D01*
X152489450Y-100393500D01*
X153588700Y-100393500D01*
X153588700Y-100373500D01*
X153842700Y-100373500D01*
X153842700Y-100393500D01*
X153862700Y-100393500D01*
X153862700Y-100647500D01*
X153842700Y-100647500D01*
X153842700Y-100667500D01*
X153588700Y-100667500D01*
X153588700Y-100647500D01*
X152489450Y-100647500D01*
X152366176Y-100770774D01*
X152169400Y-100573998D01*
X152169400Y-94459902D01*
X153413302Y-93216000D01*
X154831777Y-93216000D01*
X154597354Y-93566839D01*
X154597354Y-93566839D01*
G37*
X154597354Y-93566839D02*
X154491690Y-94098046D01*
X154491690Y-95690754D01*
X154597354Y-96221961D01*
X154898258Y-96672296D01*
X155178726Y-96859698D01*
X155208402Y-97843690D01*
X155019483Y-97879238D01*
X154803359Y-98018310D01*
X154658369Y-98230510D01*
X154636666Y-98337682D01*
X154465700Y-98303060D01*
X152965700Y-98303060D01*
X152730383Y-98347338D01*
X152514259Y-98486410D01*
X152369269Y-98698610D01*
X152318260Y-98950500D01*
X152318260Y-99550500D01*
X152362538Y-99785817D01*
X152420878Y-99876480D01*
X152330700Y-100094190D01*
X152330700Y-100234750D01*
X152489450Y-100393500D01*
X153588700Y-100393500D01*
X153588700Y-100373500D01*
X153842700Y-100373500D01*
X153842700Y-100393500D01*
X153862700Y-100393500D01*
X153862700Y-100647500D01*
X153842700Y-100647500D01*
X153842700Y-100667500D01*
X153588700Y-100667500D01*
X153588700Y-100647500D01*
X152489450Y-100647500D01*
X152366176Y-100770774D01*
X152169400Y-100573998D01*
X152169400Y-94459902D01*
X153413302Y-93216000D01*
X154831777Y-93216000D01*
X154597354Y-93566839D01*
M02*
