(module msoic-8 (layer F.Cu) (tedit 49EA0BE9)
  (descr MSOIC-8)
  (fp_text reference MSOIC-8 (at 0 -0.29972) (layer F.SilkS)
    (effects (font (size 0.24892 0.24892) (thickness 0.06096)))
  )
  (fp_text value U*** (at 0 0.29972) (layer F.SilkS)
    (effects (font (size 0.24892 0.24892) (thickness 0.0508)))
  )
  (fp_line (start 0.3302 -1.4986) (end 0.3302 -2.413) (layer F.SilkS) (width 0.127))
  (fp_line (start -0.3302 -1.4986) (end -0.3302 -2.413) (layer F.SilkS) (width 0.127))
  (fp_line (start -0.9652 -1.4986) (end -0.9652 -2.413) (layer F.SilkS) (width 0.127))
  (fp_line (start 0.9652 -1.4986) (end 0.9652 -2.413) (layer F.SilkS) (width 0.127))
  (fp_line (start 0.9652 1.4986) (end 0.9652 2.413) (layer F.SilkS) (width 0.127))
  (fp_line (start 0.3302 1.4986) (end 0.3302 2.413) (layer F.SilkS) (width 0.127))
  (fp_line (start -0.9652 1.4986) (end -0.9652 2.413) (layer F.SilkS) (width 0.127))
  (fp_line (start -0.3302 1.4986) (end -0.3302 2.413) (layer F.SilkS) (width 0.127))
  (fp_circle (center -0.89916 0.9017) (end -1.09982 1.09982) (layer F.SilkS) (width 0.127))
  (fp_line (start 1.50114 -1.50114) (end -1.50114 -1.50114) (layer F.SilkS) (width 0.127))
  (fp_line (start -1.50114 -1.50114) (end -1.50114 1.50114) (layer F.SilkS) (width 0.127))
  (fp_line (start -1.50114 1.50114) (end 1.50114 1.50114) (layer F.SilkS) (width 0.127))
  (fp_line (start 1.50114 1.50114) (end 1.50114 -1.50114) (layer F.SilkS) (width 0.127))
  (pad 1 smd rect (at -0.97536 2.30124) (size 0.40894 1.02108) (layers F.Cu F.Paste F.Mask))
  (pad 2 smd rect (at -0.32512 2.30124) (size 0.40894 1.02108) (layers F.Cu F.Paste F.Mask))
  (pad 3 smd rect (at 0.32512 2.30124) (size 0.40894 1.02108) (layers F.Cu F.Paste F.Mask))
  (pad 4 smd rect (at 0.97536 2.30124) (size 0.40894 1.02108) (layers F.Cu F.Paste F.Mask))
  (pad 5 smd rect (at 0.97536 -2.30124) (size 0.40894 1.02108) (layers F.Cu F.Paste F.Mask))
  (pad 6 smd rect (at 0.32512 -2.30124) (size 0.40894 1.02108) (layers F.Cu F.Paste F.Mask))
  (pad 7 smd rect (at -0.32512 -2.30124) (size 0.40894 1.02108) (layers F.Cu F.Paste F.Mask))
  (pad 8 smd rect (at -0.97536 -2.30124) (size 0.40894 1.02108) (layers F.Cu F.Paste F.Mask))
  (model walter\smd_dil\msoic-8.wrl
    (at (xyz 0 0 0))
    (scale (xyz 1 1 1))
    (rotate (xyz 0 0 0))
  )
)
