(export (version D)
  (design
    (source "C:/Users/zagaracr/Dropbox/photosynq project/Hardware/add-on board/add-ON board.sch")
    (date "9/10/2014 4:50:21 PM")
    (tool "eeschema (2013-07-07 BZR 4022)-stable"))
  (components
    (comp (ref R112)
      (value 1K)
      (datasheet RC0402JR-0727KL)
      (libsource (lib device) (part R))
      (sheetpath (names /) (tstamps /))
      (tstamp 516F06E3))
    (comp (ref C114)
      (value 1n)
      (datasheet C0402C102J5GACTU)
      (libsource (lib device) (part C))
      (sheetpath (names /) (tstamps /))
      (tstamp 516F06F6))
    (comp (ref C112)
      (value 10u)
      (datasheet C0805C106M4PACTU)
      (libsource (lib device) (part C))
      (sheetpath (names /) (tstamps /))
      (tstamp 517FDA64))
    (comp (ref U103)
      (value OPA2180)
      (datasheet OPA2180IDR)
      (libsource (lib linear) (part LM358))
      (sheetpath (names /) (tstamps /))
      (tstamp 51801A7B))
    (comp (ref R110)
      (value 22)
      (datasheet RC0805JR-0722RL)
      (libsource (lib device) (part R))
      (sheetpath (names /) (tstamps /))
      (tstamp 51801A92))
    (comp (ref R113)
      (value 3.3)
      (datasheet RC0805JR-073K3L)
      (libsource (lib device) (part R))
      (sheetpath (names /) (tstamps /))
      (tstamp 51801AF6))
    (comp (ref C113)
      (value 68p)
      (datasheet CC0402JRNPO9BN680)
      (libsource (lib device) (part C))
      (sheetpath (names /) (tstamps /))
      (tstamp 51801CF0))
    (comp (ref R107)
      (value 220)
      (datasheet RC0805JR-0722RL)
      (libsource (lib device) (part R))
      (sheetpath (names /) (tstamps /))
      (tstamp 5182CE98))
    (comp (ref C108)
      (value 68p)
      (datasheet CC0402JRNPO9BN680)
      (libsource (lib device) (part C))
      (sheetpath (names /) (tstamps /))
      (tstamp 5182CEAA))
    (comp (ref D104)
      (value ACTB)
      (datasheet LXZ1-PA01)
      (libsource (lib device) (part LED))
      (sheetpath (names /) (tstamps /))
      (tstamp 5182DAE5))
    (comp (ref D102)
      (value IRCALB)
      (datasheet VSMG2700-GS08)
      (libsource (lib device) (part LED))
      (sheetpath (names /) (tstamps /))
      (tstamp 5182DAF2))
    (comp (ref D101)
      (value MEAS2B)
      (datasheet SFH4441)
      (libsource (lib device) (part LED))
      (sheetpath (names /) (tstamps /))
      (tstamp 5182E95A))
    (comp (ref R101)
      (value 300)
      (libsource (lib device) (part R))
      (sheetpath (names /) (tstamps /))
      (tstamp 5182E98C))
    (comp (ref C102)
      (value 10u)
      (datasheet C0805C106M4PACTU)
      (libsource (lib device) (part C))
      (sheetpath (names /) (tstamps /))
      (tstamp 5182E9AA))
    (comp (ref D103)
      (value MEAS1B)
      (datasheet LXZ1-PB01)
      (libsource (lib device) (part LED))
      (sheetpath (names /) (tstamps /))
      (tstamp 5182EBC9))
    (comp (ref R109)
      (value 2)
      (libsource (lib device) (part R))
      (sheetpath (names /) (tstamps /))
      (tstamp 5182EBD5))
    (comp (ref R111)
      (value 22)
      (datasheet RC0402JR-0722RL)
      (libsource (lib device) (part R))
      (sheetpath (names /) (tstamps /))
      (tstamp 5183EE6F))
    (comp (ref R106)
      (value 22)
      (datasheet RC0805JR-0722RL)
      (libsource (lib device) (part R))
      (sheetpath (names /) (tstamps /))
      (tstamp 5183EE8B))
    (comp (ref U102)
      (value DG4157DL)
      (datasheet DG4157DL-T1-E3)
      (libsource (lib analog_switches) (part DG4157DL-T1-E3))
      (sheetpath (names /) (tstamps /))
      (tstamp 51CCA405))
    (comp (ref U108)
      (value DG4157DL)
      (datasheet DG4157DL-T1-E3)
      (libsource (lib analog_switches) (part DG4157DL-T1-E3))
      (sheetpath (names /) (tstamps /))
      (tstamp 51CCBF2F))
    (comp (ref Q103)
      (value MOSN)
      (datasheet IRLTS6342TRPBF)
      (libsource (lib "add-ON board-cache") (part MOSN-TSOP6))
      (sheetpath (names /) (tstamps /))
      (tstamp 51D461CD))
    (comp (ref Q101)
      (value MOSN)
      (datasheet IRLTS6342TRPBF)
      (libsource (lib "add-ON board-cache") (part MOSN-TSOP6))
      (sheetpath (names /) (tstamps /))
      (tstamp 51D46788))
    (comp (ref Q102)
      (value MOSN)
      (datasheet IRLTS6342TRPBF)
      (libsource (lib "add-ON board-cache") (part MOSN-TSOP6))
      (sheetpath (names /) (tstamps /))
      (tstamp 51D4652C))
    (comp (ref U105)
      (value LMH6601)
      (datasheet LMH6601MG/NOPB)
      (libsource (lib linear) (part LMH6601))
      (sheetpath (names /) (tstamps /))
      (tstamp 51E446D8))
    (comp (ref C123)
      (value 10u)
      (datasheet C0805C106M4PACTU)
      (libsource (lib device) (part C))
      (sheetpath (names /) (tstamps /))
      (tstamp 51E80F92))
    (comp (ref U104)
      (value LM5551)
      (datasheet LM5111-1MY/NOPB)
      (libsource (lib "add-ON board-cache") (part LM5551))
      (sheetpath (names /) (tstamps /))
      (tstamp 521F678B))
    (comp (ref R114)
      (value 1K)
      (datasheet RC0805JR-072K2L)
      (libsource (lib device) (part R))
      (sheetpath (names /) (tstamps /))
      (tstamp 517FDF22))
    (comp (ref C115)
      (value 0.1u)
      (footprint SM1206)
      (datasheet C3216C0G1H104J160AA)
      (libsource (lib device) (part C))
      (sheetpath (names /) (tstamps /))
      (tstamp 521F7EBE))
    (comp (ref R143)
      (value 2K)
      (datasheet RC0805JR-072K2L)
      (libsource (lib device) (part R))
      (sheetpath (names /) (tstamps /))
      (tstamp 522F80E9))
    (comp (ref R144)
      (value 10K)
      (datasheet RC0805JR-0710KL)
      (libsource (lib device) (part R))
      (sheetpath (names /) (tstamps /))
      (tstamp 523CA8E2))
    (comp (ref C1)
      (value 10u)
      (datasheet C0805C106M4PACTU)
      (libsource (lib device) (part C))
      (sheetpath (names /) (tstamps /))
      (tstamp 5254815B))
    (comp (ref P1)
      (value CONN_12)
      (datasheet 609-1793-1-ND)
      (libsource (lib conn) (part CONN_16))
      (sheetpath (names /) (tstamps /))
      (tstamp 5254250E))
    (comp (ref D106)
      (value DIODE)
      (footprint SOD323)
      (datasheet 1N4148WS)
      (libsource (lib device) (part DIODE))
      (sheetpath (names /) (tstamps /))
      (tstamp 52FD032F))
    (comp (ref D107)
      (value DIODE)
      (footprint SOD323)
      (datasheet 1N4148WS)
      (libsource (lib device) (part DIODE))
      (sheetpath (names /) (tstamps /))
      (tstamp 52FD033E))
    (comp (ref U106)
      (value LMH6601)
      (datasheet LMH6601MG/NOPB)
      (libsource (lib linear) (part LMH6601))
      (sheetpath (names /) (tstamps /))
      (tstamp 52FD037D))
    (comp (ref U101)
      (value SPST_SW_ADG701)
      (footprint sot23-6)
      (libsource (lib analog_switches) (part SPST_SW_ADG701))
      (sheetpath (names /) (tstamps /))
      (tstamp 53039D0D))
    (comp (ref R102)
      (value 1K)
      (datasheet RC0805JR-072K2L)
      (libsource (lib device) (part R))
      (sheetpath (names /) (tstamps /))
      (tstamp 53039FDD))
    (comp (ref C101)
      (value 10u)
      (datasheet C0805C106M4PACTU)
      (libsource (lib device) (part C))
      (sheetpath (names /) (tstamps /))
      (tstamp 5303C003))
    (comp (ref D105)
      (value PIN)
      (libsource (lib "add-ON board-cache") (part DIODE_PHOTODIODE_REVE_DATE15JUN2010))
      (sheetpath (names /) (tstamps /))
      (tstamp 532C9214))
    (comp (ref C2)
      (value 10u)
      (datasheet C0805C106M4PACTU)
      (libsource (lib device) (part C))
      (sheetpath (names /) (tstamps /))
      (tstamp 53FBA377))
    (comp (ref L3)
      (value INDUCTOR)
      (libsource (lib device) (part INDUCTOR))
      (sheetpath (names /) (tstamps /))
      (tstamp 53FBA69B)))
  (libparts
    (libpart (lib device) (part C)
      (description "Condensateur non polarise")
      (footprints
        (fp SM*)
        (fp C?)
        (fp C1-1))
      (fields
        (field (name Reference) C)
        (field (name Value) C)
        (field (name Footprint) ~)
        (field (name Datasheet) ~))
      (pins
        (pin (num 1) (name ~) (type passive))
        (pin (num 2) (name ~) (type passive))))
    (libpart (lib device) (part DIODE)
      (description "Diode simple")
      (footprints
        (fp D?)
        (fp S*))
      (fields
        (field (name Reference) D)
        (field (name Value) DIODE)
        (field (name Footprint) ~)
        (field (name Datasheet) ~))
      (pins
        (pin (num 1) (name A) (type passive))
        (pin (num 2) (name K) (type passive))))
    (libpart (lib device) (part INDUCTOR)
      (fields
        (field (name Reference) L)
        (field (name Value) INDUCTOR)
        (field (name Footprint) ~)
        (field (name Datasheet) ~))
      (pins
        (pin (num 1) (name 1) (type passive))
        (pin (num 2) (name 2) (type passive))))
    (libpart (lib device) (part LED)
      (footprints
        (fp LED-3MM)
        (fp LED-5MM)
        (fp LED-10MM)
        (fp LED-0603)
        (fp LED-0805)
        (fp LED-1206)
        (fp LEDV))
      (fields
        (field (name Reference) D)
        (field (name Value) LED)
        (field (name Footprint) ~)
        (field (name Datasheet) ~))
      (pins
        (pin (num 1) (name A) (type passive))
        (pin (num 2) (name K) (type passive))))
    (libpart (lib device) (part R)
      (description Resistance)
      (footprints
        (fp R?)
        (fp SM0603)
        (fp SM0805)
        (fp R?-*)
        (fp SM1206))
      (fields
        (field (name Reference) R)
        (field (name Value) R)
        (field (name Footprint) ~)
        (field (name Datasheet) ~))
      (pins
        (pin (num 1) (name ~) (type passive))
        (pin (num 2) (name ~) (type passive))))
    (libpart (lib conn) (part CONN_16)
      (description "CONN_16, connector, 16 pins")
      (fields
        (field (name Reference) P)
        (field (name Value) CONN_16)
        (field (name Footprint) ~)
        (field (name Datasheet) ~))
      (pins
        (pin (num 1) (name P1) (type passive))
        (pin (num 2) (name P2) (type passive))
        (pin (num 3) (name P3) (type passive))
        (pin (num 4) (name P4) (type passive))
        (pin (num 5) (name P5) (type passive))
        (pin (num 6) (name P6) (type passive))
        (pin (num 7) (name P7) (type passive))
        (pin (num 8) (name P8) (type passive))
        (pin (num 9) (name P9) (type passive))
        (pin (num 10) (name P10) (type passive))
        (pin (num 11) (name P11) (type passive))
        (pin (num 12) (name P12) (type passive))
        (pin (num 13) (name P13) (type passive))
        (pin (num 14) (name P14) (type passive))
        (pin (num 15) (name P15) (type passive))
        (pin (num 16) (name P16) (type passive))))
    (libpart (lib linear) (part LM358)
      (fields
        (field (name Reference) U)
        (field (name Value) LM358)
        (field (name Footprint) ~)
        (field (name Datasheet) ~))
      (pins
        (pin (num 1) (name ~) (type output))
        (pin (num 2) (name -) (type input))
        (pin (num 3) (name +) (type input))
        (pin (num 4) (name V-) (type power_in))
        (pin (num 5) (name +) (type input))
        (pin (num 6) (name -) (type input))
        (pin (num 7) (name ~) (type output))
        (pin (num 8) (name V+) (type power_in))))
    (libpart (lib linear) (part LMH6601)
      (description "LMH 6601, opamp, SMD")
      (footprints
        (fp sc70-6))
      (fields
        (field (name Reference) U)
        (field (name Value) LMH6601)
        (field (name Footprint) ~)
        (field (name Datasheet) ~))
      (pins
        (pin (num 1) (name out) (type output))
        (pin (num 2) (name V-) (type passive))
        (pin (num 3) (name +) (type input))
        (pin (num 4) (name -) (type input))
        (pin (num 5) (name SD) (type passive))
        (pin (num 6) (name V+) (type passive))))
    (libpart (lib analog_switches) (part DG4157DL-T1-E3)
      (description "SPDT switch DG4157")
      (footprints
        (fp SOT23-6))
      (fields
        (field (name Reference) U)
        (field (name Value) DG4157DL-T1-E3)
        (field (name Footprint) ~)
        (field (name Datasheet) ~))
      (pins
        (pin (num 1) (name B1) (type passive))
        (pin (num 2) (name GND) (type power_in))
        (pin (num 3) (name B0) (type passive))
        (pin (num 4) (name A) (type passive))
        (pin (num 5) (name VCC) (type input))
        (pin (num 6) (name S) (type input))))
    (libpart (lib analog_switches) (part SPST_SW_ADG701)
      (description "ADG701 analog switch")
      (footprints
        (fp sot23-6))
      (fields
        (field (name Reference) U)
        (field (name Value) SPST_SW_ADG701)
        (field (name Footprint) ~)
        (field (name Datasheet) ~))
      (pins
        (pin (num 1) (name i/o) (type passive))
        (pin (num 2) (name i/o) (type passive))
        (pin (num 3) (name GND) (type power_in))
        (pin (num 4) (name S) (type input))
        (pin (num 6) (name V+) (type input))))
    (libpart (lib "add-ON board-cache") (part DIODE_PHOTODIODE_RevE_Date15jun2010)
      (fields
        (field (name Reference) D)
        (field (name Value) DIODE_PHOTODIODE_RevE_Date15jun2010)
        (field (name Footprint) ~)
        (field (name Datasheet) ~))
      (pins
        (pin (num 1) (name A) (type passive))
        (pin (num 2) (name K) (type passive))))
    (libpart (lib "add-ON board-cache") (part LM5551)
      (fields
        (field (name Reference) U)
        (field (name Value) LM5551)
        (field (name Footprint) ~)
        (field (name Datasheet) ~))
      (pins
        (pin (num 1) (name NC) (type input))
        (pin (num 2) (name IN_A) (type input))
        (pin (num 3) (name GND) (type input))
        (pin (num 4) (name IN_B) (type input))
        (pin (num 5) (name OUT_B) (type input))
        (pin (num 6) (name Vcc) (type input))
        (pin (num 7) (name OUT_A) (type input))
        (pin (num 8) (name NC) (type input))))
    (libpart (lib "add-ON board-cache") (part MOSN-TSOP6)
      (footprints
        (fp TSOP-6))
      (fields
        (field (name Reference) Q)
        (field (name Value) MOSN-TSOP6)
        (field (name Footprint) TSOP-6)
        (field (name Datasheet) ~))
      (pins
        (pin (num 1) (name D) (type passive))
        (pin (num 2) (name D) (type passive))
        (pin (num 3) (name G) (type input))
        (pin (num 4) (name S) (type passive))
        (pin (num 5) (name D) (type passive))
        (pin (num 6) (name D) (type passive)))))
  (libraries
    (library (logical device)
      (uri D:\Robert\KICAD\share\library\device.lib))
    (library (logical conn)
      (uri D:\Robert\KICAD\share\library\conn.lib))
    (library (logical linear)
      (uri D:\Robert\KICAD\share\library\linear.lib))
    (library (logical analog_switches)
      (uri D:\Robert\KICAD\share\library\analog_switches.lib))
    (library (logical "add-ON board-cache")
      (uri "C:\\Users\\zagaracr\\Dropbox\\photosynq project\\Hardware\\add-on board\\add-ON board-cache.lib")))
  (nets
    (net (code 1) (name "")
      (node (ref R106) (pin 2))
      (node (ref U104) (pin 5)))
    (net (code 2) (name "")
      (node (ref Q103) (pin 3))
      (node (ref R111) (pin 1)))
    (net (code 3) (name "")
      (node (ref R106) (pin 1))
      (node (ref Q101) (pin 3)))
    (net (code 4) (name "")
      (node (ref U103) (pin 1))
      (node (ref R110) (pin 2))
      (node (ref C113) (pin 1)))
    (net (code 5) (name "")
      (node (ref D101) (pin 2))
      (node (ref Q101) (pin 2))
      (node (ref Q101) (pin 1))
      (node (ref Q101) (pin 6))
      (node (ref Q101) (pin 5)))
    (net (code 6) (name "")
      (node (ref Q103) (pin 6))
      (node (ref Q103) (pin 5))
      (node (ref D103) (pin 2))
      (node (ref Q103) (pin 1))
      (node (ref Q103) (pin 2)))
    (net (code 7) (name "")
      (node (ref U102) (pin 4))
      (node (ref U103) (pin 5)))
    (net (code 8) (name "")
      (node (ref R109) (pin 1))
      (node (ref D103) (pin 1)))
    (net (code 9) (name DETB_A11_ADDON)
      (node (ref U106) (pin 1))
      (node (ref U106) (pin 4))
      (node (ref P1) (pin 12)))
    (net (code 10) (name "")
      (node (ref C114) (pin 2))
      (node (ref U101) (pin 2))
      (node (ref U106) (pin 3))
      (node (ref D106) (pin 2)))
    (net (code 11) (name "")
      (node (ref Q102) (pin 3))
      (node (ref R110) (pin 1)))
    (net (code 12) (name IR_CAL)
      (node (ref P1) (pin 2))
      (node (ref U102) (pin 1)))
    (net (code 13) (name IRCALB_PIN10)
      (node (ref P1) (pin 1))
      (node (ref U102) (pin 6)))
    (net (code 14) (name "preselected ACT")
      (node (ref U108) (pin 1))
      (node (ref P1) (pin 3)))
    (net (code 15) (name "")
      (node (ref D101) (pin 1))
      (node (ref R101) (pin 1)))
    (net (code 16) (name GND)
      (node (ref R113) (pin 2))
      (node (ref C1) (pin 2))
      (node (ref R107) (pin 2))
      (node (ref U103) (pin 4))
      (node (ref U102) (pin 2))
      (node (ref C2) (pin 2))
      (node (ref U102) (pin 3))
      (node (ref U108) (pin 2))
      (node (ref U108) (pin 3))
      (node (ref P1) (pin 9)))
    (net (code 17) (name AGND)
      (node (ref P1) (pin 15))
      (node (ref U106) (pin 2))
      (node (ref R112) (pin 1))
      (node (ref U101) (pin 3))
      (node (ref C101) (pin 2))
      (node (ref D105) (pin 1))
      (node (ref P1) (pin 11))
      (node (ref P1) (pin 13))
      (node (ref R114) (pin 1))
      (node (ref C112) (pin 1))
      (node (ref U105) (pin 2))
      (node (ref U105) (pin 3)))
    (net (code 18) (name ACTB_PIN2)
      (node (ref U108) (pin 6))
      (node (ref P1) (pin 4)))
    (net (code 19) (name MEAS2B_PIN12)
      (node (ref P1) (pin 6))
      (node (ref U104) (pin 4)))
    (net (code 20) (name GNDA)
      (node (ref Q103) (pin 4))
      (node (ref C123) (pin 2))
      (node (ref U104) (pin 3))
      (node (ref P1) (pin 10))
      (node (ref Q101) (pin 4))
      (node (ref C102) (pin 2)))
    (net (code 21) (name MEAS1B_PIN11)
      (node (ref P1) (pin 5))
      (node (ref U104) (pin 2)))
    (net (code 22) (name "")
      (node (ref R111) (pin 2))
      (node (ref U104) (pin 7)))
    (net (code 23) (name /ACT_SAT-LED)
      (node (ref D104) (pin 2))
      (node (ref Q102) (pin 5))
      (node (ref Q102) (pin 6))
      (node (ref R143) (pin 2))
      (node (ref Q102) (pin 1))
      (node (ref Q102) (pin 2)))
    (net (code 24) (name "")
      (node (ref U104) (pin 1)))
    (net (code 25) (name "")
      (node (ref U104) (pin 8)))
    (net (code 26) (name +5V)
      (node (ref U102) (pin 5))
      (node (ref P1) (pin 8))
      (node (ref C1) (pin 1))
      (node (ref U104) (pin 6))
      (node (ref L3) (pin 1))
      (node (ref C123) (pin 1)))
    (net (code 27) (name "")
      (node (ref C108) (pin 2))
      (node (ref D102) (pin 2))
      (node (ref R107) (pin 1))
      (node (ref R144) (pin 1))
      (node (ref U103) (pin 6)))
    (net (code 28) (name /calibration_LED)
      (node (ref U103) (pin 7))
      (node (ref D102) (pin 1))
      (node (ref C108) (pin 1))
      (node (ref R144) (pin 2)))
    (net (code 29) (name /pinK)
      (node (ref C115) (pin 1))
      (node (ref D105) (pin 2))
      (node (ref R112) (pin 2)))
    (net (code 30) (name +V_meas_regulated)
      (node (ref P1) (pin 7))
      (node (ref R101) (pin 2))
      (node (ref C102) (pin 1))
      (node (ref R109) (pin 2)))
    (net (code 31) (name /ACT_SAT_FB)
      (node (ref Q102) (pin 4))
      (node (ref R113) (pin 1))
      (node (ref C113) (pin 2))
      (node (ref U103) (pin 2)))
    (net (code 32) (name /ActVCC)
      (node (ref R143) (pin 1))
      (node (ref U108) (pin 5))
      (node (ref U103) (pin 8))
      (node (ref C2) (pin 1))
      (node (ref D104) (pin 1))
      (node (ref L3) (pin 2)))
    (net (code 33) (name /actinic_switched)
      (node (ref U108) (pin 4))
      (node (ref U103) (pin 3)))
    (net (code 34) (name "")
      (node (ref R102) (pin 1))
      (node (ref U101) (pin 4)))
    (net (code 35) (name HOLD)
      (node (ref P1) (pin 16))
      (node (ref R102) (pin 2)))
    (net (code 36) (name "")
      (node (ref U101) (pin 1))
      (node (ref C115) (pin 2))
      (node (ref C114) (pin 1))
      (node (ref U105) (pin 4))
      (node (ref D107) (pin 1))
      (node (ref R114) (pin 2)))
    (net (code 37) (name DetVcc)
      (node (ref U106) (pin 5))
      (node (ref U101) (pin 6))
      (node (ref U105) (pin 5))
      (node (ref C101) (pin 1))
      (node (ref U105) (pin 6))
      (node (ref P1) (pin 14))
      (node (ref C112) (pin 2))
      (node (ref U106) (pin 6)))
    (net (code 39) (name "")
      (node (ref U105) (pin 1))
      (node (ref D107) (pin 2))
      (node (ref D106) (pin 1)))))