(module tssop-16 (layer F.Cu) (tedit 49E9AF56)
  (descr TSSOP-16)
  (fp_text reference TSSOP-16 (at 0 0.508) (layer F.SilkS)
    (effects (font (size 0.50038 0.50038) (thickness 0.09906)))
  )
  (fp_text value U*** (at 0 -1.143) (layer F.SilkS)
    (effects (font (size 0.50038 0.50038) (thickness 0.09906)))
  )
  (fp_circle (center -1.905 1.524) (end -2.032 1.778) (layer F.SilkS) (width 0.127))
  (fp_line (start 2.54 -2.286) (end -2.54 -2.286) (layer F.SilkS) (width 0.127))
  (fp_line (start -2.54 -2.286) (end -2.54 2.286) (layer F.SilkS) (width 0.127))
  (fp_line (start -2.54 2.286) (end 2.54 2.286) (layer F.SilkS) (width 0.127))
  (fp_line (start 2.54 2.286) (end 2.54 -2.286) (layer F.SilkS) (width 0.127))
  (pad 4 smd rect (at -0.32512 2.79908) (size 0.4191 1.47066) (layers F.Cu F.Paste F.Mask))
  (pad 5 smd rect (at 0.32512 2.79908) (size 0.4191 1.47066) (layers F.Cu F.Paste F.Mask))
  (pad 6 smd rect (at 0.97536 2.79908) (size 0.4191 1.47066) (layers F.Cu F.Paste F.Mask))
  (pad 7 smd rect (at 1.6256 2.79908) (size 0.4191 1.47066) (layers F.Cu F.Paste F.Mask))
  (pad 16 smd rect (at -2.26568 -2.794) (size 0.4191 1.47066) (layers F.Cu F.Paste F.Mask))
  (pad 1 smd rect (at -2.27584 2.79908) (size 0.4191 1.47066) (layers F.Cu F.Paste F.Mask))
  (pad 2 smd rect (at -1.6256 2.79908) (size 0.4191 1.47066) (layers F.Cu F.Paste F.Mask))
  (pad 3 smd rect (at -0.97536 2.79908) (size 0.4191 1.47066) (layers F.Cu F.Paste F.Mask))
  (pad 9 smd rect (at 2.27584 -2.79908) (size 0.4191 1.47066) (layers F.Cu F.Paste F.Mask))
  (pad 10 smd rect (at 1.6256 -2.79908) (size 0.4191 1.47066) (layers F.Cu F.Paste F.Mask))
  (pad 11 smd rect (at 0.97536 -2.79908) (size 0.4191 1.47066) (layers F.Cu F.Paste F.Mask))
  (pad 12 smd rect (at 0.32512 -2.79908) (size 0.4191 1.47066) (layers F.Cu F.Paste F.Mask))
  (pad 13 smd rect (at -0.32512 -2.79908) (size 0.4191 1.47066) (layers F.Cu F.Paste F.Mask))
  (pad 14 smd rect (at -0.97536 -2.79908) (size 0.4191 1.47066) (layers F.Cu F.Paste F.Mask))
  (pad 8 smd rect (at 2.27584 2.79908) (size 0.4191 1.47066) (layers F.Cu F.Paste F.Mask))
  (pad 15 smd rect (at -1.6256 -2.794) (size 0.4191 1.47066) (layers F.Cu F.Paste F.Mask))
  (model walter\smd_dil\tssop-16.wrl
    (at (xyz 0 0 0))
    (scale (xyz 1 1 1))
    (rotate (xyz 0 0 0))
  )
)
