(module conn_usb_B (layer F.Cu) (tedit 4F088137)
  (descr "USB B-type receptacle, Lumberg P/N 2411-02")
  (tags USB)
  (fp_text reference conn_usb_B (at 0 9.40054) (layer F.SilkS)
    (effects (font (thickness 0.3048)))
  )
  (fp_text value JP*** (at 0 -9.10082) (layer F.SilkS)
    (effects (font (thickness 0.3048)))
  )
  (fp_line (start 6.0198 -4.0386) (end 7.7724 -2.286) (layer F.SilkS) (width 0.254))
  (fp_line (start 7.7724 -2.286) (end 6.0198 -0.5334) (layer F.SilkS) (width 0.254))
  (fp_line (start -6.0198 -4.0386) (end -7.7724 -2.286) (layer F.SilkS) (width 0.254))
  (fp_line (start -7.7724 -2.286) (end -6.0198 -0.5334) (layer F.SilkS) (width 0.254))
  (fp_line (start -6.0198 -2.286) (end -6.0198 8.0264) (layer F.SilkS) (width 0.254))
  (fp_line (start -6.0198 8.0264) (end 6.0198 8.0264) (layer F.SilkS) (width 0.254))
  (fp_line (start 6.0198 8.0264) (end 6.0198 -2.286) (layer F.SilkS) (width 0.254))
  (fp_line (start 6.0198 -2.286) (end 6.0198 -8.001) (layer F.SilkS) (width 0.254))
  (fp_line (start 6.0198 -8.001) (end -6.0198 -8.001) (layer F.SilkS) (width 0.254))
  (fp_line (start -6.0198 -8.001) (end -6.0198 -2.286) (layer F.SilkS) (width 0.254))
  (pad 3 thru_hole circle (at -1.2446 -5.0038) (size 1.50114 1.50114) (drill 0.94996) (layers *.Cu *.Mask F.SilkS))
  (pad 4 thru_hole circle (at 1.2446 -5.0038) (size 1.50114 1.50114) (drill 0.94996) (layers *.Cu *.Mask F.SilkS))
  (pad 1 thru_hole circle (at 1.2446 -7.0104) (size 1.50114 1.50114) (drill 0.94996) (layers *.Cu *.Mask F.SilkS))
  (pad 2 thru_hole circle (at -1.2446 -7.0104) (size 1.50114 1.50114) (drill 0.94996) (layers *.Cu *.Mask F.SilkS))
  (pad "" thru_hole circle (at -6.0198 -2.286) (size 3.50012 3.50012) (drill 2.30124) (layers *.Cu *.Mask F.SilkS))
  (pad "" thru_hole circle (at 6.0198 -2.286) (size 3.50012 3.50012) (drill 2.30124) (layers *.Cu *.Mask F.SilkS))
  (model walter\conn_pc\usb_B.wrl
    (at (xyz 0 0 0))
    (scale (xyz 1 1 1))
    (rotate (xyz 0 0 0))
  )
)
