(module c_2220 (layer F.Cu) (tedit 49F5796D)
  (descr "SMT capacitor, 2220")
  (fp_text reference c_2220 (at 0 -3.302) (layer F.SilkS)
    (effects (font (size 0.50038 0.50038) (thickness 0.11938)))
  )
  (fp_text value C*** (at 0 3.302) (layer F.SilkS) hide
    (effects (font (size 0.50038 0.50038) (thickness 0.11938)))
  )
  (fp_line (start 2.159 -2.54) (end 2.159 2.54) (layer F.SilkS) (width 0.127))
  (fp_line (start -2.159 -2.54) (end -2.159 2.54) (layer F.SilkS) (width 0.127))
  (fp_line (start -2.794 -2.54) (end 2.794 -2.54) (layer F.SilkS) (width 0.127))
  (fp_line (start 2.794 -2.54) (end 2.794 2.54) (layer F.SilkS) (width 0.127))
  (fp_line (start 2.794 2.54) (end -2.794 2.54) (layer F.SilkS) (width 0.127))
  (fp_line (start -2.794 2.54) (end -2.794 -2.54) (layer F.SilkS) (width 0.127))
  (pad 1 smd rect (at 2.57556 0) (size 1.84912 5.4991) (layers F.Cu F.Paste F.Mask))
  (pad 2 smd rect (at -2.57556 0) (size 1.84912 5.4991) (layers F.Cu F.Paste F.Mask))
  (model walter\smd_cap\c_2220.wrl
    (at (xyz 0 0 0))
    (scale (xyz 1 1 1))
    (rotate (xyz 0 0 0))
  )
)
