(module Pin_Header_Straight_1x04_2mm (layer F.Cu) (tedit 56EB169D)
  (descr "Through hole pin header")
  (tags "pin header, 4 position, 2mm pitch")
  (fp_text reference REF** (at 0.1 -2.6) (layer F.SilkS)
    (effects (font (size 1 1) (thickness 0.15)))
  )
  (fp_text value A2001-WV04 (at -2.4 2.9 90) (layer F.Fab)
    (effects (font (size 1 1) (thickness 0.15)))
  )
  (fp_line (start -1.75 -2) (end -1.75 8) (layer F.SilkS) (width 0.15))
  (fp_line (start 3.05 -2) (end 3.05 8) (layer F.SilkS) (width 0.15))
  (fp_line (start 3 8) (end -1.8 8) (layer F.SilkS) (width 0.15))
  (fp_line (start 3 -2) (end -1.8 -2) (layer F.SilkS) (width 0.15))
  (pad 1 thru_hole rect (at 0 0) (size 2.2 1.7) (drill 0.7) (layers *.Cu *.Mask F.SilkS))
  (pad 2 thru_hole oval (at 0 2) (size 2.2 1.7) (drill 0.7) (layers *.Cu *.Mask F.SilkS))
  (pad 3 thru_hole oval (at 0 4) (size 2.2 1.7) (drill 0.7) (layers *.Cu *.Mask F.SilkS))
  (pad 4 thru_hole oval (at 0 6) (size 2.2 1.7) (drill 0.7) (layers *.Cu *.Mask F.SilkS))
  (model Pin_Headers.3dshapes/Pin_Header_Straight_1x04.wrl
    (at (xyz 0 -0.15 0))
    (scale (xyz 1 1 1))
    (rotate (xyz 0 0 90))
  )
)
