(module hsop-44 (layer F.Cu) (tedit 50522F8D)
  (descr "HSOP-44, Freescale 1291-02")
  (fp_text reference HSOP-44 (at 0 -1.016) (layer F.SilkS)
    (effects (font (size 0.7493 0.7493) (thickness 0.14986)))
  )
  (fp_text value U*** (at 0 1.016) (layer F.SilkS)
    (effects (font (size 0.7493 0.7493) (thickness 0.14986)))
  )
  (fp_line (start -7.2009 5.4991) (end 8.001 5.4991) (layer F.SilkS) (width 0.254))
  (fp_line (start -8.001 -5.4991) (end -8.001 4.699) (layer F.SilkS) (width 0.254))
  (fp_line (start 8.001 5.4991) (end 8.001 -5.4991) (layer F.SilkS) (width 0.254))
  (fp_line (start -7.2009 5.4991) (end -8.001 4.699) (layer F.SilkS) (width 0.254))
  (fp_line (start -8.001 -5.4991) (end 8.001 -5.4991) (layer F.SilkS) (width 0.254))
  (fp_circle (center -1.6764 1.2446) (end -1.9558 1.6256) (layer F.SilkS) (width 0.127))
  (pad 23 smd rect (at 6.82498 -6.59638) (size 0.38608 1.69926) (layers F.Cu F.Paste F.Mask))
  (pad 24 smd rect (at 6.1722 -6.59638) (size 0.38608 1.69926) (layers F.Cu F.Paste F.Mask))
  (pad 25 smd rect (at 5.5245 -6.59638) (size 0.38608 1.69926) (layers F.Cu F.Paste F.Mask))
  (pad 26 smd rect (at 4.87426 -6.59638) (size 0.38608 1.69926) (layers F.Cu F.Paste F.Mask))
  (pad 27 smd rect (at 4.22148 -6.59638) (size 0.38608 1.69926) (layers F.Cu F.Paste F.Mask))
  (pad 28 smd rect (at 3.57378 -6.59638) (size 0.38608 1.69926) (layers F.Cu F.Paste F.Mask))
  (pad 29 smd rect (at 2.921 -6.59638) (size 0.38608 1.69926) (layers F.Cu F.Paste F.Mask))
  (pad 30 smd rect (at 2.2733 -6.59638) (size 0.38608 1.69926) (layers F.Cu F.Paste F.Mask))
  (pad 31 smd rect (at 1.62306 -6.59638) (size 0.38608 1.69926) (layers F.Cu F.Paste F.Mask))
  (pad 32 smd rect (at 0.97028 -6.59638) (size 0.38608 1.69926) (layers F.Cu F.Paste F.Mask))
  (pad 33 smd rect (at 0.32258 -6.59638) (size 0.38608 1.69926) (layers F.Cu F.Paste F.Mask))
  (pad 34 smd rect (at -0.32258 -6.59638) (size 0.38608 1.69926) (layers F.Cu F.Paste F.Mask))
  (pad 36 smd rect (at -1.62306 -6.59638) (size 0.38608 1.69926) (layers F.Cu F.Paste F.Mask))
  (pad 35 smd rect (at -0.97028 -6.59638) (size 0.38608 1.69926) (layers F.Cu F.Paste F.Mask))
  (pad 37 smd rect (at -2.2733 -6.59638) (size 0.38608 1.69926) (layers F.Cu F.Paste F.Mask))
  (pad 38 smd rect (at -2.921 -6.59638) (size 0.38608 1.69926) (layers F.Cu F.Paste F.Mask))
  (pad 39 smd rect (at -3.57378 -6.59638) (size 0.38608 1.69926) (layers F.Cu F.Paste F.Mask))
  (pad 40 smd rect (at -4.22148 -6.59638) (size 0.38608 1.69926) (layers F.Cu F.Paste F.Mask))
  (pad 41 smd rect (at -4.87426 -6.59638) (size 0.38608 1.69926) (layers F.Cu F.Paste F.Mask))
  (pad 42 smd rect (at -5.5245 -6.59638) (size 0.38608 1.69926) (layers F.Cu F.Paste F.Mask))
  (pad 43 smd rect (at -6.1722 -6.59638) (size 0.38608 1.69926) (layers F.Cu F.Paste F.Mask))
  (pad 44 smd rect (at -6.82498 -6.59638) (size 0.38608 1.69926) (layers F.Cu F.Paste F.Mask))
  (pad 1 smd rect (at -6.82498 6.59638) (size 0.38608 1.69926) (layers F.Cu F.Paste F.Mask))
  (pad 2 smd rect (at -6.17474 6.59892) (size 0.38608 1.69926) (layers F.Cu F.Paste F.Mask))
  (pad 3 smd rect (at -5.5245 6.59892) (size 0.38608 1.69926) (layers F.Cu F.Paste F.Mask))
  (pad 4 smd rect (at -4.87426 6.59892) (size 0.38608 1.69926) (layers F.Cu F.Paste F.Mask))
  (pad 5 smd rect (at -4.22402 6.59892) (size 0.38608 1.69926) (layers F.Cu F.Paste F.Mask))
  (pad 6 smd rect (at -3.57378 6.59892) (size 0.38608 1.69926) (layers F.Cu F.Paste F.Mask))
  (pad 7 smd rect (at -2.92354 6.59892) (size 0.38608 1.69926) (layers F.Cu F.Paste F.Mask))
  (pad 8 smd rect (at -2.2733 6.59892) (size 0.38608 1.69926) (layers F.Cu F.Paste F.Mask))
  (pad 21 smd rect (at 0 0) (size 12.79906 7.49808) (layers F.Cu F.Paste F.Mask))
  (pad 10 smd rect (at -0.97282 6.59892) (size 0.38608 1.69926) (layers F.Cu F.Paste F.Mask))
  (pad 9 smd rect (at -1.62306 6.59892) (size 0.38608 1.69926) (layers F.Cu F.Paste F.Mask))
  (pad 21 smd rect (at 0 0) (size 16.09852 3.39852) (layers F.Cu F.Paste F.Mask))
  (pad 11 smd rect (at -0.32258 6.59638) (size 0.38608 1.69926) (layers F.Cu F.Paste F.Mask))
  (pad 12 smd rect (at 0.32258 6.59638) (size 0.38608 1.69926) (layers F.Cu F.Paste F.Mask))
  (pad 13 smd rect (at 0.97282 6.59892) (size 0.38608 1.69926) (layers F.Cu F.Paste F.Mask))
  (pad 14 smd rect (at 1.62306 6.59638) (size 0.38608 1.69926) (layers F.Cu F.Paste F.Mask))
  (pad 15 smd rect (at 2.2733 6.59892) (size 0.38608 1.69926) (layers F.Cu F.Paste F.Mask))
  (pad 16 smd rect (at 2.92354 6.59892) (size 0.38608 1.69926) (layers F.Cu F.Paste F.Mask))
  (pad 17 smd rect (at 3.57378 6.59892) (size 0.38608 1.69926) (layers F.Cu F.Paste F.Mask))
  (pad 18 smd rect (at 4.22402 6.59892) (size 0.38608 1.69926) (layers F.Cu F.Paste F.Mask))
  (pad 19 smd rect (at 4.87426 6.59638) (size 0.38608 1.69926) (layers F.Cu F.Paste F.Mask))
  (pad 20 smd rect (at 5.5245 6.59638) (size 0.38608 1.69926) (layers F.Cu F.Paste F.Mask))
  (pad 21 smd rect (at 6.17474 6.59638) (size 0.38608 1.69926) (layers F.Cu F.Paste F.Mask))
  (pad 22 smd rect (at 6.82498 6.59638) (size 0.38608 1.69926) (layers F.Cu F.Paste F.Mask))
  (model walter\smd_dil\hsop-44.wrl
    (at (xyz 0 0 0))
    (scale (xyz 1 1 1))
    (rotate (xyz 0 0 0))
  )
)
