PCBNEW-LibModule-V1  9/10/2014 5:23:40 PM
# encoding utf-8
Units mm
$INDEX
1pins
CO2S8
CONN16_RIBBON_SMD
DCQ5
DIP-28__600_teensy
HTU21D
LM5111
Luxeon_Z+
MSOP10-0.5
Pin_diode_SIP_down
SIL-2
SM0402
SM0603
SM0805
SM1206
SM1210
SO8E
SOT23
SOT23-5
SSOP5
SW_PB_RA
TCS3472-Wide-solderable
WCSP-8_2
sc70-6
sfh-4045-940nm-LED
sod323
sot23
sot23-6
$EndINDEX
$MODULE 1pins
Po 40.64 132.461 0 15 51D47F36 00000000 ~~
Li 1pins
Cd 1 pin pad hole
Kw CONN_1
Sc 0
AR /53890C24
Op 0 0 0
At SMD
T0 -0.09398 -1.17602 0.4 0.4 0 0.05 N V 21 N "P13"
T1 -0.0381 1.22174 0.4 0.4 0 0.05 N I 21 N "CONN_1"
DC 0 0 0 -0.8 0.1 21
$PAD
Sh "1" C 1.4 1.4 0 0 0
Dr 0.8 0 0
At STD N 00E0FFFF
Ne 1 "+5V"
Po 0 0
$EndPAD
$EndMODULE 1pins
$MODULE CO2S8
Po 30.9 51.06 0 15 51E4527C 00000000 ~~
Li CO2S8
Cd http://co2meters.com/Documentation/Datasheets/DS-S8-PSP1081.pdf
Kw CO2, monitor, S8
Sc 0
AR /51E459C6
Op 0 0 0
At SMD
T0 -0.04064 -1.11506 0.762 0.762 0 0.127 N V 21 N "S101"
T1 0.0127 1.58242 0.762 0.762 0 0.127 N V 21 N "CO2_S8"
T2 -0.00254 -3.7973 0.762 0.762 0 0.127 N V 21 N "Bottom WIEW"
DS 13.15 -6.62 16.15 -6.62 0.15 21
DS 16.15 -6.62 16.15 6.1087 0.15 21
DS 16.15 6.1087 13.15 6.1087 0.15 21
DS -13.15 3.54 -16.15 3.54 0.15 21
DS -16.15 -6.62 -16.15 3.54 0.15 21
DS -16.15 -6.62 -13.15 -6.62 0.15 21
DS -13.15 -9.8 13.15 -9.8 0.15 21
DS 13.15 -9.8 13.15 9.8 0.15 21
DS 13.15 9.8 -13.15 9.8 0.15 21
DS -13.15 9.8 -13.15 -9.8 0.15 21
$PAD
Sh "1" C 1.8 1.8 0 0 0
Dr 1 0 0
At STD N 00E0FFFF
Ne 1 "+5V"
Po -14.85 -5.35
$EndPAD
$PAD
Sh "2" C 1.8 1.8 0 0 0
Dr 1 0 0
At STD N 00E0FFFF
Ne 22 "GND"
Po -14.85 -2.81
$EndPAD
$PAD
Sh "3" C 1.8 1.8 0 0 0
Dr 1 0 0
At STD N 00E0FFFF
Ne 0 ""
Po -14.85 -0.27
$EndPAD
$PAD
Sh "4" C 1.8 1.8 0 0 0
Dr 1 0 0
At STD N 00E0FFFF
Ne 0 ""
Po -14.85 2.27
$EndPAD
$PAD
Sh "5" C 1.8 1.8 0 0 0
Dr 1 0 0
At STD N 00E0FFFF
Ne 0 ""
Po 14.85 4.81
$EndPAD
$PAD
Sh "6" C 1.8 1.8 0 0 0
Dr 1 0 0
At STD N 00E0FFFF
Ne 0 ""
Po 14.85 2.27
$EndPAD
$PAD
Sh "7" C 1.8 1.8 0 0 0
Dr 1 0 0
At STD N 00E0FFFF
Ne 60 "Rxd_CO2"
Po 14.85 -0.27
$EndPAD
$PAD
Sh "8" C 1.8 1.8 0 0 0
Dr 1 0 0
At STD N 00E0FFFF
Ne 64 "Txd_CO2"
Po 14.85 -2.81
$EndPAD
$PAD
Sh "9" C 1.8 1.8 0 0 0
Dr 1 0 0
At STD N 00E0FFFF
Ne 0 ""
Po 14.85 -5.35
$EndPAD
$EndMODULE CO2S8
$MODULE CONN16_RIBBON_SMD
Po 29.75 100.62 0 15 5335ED17 00000000 ~~
Li CONN16_RIBBON_SMD
Sc 0
AR /5304E389
Op 0 0 0
At SMD
T0 -8.1534 1.1938 1.016 1.016 900 0.127 N V 21 N "P2"
T1 0.03 0.02 1.016 1.016 0 0.127 N V 21 N "CONN_16"
DS 9.54062 -2.75082 9.54062 2.75082 0.14986 21
DS -9.50062 -2.73082 9.54 -2.73082 0.14986 21
DS 9.54 2.77082 -9.50062 2.77082 0.14986 21
DS -9.50062 2.77082 -9.50062 -2.73082 0.14986 21
$PAD
Sh "9" R 0.64008 3.29946 0 0 0
Dr 0 0 0
At SMD N 00888000
Ne 22 "GND"
Po 0.5019 -3.2312
$EndPAD
$PAD
Sh "12" R 0.64008 3.29946 0 0 0
Dr 0 0 0
At SMD N 00888000
Ne 20 "DETB_A11_ADDON"
Po 3.50418 -3.2312
$EndPAD
$PAD
Sh "11" R 0.64008 3.29946 0 0 0
Dr 0 0 0
At SMD N 00888000
Ne 16 "AGND"
Po 2.50088 -3.2312
$EndPAD
$PAD
Sh "10" R 0.64008 3.29946 0 0 0
Dr 0 0 0
At SMD N 00888000
Ne 23 "GNDA"
Po 1.50266 -3.2312
$EndPAD
$PAD
Sh "5" R 0.64008 3.29946 0 0 0
Dr 0 0 0
At SMD N 00888000
Ne 31 "MEASB_PIN11"
Po -3.4986 -3.2312
$EndPAD
$PAD
Sh "6" R 0.64008 3.29946 0 0 0
Dr 0 0 0
At SMD N 00888000
Ne 29 "MEAS2B_PIN12"
Po -2.50038 -3.2312
$EndPAD
$PAD
Sh "8" R 0.64008 3.29946 0 0 0
Dr 0 0 0
At SMD N 00888000
Ne 1 "+5V"
Po -0.49886 -3.2312
$EndPAD
$PAD
Sh "7" R 0.64008 3.29946 0 0 0
Dr 0 0 0
At SMD N 00888000
Ne 2 "+V_meas_regulated"
Po -1.49708 -3.2312
$EndPAD
$PAD
Sh "3" R 0.64008 3.29946 0 0 0
Dr 0 0 0
At SMD N 00888000
Ne 70 "preselected ACT"
Po -5.49758 -3.2312
$EndPAD
$PAD
Sh "4" R 0.64008 3.29946 0 0 0
Dr 0 0 0
At SMD N 00888000
Ne 14 "ACTB_PIN2"
Po -4.49936 -3.2312
$EndPAD
$PAD
Sh "2" R 0.64008 3.29946 0 0 0
Dr 0 0 0
At SMD N 00888000
Ne 27 "IR_CAL"
Po -6.50088 -3.2312
$EndPAD
$PAD
Sh "1" R 0.64008 3.29946 0 0 0
Dr 0 0 0
At SMD N 00888000
Ne 26 "IRCALB_PIN10"
Po -7.4991 -3.2312
$EndPAD
$PAD
Sh "9" R 0.75946 5.00126 0 0 0
Dr 0 0 0
At SMD N 00888000
Ne 22 "GND"
Po -8.49986 -1.22968
$EndPAD
$PAD
Sh "9" R 0.75946 5.00126 0 0 0
Dr 0 0 0
At SMD N 00888000
Ne 22 "GND"
Po 8.56418 -1.22968
$EndPAD
$PAD
Sh "13" R 0.64008 3.29946 0 0 0
Dr 0 0 0
At SMD N 00888000
Ne 16 "AGND"
Po 4.50418 -3.2312
$EndPAD
$PAD
Sh "14" R 0.64008 3.29946 0 0 0
Dr 0 0 0
At SMD N 00888000
Ne 21 "DetVcc"
Po 5.50418 -3.2312
$EndPAD
$PAD
Sh "15" R 0.64008 3.29946 0 0 0
Dr 0 0 0
At SMD N 00888000
Ne 16 "AGND"
Po 6.50418 -3.2312
$EndPAD
$PAD
Sh "16" R 0.64008 3.29946 0 0 0
Dr 0 0 0
At SMD N 00888000
Ne 24 "HOLD"
Po 7.50418 -3.2312
$EndPAD
$SHAPE3D
Na "smd/conn20_smd.wrl"
Sc 0.4 0.4 0.4
Of 0 0 0
Ro 0 0 0
$EndSHAPE3D
$EndMODULE CONN16_RIBBON_SMD
$MODULE DCQ5
Po 22.88 90.4486 0 15 5372456F 00000000 ~~
Li DCQ5
Cd DCQ5
Sc 0
AR /51CDDD61
Op 0 0 0
At SMD
T0 2.41474 -2.90036 0.5 0.5 900 0.125 N V 21 N "U109"
T1 0.4564 0.19336 0.5 0.5 0 0.125 N I 21 N "TL1963"
DS -1.5494 -3.6449 1.5494 -3.6449 0.127 21
DS 1.5494 -3.6449 1.5494 -1.8542 0.127 21
DS -1.5494 -3.6449 -1.5494 -1.8542 0.127 21
DS 3.3528 1.8542 -3.3528 1.8542 0.127 21
DS -3.3528 1.8542 -3.3528 -1.8542 0.127 21
DS -3.3528 -1.8542 3.3528 -1.8542 0.127 21
DS 3.3528 -1.8542 3.3528 1.8542 0.127 21
$PAD
Sh "1" R 0.6 2.2 0 0 0
Dr 0 0 0
At SMD N 00888000
Ne 71 "sleep"
Po -2.54 3.1
$EndPAD
$PAD
Sh "2" R 0.6 2.2 0 0 0
Dr 0 0 0
At SMD N 00888000
Ne 51 "N-0000076"
Po -1.27 3.1
$EndPAD
$PAD
Sh "3" R 0.6 2.2 0 0 0
Dr 0 0 0
At SMD N 00888000
Ne 16 "AGND"
Po 0 3.1
$EndPAD
$PAD
Sh "3" R 3.79984 2.2 0 0 0
Dr 0 0 0
At SMD N 00888000
Ne 16 "AGND"
Po 0 -3.1
$EndPAD
$PAD
Sh "4" R 0.6 2.2 0 0 0
Dr 0 0 0
At SMD N 00888000
Ne 21 "DetVcc"
Po 1.27 3.1
$EndPAD
$PAD
Sh "5" R 0.6 2.2 0 0 0
Dr 0 0 0
At SMD N 00888000
Ne 53 "N-0000081"
Po 2.54 3.1
$EndPAD
$SHAPE3D
Na "walter\\smd_trans\\sot223.wrl"
Sc 1 1 1
Of 0 0 0
Ro 0 0 0
$EndSHAPE3D
$EndMODULE DCQ5
$MODULE DIP-28__600_teensy
Po 29.718 123.571 0 15 5372467F 00000000 ~~
Li DIP-28__600_teensy
Cd Module Dil 28 pins, e=600 mils
Kw DIL, Teensy
Sc 0
AR /5343FED9
Op 0 0 0
T0 -16.57604 9.09066 0.508 0.508 900 0.127 N V 21 N "U6"
T1 13.0429 10.033 1.27 1.27 0 0.2032 N V 21 N "TEENSY3.1"
DS -19.05 -1.27 -19.05 -1.27 0.381 21
DS -19.05 -1.27 -17.78 -1.27 0.381 21
DS -17.78 -1.27 -17.78 1.27 0.381 21
DS -17.78 1.27 -19.05 1.27 0.381 21
DS -19.05 -6.35 19.05 -6.35 0.381 21
DS 19.05 -6.35 19.05 6.35 0.381 21
DS 19.05 6.35 -19.05 6.35 0.381 21
DS -19.05 6.35 -19.05 -6.35 0.381 21
$PAD
Sh "a1" C 1.397 1.397 0 0 0
Dr 0.8128 0 0
At STD N 00E0FFFF
Ne 19 "Aref"
Po -8.89 -5.08
$EndPAD
$PAD
Sh "a2" C 1.397 1.397 0 0 0
Dr 0.8128 0 0
At STD N 00E0FFFF
Ne 18 "Ain10"
Po -6.35 -5.08
$EndPAD
$PAD
Sh "a3" C 1.397 1.397 0 0 0
Dr 0.8128 0 0
At STD N 00E0FFFF
Ne 20 "DETB_A11_ADDON"
Po -3.81 -5.08
$EndPAD
$PAD
Sh "1" R 1.397 1.397 0 0 0
Dr 0.8128 0 0
At STD N 00E0FFFF
Ne 22 "GND"
Po -16.51 7.62
$EndPAD
$PAD
Sh "2" C 1.397 1.397 0 0 0
Dr 0.8128 0 0
At STD N 00E0FFFF
Ne 63 "TXd_BT"
Po -13.97 7.62
$EndPAD
$PAD
Sh "3" C 1.397 1.397 0 0 0
Dr 0.8128 0 0
At STD N 00E0FFFF
Ne 59 "RXd_BT"
Po -11.43 7.62
$EndPAD
$PAD
Sh "4" C 1.397 1.397 0 0 0
Dr 0.8128 0 0
At STD N 00E0FFFF
Ne 14 "ACTB_PIN2"
Po -8.89 7.62
$EndPAD
$PAD
Sh "5" C 1.397 1.397 0 0 0
Dr 0.8128 0 0
At STD N 00E0FFFF
Ne 56 "N-0000090"
Po -6.35 7.62
$EndPAD
$PAD
Sh "6" C 1.397 1.397 0 0 0
Dr 0.8128 0 0
At STD N 00E0FFFF
Ne 57 "N-0000091"
Po -3.81 7.62
$EndPAD
$PAD
Sh "7" C 1.397 1.397 0 0 0
Dr 0.8128 0 0
At STD N 00E0FFFF
Ne 73 "toggle act1/act2"
Po -1.27 7.62
$EndPAD
$PAD
Sh "8" C 1.397 1.397 0 0 0
Dr 0.8128 0 0
At STD N 00E0FFFF
Ne 24 "HOLD"
Po 1.27 7.62
$EndPAD
$PAD
Sh "9" C 1.397 1.397 0 0 0
Dr 0.8128 0 0
At STD N 00E0FFFF
Ne 60 "Rxd_CO2"
Po 3.81 7.62
$EndPAD
$PAD
Sh "10" C 1.397 1.397 0 0 0
Dr 0.8128 0 0
At STD N 00E0FFFF
Ne 64 "Txd_CO2"
Po 6.35 7.62
$EndPAD
$PAD
Sh "11" C 1.397 1.397 0 0 0
Dr 0.8128 0 0
At STD N 00E0FFFF
Ne 58 "N-0000092"
Po 8.89 7.62
$EndPAD
$PAD
Sh "12" C 1.397 1.397 0 0 0
Dr 0.8128 0 0
At STD N 00E0FFFF
Ne 26 "IRCALB_PIN10"
Po 11.43 7.62
$EndPAD
$PAD
Sh "13" C 1.397 1.397 0 0 0
Dr 0.8128 0 0
At STD N 00E0FFFF
Ne 31 "MEASB_PIN11"
Po 13.97 7.62
$EndPAD
$PAD
Sh "14" C 1.397 1.397 0 0 0
Dr 0.8128 0 0
At STD N 00E0FFFF
Ne 29 "MEAS2B_PIN12"
Po 16.51 7.62
$EndPAD
$PAD
Sh "15" C 1.397 1.397 0 0 0
Dr 0.8128 0 0
At STD N 00E0FFFF
Ne 0 ""
Po 16.51 -7.62
$EndPAD
$PAD
Sh "16" C 1.397 1.397 0 0 0
Dr 0.8128 0 0
At STD N 00E0FFFF
Ne 25 "IR CAL toggle"
Po 13.97 -7.62
$EndPAD
$PAD
Sh "17" C 1.397 1.397 0 0 0
Dr 0.8128 0 0
At STD N 00E0FFFF
Ne 65 "Umeas1"
Po 11.43 -7.62
$EndPAD
$PAD
Sh "18" C 1.397 1.397 0 0 0
Dr 0.8128 0 0
At STD N 00E0FFFF
Ne 66 "Umeas2"
Po 8.89 -7.62
$EndPAD
$PAD
Sh "19" C 1.397 1.397 0 0 0
Dr 0.8128 0 0
At STD N 00E0FFFF
Ne 67 "Vbatt_meas"
Po 6.35 -7.62
$EndPAD
$PAD
Sh "20" C 1.397 1.397 0 0 0
Dr 0.8128 0 0
At STD N 00E0FFFF
Ne 62 "SDA"
Po 3.81 -7.62
$EndPAD
$PAD
Sh "21" C 1.397 1.397 0 0 0
Dr 0.8128 0 0
At STD N 00E0FFFF
Ne 61 "SCL"
Po 1.27 -7.62
$EndPAD
$PAD
Sh "22" C 1.397 1.397 0 0 0
Dr 0.8128 0 0
At STD N 00E0FFFF
Ne 72 "toggle act ON/OFF"
Po -1.27 -7.62
$EndPAD
$PAD
Sh "23" C 1.397 1.397 0 0 0
Dr 0.8128 0 0
At STD N 00E0FFFF
Ne 17 "AUTO POWER OFF"
Po -3.81 -7.62
$EndPAD
$PAD
Sh "24" C 1.397 1.397 0 0 0
Dr 0.8128 0 0
At STD N 00E0FFFF
Ne 71 "sleep"
Po -6.35 -7.62
$EndPAD
$PAD
Sh "25" C 1.397 1.397 0 0 0
Dr 0.8128 0 0
At STD N 00E0FFFF
Ne 74 "~LDAC"
Po -8.89 -7.62
$EndPAD
$PAD
Sh "26" C 1.397 1.397 0 0 0
Dr 0.8128 0 0
At STD N 00E0FFFF
Ne 13 "3.3Vdd"
Po -11.43 -7.62
$EndPAD
$PAD
Sh "27" C 1.397 1.397 0 0 0
Dr 0.8128 0 0
At STD N 00E0FFFF
Ne 16 "AGND"
Po -13.97 -7.62
$EndPAD
$PAD
Sh "28" C 1.397 1.397 0 0 0
Dr 0.8128 0 0
At STD N 00E0FFFF
Ne 1 "+5V"
Po -16.51 -7.62
$EndPAD
$SHAPE3D
Na "dil/dil_28-w600.wrl"
Sc 1 1 1
Of 0 0 0
Ro 0 0 0
$EndSHAPE3D
$EndMODULE DIP-28__600_teensy
$MODULE HTU21D
Po 19.1 46.73 0 15 5372447A 00000000 ~~
Li HTU21D
Cd Plastic QFP, ON DFN6
Sc 0
AR /51E06B99
Op 0 0 0
T0 -2.61794 0.28032 0.5 0.5 0 0.125 N V 21 N "U111"
T1 -2.77796 -0.53756 0.5 0.5 0 0.125 N V 21 N "HTU21D"
DS -1.6002 1.30048 -1.6002 1.6002 0.127 21
DS -1.6002 1.6002 -1.30048 1.6002 0.127 21
DS -1.30048 1.6002 -1.6002 1.30048 0.127 21
DC -0.99822 0.89916 -1.09982 1.09728 0.19812 21
DS -1.50114 -1.50114 1.50114 -1.50114 0.127 21
DS 1.50114 -1.50114 1.50114 1.50114 0.127 21
DS 1.50114 1.50114 -1.50114 1.50114 0.127 21
DS -1.50114 1.50114 -1.50114 -1.50114 0.127 21
$PAD
Sh "1" R 0.34798 0.62738 0 0 0
Dr 0 0 0
At SMD N 00888000
Ne 62 "SDA"
Po -1 1.3
.SolderMask 0.06858
$EndPAD
$PAD
Sh "2" R 0.34798 0.62738 0 0 0
Dr 0 0 0
At SMD N 00888000
Ne 22 "GND"
Po 0 1.3
.SolderMask 0.06858
$EndPAD
$PAD
Sh "3" R 0.33 0.62738 0 0 0
Dr 0 0 0
At SMD N 00888000
Ne 0 ""
Po 1 1.3
.SolderMask 0.06858
$EndPAD
$PAD
Sh "4" R 0.34798 0.62738 0 0 0
Dr 0 0 0
At SMD N 00888000
Ne 0 ""
Po 1 -1.3
.SolderMask 0.06858
$EndPAD
$PAD
Sh "5" R 0.34798 0.62738 0 0 0
Dr 0 0 0
At SMD N 00888000
Ne 13 "3.3Vdd"
Po 0 -1.3
.SolderMask 0.06858
$EndPAD
$PAD
Sh "6" R 0.34798 0.62738 0 0 0
Dr 0 0 0
At SMD N 00888000
Ne 61 "SCL"
Po -1 -1.3
.SolderMask 0.06858
$EndPAD
$PAD
Sh "2" R 2.2 1.3 0 0 0
Dr 0 0 0
At SMD N 00888000
Ne 22 "GND"
Po 0.01 -0.04
$EndPAD
$SHAPE3D
Na "walter\\smd_qfn\\dfn8.wrl"
Sc 1 1 1
Of 0 0 0
Ro 0 0 0
$EndSHAPE3D
$EndMODULE HTU21D
$MODULE LM5111
Po 17.68 110.39 0 15 52693620 00000000 ~~
Li LM5111
Sc 0
AR /521F678B
Op 0 0 0
T0 0 0.635 0.5 0.5 0 0.125 N V 21 N "U104"
T1 0 -0.762 0.5 0.5 0 0.125 N V 21 N "LM5111"
DS -0.3175 1.5875 -1.5875 0.381 0.2032 21
DS -1.5875 1.5875 1.5875 1.5875 0.2032 21
DS 1.5875 1.5875 1.5875 -1.5875 0.2032 21
DS 1.5875 -1.5875 -1.5875 -1.5875 0.2032 21
DS -1.5875 -1.5875 -1.5875 1.5875 0.2032 21
$PAD
Sh "1" R 0.381 1.27 0 0 0
Dr 0 0 0
At SMD N 00888000
Ne 0 ""
Po -0.97536 2.159
$EndPAD
$PAD
Sh "2" R 0.381 1.27 0 0 0
Dr 0 0 0
At SMD N 00888000
Ne 65 "Umeas1"
Po -0.32512 2.159
$EndPAD
$PAD
Sh "3" R 0.381 1.27 0 0 0
Dr 0 0 0
At SMD N 00888000
Ne 23 "GNDA"
Po 0.32512 2.159
$EndPAD
$PAD
Sh "4" R 0.381 1.27 0 0 0
Dr 0 0 0
At SMD N 00888000
Ne 66 "Umeas2"
Po 0.97536 2.159
$EndPAD
$PAD
Sh "5" R 0.381 1.27 0 0 0
Dr 0 0 0
At SMD N 00888000
Ne 44 "N-0000049"
Po 0.97536 -2.159
$EndPAD
$PAD
Sh "6" R 0.381 1.27 0 0 0
Dr 0 0 0
At SMD N 00888000
Ne 1 "+5V"
Po 0.32512 -2.159
$EndPAD
$PAD
Sh "7" R 0.381 1.27 0 0 0
Dr 0 0 0
At SMD N 00888000
Ne 43 "N-0000048"
Po -0.32512 -2.159
$EndPAD
$PAD
Sh "8" R 0.381 1.27 0 0 0
Dr 0 0 0
At SMD N 00888000
Ne 0 ""
Po -0.97536 -2.159
$EndPAD
$PAD
Sh "3" R 1.85 1.73 0 0 0
Dr 0 0 0
At SMD N 00888000
Ne 23 "GNDA"
Po 0 0
$EndPAD
$SHAPE3D
Na "smd/MSOP_8.wrl"
Sc 0.3937 0.3937 0.3937
Of 0 0 0.001
Ro 0 0 0
$EndSHAPE3D
$EndMODULE LM5111
$MODULE Luxeon_Z+
Po 17.6 23.265 0 15 5405DC70 00000000 ~~
Li Luxeon_Z+
Cd Philips Lumileds Luxeon Z
Kw Luxeon Z
Sc 0
AR /5182EBC9
Op 0 0 0
T0 0.01778 -1.03632 0.2 0.2 0 0.05 N V 21 N "D103"
T1 -0.00762 1.07188 0.2 0.2 0 0.05 N V 21 N "MEAS1A"
DS 0.55 -0.75 -0.55 0.25 0.02 21
DS 0.55 -0.75 0.55 0.25 0.02 21
DS 0.55 0.25 -0.55 0.25 0.02 21
DS -0.55 0.25 -0.55 -0.75 0.02 21
DS -0.55 -0.75 0.55 0.25 0.02 21
DS -0.55 -0.75 0.55 -0.75 0.02 21
DS -0.65 -0.85 0.65 -0.85 0.05 21
DS 0.65 -0.85 0.65 0.85 0.05 21
DS 0.65 0.85 -0.65 0.85 0.05 21
DS -0.65 0.85 -0.65 -0.85 0.05 21
$PAD
Sh "2" R 1.1 1.5 0 0 0
Dr 0 0 0
At SMD N 00888000
Ne 28 "MEAS1C-"
Po -0.775 0
$EndPAD
$PAD
Sh "1" R 1.1 1.5 0 0 0
Dr 0 0 0
At SMD N 00888000
Ne 10 "/short"
Po 0.775 0
$EndPAD
$SHAPE3D
Na "walter\\smd_leds\\luxeon_m.wrl"
Sc 1 1 1
Of 0 0 0
Ro 0 0 0
$EndSHAPE3D
$EndMODULE Luxeon_Z+
$MODULE MSOP10-0.5
Po 30.861 113.411 0 15 537245B2 00000000 ~~
Li MSOP10-0.5
Cd MSOP10 10pins pitch 0.5mm
Sc 0
AR /5342CE99
Op 0 0 0
At SMD
T0 0.84328 -3.63474 0.762 0.762 900 0.1524 N V 21 N "U7"
T1 0.23368 1.05918 0.3048 0.3048 0 0.0762 N V 21 N "MCP4728"
DC -1.016 1.016 -1.016 0.762 0.2032 21
DS 1.524 1.524 -1.524 1.524 0.2032 21
DS -1.524 1.524 -1.524 -1.524 0.2032 21
DS -1.524 -1.524 1.524 -1.524 0.2032 21
DS 1.524 -1.524 1.524 1.524 0.2032 21
$PAD
Sh "1" R 0.26924 1.00076 0 0 0
Dr 0 0 0
At SMD N 00888000
Ne 1 "+5V"
Po -1.016 2.2225
$EndPAD
$PAD
Sh "2" R 0.26924 1.00076 0 0 0
Dr 0 0 0
At SMD N 00888000
Ne 61 "SCL"
Po -0.508 2.2225
$EndPAD
$PAD
Sh "3" R 0.26924 1.00076 0 0 0
Dr 0 0 0
At SMD N 00888000
Ne 62 "SDA"
Po 0 2.2225
$EndPAD
$PAD
Sh "4" R 0.26924 1.00076 0 0 0
Dr 0 0 0
At SMD N 00888000
Ne 74 "~LDAC"
Po 0.508 2.2225
$EndPAD
$PAD
Sh "5" R 0.26924 1.00076 0 0 0
Dr 0 0 0
At SMD N 00888000
Ne 0 ""
Po 1.016 2.2225
$EndPAD
$PAD
Sh "6" R 0.26924 1.00076 0 0 0
Dr 0 0 0
At SMD N 00888000
Ne 68 "actinic_preset1"
Po 1.016 -2.2225
$EndPAD
$PAD
Sh "7" R 0.26924 1.00076 0 0 0
Dr 0 0 0
At SMD N 00888000
Ne 69 "actinic_preset2"
Po 0.508 -2.2225
$EndPAD
$PAD
Sh "8" R 0.26924 1.00076 0 0 0
Dr 0 0 0
At SMD N 00888000
Ne 27 "IR_CAL"
Po 0 -2.2225
$EndPAD
$PAD
Sh "9" R 0.26924 1.00076 0 0 0
Dr 0 0 0
At SMD N 00888000
Ne 32 "Meas intensity"
Po -0.508 -2.2225
$EndPAD
$PAD
Sh "10" R 0.26924 1.00076 0 0 0
Dr 0 0 0
At SMD N 00888000
Ne 23 "GNDA"
Po -1.016 -2.2225
$EndPAD
$SHAPE3D
Na "smd\\MSOP_10.wrl"
Sc 0.3 0.35 0.3
Of 0 0 0
Ro 0 0 0
$EndSHAPE3D
$EndMODULE MSOP10-0.5
$MODULE Pin_diode_SIP_down
Po 22.295 18.366 0 15 53724368 00000000 ~~
Li Pin_diode_SIP_down
Cd Pin photodiode flat
Kw PIN photo diode flat hammamatsu
Sc 0
AR /516F0A66
Op 0 0 0
T0 -2.4366 6.01076 0.5 0.5 0 0.125 N V 21 N "D105"
T1 2.48846 6.02854 0.5 0.5 0 0.125 N I 21 N "DETA"
DS -2.18694 -3.5687 -3.44678 -2.32918 0.15 21
DS -2.39776 -2.2479 2.4003 2.25044 0.15 21
DS -2.39268 2.2352 2.4003 -2.25044 0.15 21
DS -2.4 -2.25 2.4 -2.25 0.15 21
DS 2.4 -2.25 2.4 2.25 0.15 21
DS 2.4 2.25 -2.4 2.25 0.15 21
DS -2.4 2.25 -2.4 -2.25 0.15 21
DS 3.5 -3.65 -3.5 -3.65 0.3048 21
DS -3.5 4.15 3.5 4.15 0.3048 21
DS -3.5 -3.65 -3.5127 4.15 0.3048 21
DS 3.5 -3.65 3.4873 4.15 0.3048 21
$PAD
Sh "1" R 1.524 2.19964 0 0 0
Dr 1.00076 0 0
At STD N 00E0FFFF
Ne 16 "AGND"
Po -2.54 7.65
$EndPAD
$PAD
Sh "2" O 1.524 2.19964 0 0 0
Dr 1.00076 0 0
At STD N 00E0FFFF
Ne 9 "/pinK"
Po 2.54 7.65
$EndPAD
$SHAPE3D
Na "walter\\pin_strip\\pin_strip_4.wrl"
Sc 1 1 1
Of 0 0 0
Ro 0 0 0
$EndSHAPE3D
$EndMODULE Pin_diode_SIP_down
$MODULE SIL-2
Po 25.21 138.88 0 15 537246E8 00000000 ~~
Li SIL-2
Cd Connecteurs 2 pins
Kw CONN DEV
Sc 0
AR /523082DE
Op 0 0 0
T0 2.43036 1.3086 0.508 0.508 900 0.127 N V 21 N "K102"
T1 0.12912 1.04444 0.508 0.508 900 0.127 N I 21 N "PWR_CONN"
DS -2.54 1.27 -2.54 -1.27 0.3048 21
DS -2.54 -1.27 2.54 -1.27 0.3048 21
DS 2.54 -1.27 2.54 1.27 0.3048 21
DS 2.54 1.27 -2.54 1.27 0.3048 21
$PAD
Sh "1" R 1.397 1.397 0 0 0
Dr 0.8128 0 0
At STD N 00E0FFFF
Ne 3 "+Vbatt"
Po -1.27 0
$EndPAD
$PAD
Sh "2" C 1.397 1.397 0 0 0
Dr 0.8128 0 0
At STD N 00E0FFFF
Ne 22 "GND"
Po 1.27 0
$EndPAD
$EndMODULE SIL-2
$MODULE SM0402
Po 28.3464 17.9578 0 15 53724492 00000000 ~~
Li SM0402
Sc 0
AR /517FDF22
Op 0 0 0
At SMD
T0 0 0.762 0.3048 0.3048 0 0.0762 N V 21 N "R114"
T1 -1.04394 -0.3048 0.3048 0.3048 900 0.0762 N I 21 N "1K"
DS -0.254 -0.381 -0.762 -0.381 0.127 21
DS -0.762 -0.381 -0.762 0.381 0.127 21
DS -0.762 0.381 -0.254 0.381 0.127 21
DS 0.254 -0.381 0.762 -0.381 0.127 21
DS 0.762 -0.381 0.762 0.381 0.127 21
DS 0.762 0.381 0.254 0.381 0.127 21
$PAD
Sh "1" R 0.39878 0.59944 0 0 0
Dr 0 0 0
At SMD N 00888000
Ne 16 "AGND"
Po -0.44958 0
$EndPAD
$PAD
Sh "2" R 0.39878 0.59944 0 0 0
Dr 0 0 0
At SMD N 00888000
Ne 9 "/pinK"
Po 0.44958 0
$EndPAD
$SHAPE3D
Na "smd\\chip_cms.wrl"
Sc 0.05 0.05 0.05
Of 0 0 0.002
Ro 0 0 0
$EndSHAPE3D
$EndMODULE SM0402
$MODULE SM0603
Po 33.5 141.37 0 15 53724679 00000000 ~~
Li SM0603
Sc 0
AR /53322A27
Op 0 0 0
At SMD
T0 2.10826 -0.5143 0.508 0.4572 0 0.1143 N V 21 N "D108"
T1 2.55784 0.2858 0.508 0.4572 0 0.1143 N I 21 N "pwr_LED"
DS -1.143 -0.635 1.143 -0.635 0.127 21
DS 1.143 -0.635 1.143 0.635 0.127 21
DS 1.143 0.635 -1.143 0.635 0.127 21
DS -1.143 0.635 -1.143 -0.635 0.127 21
$PAD
Sh "1" R 0.635 1.143 0 0 0
Dr 0 0 0
At SMD N 00888000
Ne 37 "N-0000037"
Po -0.762 0
$EndPAD
$PAD
Sh "2" R 0.635 1.143 0 0 0
Dr 0 0 0
At SMD N 00888000
Ne 34 "N-0000019"
Po 0.762 0
$EndPAD
$SHAPE3D
Na "smd\\resistors\\R0603.wrl"
Sc 0.5 0.5 0.5
Of 0 0 0.001
Ro 0 0 0
$EndSHAPE3D
$EndMODULE SM0603
$MODULE SM0805
Po 39.9542 20.8534 0 15 537243A9 00000000 ~~
Li SM0805
Sc 0
AR /5311963A
Op 0 0 0
At SMD
T0 -0.00508 1.2446 0.50038 0.50038 0 0.10922 N V 21 N "C134"
T1 -0.04572 0.04572 0.50038 0.50038 900 0.10922 N V 21 N "10u"
DC -1.651 0.762 -1.651 0.635 0.09906 21
DS -0.508 0.762 -1.524 0.762 0.09906 21
DS -1.524 0.762 -1.524 -0.762 0.09906 21
DS -1.524 -0.762 -0.508 -0.762 0.09906 21
DS 0.508 -0.762 1.524 -0.762 0.09906 21
DS 1.524 -0.762 1.524 0.762 0.09906 21
DS 1.524 0.762 0.508 0.762 0.09906 21
$PAD
Sh "1" R 0.889 1.397 0 0 0
Dr 0 0 0
At SMD N 00888000
Ne 16 "AGND"
Po -0.9525 0
$EndPAD
$PAD
Sh "2" R 0.889 1.397 0 0 0
Dr 0 0 0
At SMD N 00888000
Ne 21 "DetVcc"
Po 0.9525 0
$EndPAD
$SHAPE3D
Na "smd/chip_cms.wrl"
Sc 0.1 0.1 0.1
Of 0 0 0
Ro 0 0 0
$EndSHAPE3D
$EndMODULE SM0805
$MODULE SM1206
Po 31.7246 17.9578 0 15 5372435D 00000000 ~~
Li SM1206
Sc 0
AR /521F7EBE
Op 0 0 0
At SMD
T0 -1.5494 1.44018 0.762 0.762 0 0.127 N V 21 N "C115"
T1 0.0508 -0.59436 0.762 0.762 900 0.127 N I 21 N "0.1u"
DS -2.54 -1.143 -2.54 1.143 0.127 21
DS -2.54 1.143 -0.889 1.143 0.127 21
DS 0.889 -1.143 2.54 -1.143 0.127 21
DS 2.54 -1.143 2.54 1.143 0.127 21
DS 2.54 1.143 0.889 1.143 0.127 21
DS -0.889 -1.143 -2.54 -1.143 0.127 21
$PAD
Sh "1" R 1.524 2.032 0 0 0
Dr 0 0 0
At SMD N 00888000
Ne 9 "/pinK"
Po -1.651 0
$EndPAD
$PAD
Sh "2" R 1.524 2.032 0 0 0
Dr 0 0 0
At SMD N 00888000
Ne 52 "N-0000077"
Po 1.651 0
$EndPAD
$SHAPE3D
Na "smd/chip_cms.wrl"
Sc 0.17 0.16 0.16
Of 0 0 0
Ro 0 0 0
$EndSHAPE3D
$EndMODULE SM1206
$MODULE SM1210
Po 38.77818 29.65704 0 15 5372442B 00000000 ~~
Li SM1210
Kw CMS SM
Sc 0
AR /5182E98C
Op 0 0 0
At SMD
T0 2.7353 -0.1113 0.5 0.5 900 0.125 N V 21 N "R101"
T1 -0.33556 0.57196 0.5 0.5 900 0.125 N V 21 N "2"
DC -2.413 1.524 -2.286 1.397 0.127 21
DS -0.762 -1.397 -2.286 -1.397 0.127 21
DS -2.286 -1.397 -2.286 1.397 0.127 21
DS -2.286 1.397 -0.762 1.397 0.127 21
DS 0.762 1.397 2.286 1.397 0.127 21
DS 2.286 1.397 2.286 -1.397 0.127 21
DS 2.286 -1.397 0.762 -1.397 0.127 21
$PAD
Sh "1" R 1.27 2.54 0 0 0
Dr 0 0 0
At SMD N 00888000
Ne 11 "/short1"
Po -1.524 0
$EndPAD
$PAD
Sh "2" R 1.27 2.54 0 0 0
Dr 0 0 0
At SMD N 00888000
Ne 2 "+V_meas_regulated"
Po 1.524 0
$EndPAD
$SHAPE3D
Na "smd/chip_cms.wrl"
Sc 0.17 0.2 0.17
Of 0 0 0
Ro 0 0 0
$EndSHAPE3D
$EndMODULE SM1210
$MODULE SO8E
Po 34.27 77.615 0 15 4F33A5C7 00000000 ~~
Li SO8E
Cd module CMS SOJ 8 pins etroit
Kw CMS SOJ
Sc 0
AR /51801A7B
Op 0 0 0
At SMD
T0 0 -0.889 0.5 0.5 0 0.125 N V 21 N "U103"
T1 0 1.016 0.5 0.5 0 0.125 N V 21 N "OPA2180"
DS -2.667 1.778 -2.667 1.905 0.127 21
DS -2.667 1.905 2.667 1.905 0.127 21
DS 2.667 -1.905 -2.667 -1.905 0.127 21
DS -2.667 -1.905 -2.667 1.778 0.127 21
DS -2.667 -0.508 -2.159 -0.508 0.127 21
DS -2.159 -0.508 -2.159 0.508 0.127 21
DS -2.159 0.508 -2.667 0.508 0.127 21
DS 2.667 -1.905 2.667 1.905 0.127 21
$PAD
Sh "8" R 0.59944 1.39954 0 0 0
Dr 0 0 0
At SMD N 00888000
Ne 5 "/ACT_comm"
Po -1.905 -2.667
$EndPAD
$PAD
Sh "1" R 0.59944 1.39954 0 0 0
Dr 0 0 0
At SMD N 00888000
Ne 41 "N-0000042"
Po -1.905 2.667
$EndPAD
$PAD
Sh "7" R 0.59944 1.39954 0 0 0
Dr 0 0 0
At SMD N 00888000
Ne 8 "/calibration_LED"
Po -0.635 -2.667
$EndPAD
$PAD
Sh "6" R 0.59944 1.39954 0 0 0
Dr 0 0 0
At SMD N 00888000
Ne 7 "/cal-"
Po 0.635 -2.667
$EndPAD
$PAD
Sh "5" R 0.59944 1.39954 0 0 0
Dr 0 0 0
At SMD N 00888000
Ne 40 "N-0000041"
Po 1.905 -2.667
$EndPAD
$PAD
Sh "2" R 0.59944 1.39954 0 0 0
Dr 0 0 0
At SMD N 00888000
Ne 4 "/ACT_SAT_FB"
Po -0.635 2.667
$EndPAD
$PAD
Sh "3" R 0.59944 1.39954 0 0 0
Dr 0 0 0
At SMD N 00888000
Ne 6 "/actinic_switched"
Po 0.635 2.667
$EndPAD
$PAD
Sh "4" R 0.59944 1.39954 0 0 0
Dr 0 0 0
At SMD N 00888000
Ne 22 "GND"
Po 1.905 2.667
$EndPAD
$SHAPE3D
Na "smd/cms_so8.wrl"
Sc 0.5 0.32 0.5
Of 0 0 0
Ro 0 0 0
$EndSHAPE3D
$EndMODULE SO8E
$MODULE SOT23
Po 18.804 137.166 0 15 53724650 00000000 ~~
Li SOT23
Kw SOT23
Sc 0
AR /5182B46F
Op 0 0 0
T0 -1.6062 -0.60414 0.5 0.5 900 0.125 N V 21 N "U106"
T1 0.0635 0 0.5 0.5 0 0.125 N V 21 N "TL431"
DC -1.17602 0.35052 -1.30048 0.44958 0.07874 21
DS 1.27 -0.508 1.27 0.508 0.07874 21
DS -1.3335 -0.508 -1.3335 0.508 0.07874 21
DS 1.27 0.508 -1.3335 0.508 0.07874 21
DS -1.3335 -0.508 1.27 -0.508 0.07874 21
$PAD
Sh "1" R 0.8001 1.00076 0 0 0
Dr 0 0 0
At SMD N 00888000
Ne 16 "AGND"
Po 0 -1.09982
$EndPAD
$PAD
Sh "2" R 0.8001 1.00076 0 0 0
Dr 0 0 0
At SMD N 00888000
Ne 19 "Aref"
Po 0.9525 1.09982
$EndPAD
$PAD
Sh "3" R 0.8001 1.00076 0 0 0
Dr 0 0 0
At SMD N 00888000
Ne 19 "Aref"
Po -0.9525 1.09982
$EndPAD
$SHAPE3D
Na "smd\\SOT23_3.wrl"
Sc 0.4 0.4 0.4
Of 0 0 0
Ro 0 0 180
$EndSHAPE3D
$EndMODULE SOT23
$MODULE SOT23-5
Po 23.376 73.4755 0 15 53110B31 00000000 ~~
Li SOT23-5
Sc 0
AR /5311F474
Op 0 0 0
At SMD
T0 2.19964 -0.29972 0.635 0.635 900 0.127 N V 21 N "U114"
T1 0 0 0.254 0.254 0 0.0635 N V 21 N "TSV911"
DS 1.524 -0.889 1.524 0.889 0.127 21
DS 1.524 0.889 -1.524 0.889 0.127 21
DS -1.524 0.889 -1.524 -0.889 0.127 21
DS -1.524 -0.889 1.524 -0.889 0.127 21
$PAD
Sh "1" R 0.508 0.762 0 0 0
Dr 0 0 0
At SMD N 00888000
Ne 50 "N-0000072"
Po -0.9525 1.27
$EndPAD
$PAD
Sh "3" R 0.508 0.762 0 0 0
Dr 0 0 0
At SMD N 00888000
Ne 32 "Meas intensity"
Po 0.9525 1.27
$EndPAD
$PAD
Sh "5" R 0.508 0.762 0 0 0
Dr 0 0 0
At SMD N 00888000
Ne 46 "N-0000053"
Po -0.9525 -1.27
$EndPAD
$PAD
Sh "2" R 0.508 0.762 0 0 0
Dr 0 0 0
At SMD N 00888000
Ne 23 "GNDA"
Po 0 1.27
$EndPAD
$PAD
Sh "4" R 0.508 0.762 0 0 0
Dr 0 0 0
At SMD N 00888000
Ne 50 "N-0000072"
Po 0.9525 -1.27
$EndPAD
$SHAPE3D
Na "smd/SOT23_5.wrl"
Sc 0.1 0.1 0.1
Of 0 0 0
Ro 0 0 0
$EndSHAPE3D
$EndMODULE SOT23-5
$MODULE SSOP5
Po 31.75 135.89 0 15 5372474C 00000000 ~~
Li SSOP5
Kw SSOP5
Sc 0
AR /53580D2C
Op 0 0 0
At SMD
T0 -0.02032 -0.71882 0.508 0.508 0 0.0508 N V 21 N "U5"
T1 0.4445 -0.32258 0.254 0.254 0 0.0635 N I 21 N "BU4S11G2-TR"
DS -0.9906 0.2286 -0.5842 0.6096 0.15 21
DS 1 0.625 -1 0.625 0.1524 21
DS -1 0.625 -1 -0.625 0.1524 21
DS -1 -0.625 1 -0.625 0.1524 21
DS 1 -0.625 1 0.625 0.1524 21
$PAD
Sh "1" R 0.6 1 0 0 0
Dr 0 0 0
At SMD N 00888000
Ne 54 "N-0000084"
Po -0.95 1.2
$EndPAD
$PAD
Sh "2" R 0.6 1 0 0 0
Dr 0 0 0
At SMD N 00888000
Ne 54 "N-0000084"
Po 0 1.2
$EndPAD
$PAD
Sh "3" R 0.6 1 0 0 0
Dr 0 0 0
At SMD N 00888000
Ne 22 "GND"
Po 0.95 1.2
$EndPAD
$PAD
Sh "4" R 0.6 1 0 0 0
Dr 0 0 0
At SMD N 00888000
Ne 37 "N-0000037"
Po 0.95 -1.2
$EndPAD
$PAD
Sh "5" R 0.6 1 0 0 0
Dr 0 0 0
At SMD N 00888000
Ne 3 "+Vbatt"
Po -0.95 -1.2
$EndPAD
$SHAPE3D
Na "smd/cms_so8.wrl"
Sc 0.25 0.25 0.25
Of 0 0 0
Ro 0 0 0
$EndSHAPE3D
$EndMODULE SSOP5
$MODULE SW_PB_RA
Po 29.49 140.7 0 15 536A6DD5 00000000 ~~
Li SW_PB_RA
Cd http://industrial.panasonic.com/www-cgi/jvcr13pz.cgi?E+PZ+2+ATK0020+0+4+WW
Kw Pshbutton, switch, right angle
Sc 0
AR /5356F232
Op 0 0 0
T0 -1.931 -1.635 0.5 0.5 0 0.125 N V 21 N "SW101"
T1 1.625 -1.635 0.5 0.5 0 0.125 N V 21 N "SW_PUSH"
DS -0.3 1.65 0.35 1.65 0.1 21
DS -0.3 1.65 -0.3 1.85 0.1 21
DS -0.3 1.85 0.35 1.85 0.1 21
DS 0.35 1.85 0.35 1.65 0.1 21
DS -0.85 1.45 -0.85 2.1 0.1 21
DS -0.85 2.1 0.85 2.1 0.1 21
DS 0.85 2.1 0.85 1.45 0.1 21
DS -1.95 -1.45 1.95 -1.45 0.1 21
DS 1.95 -1.45 1.95 1.45 0.1 21
DS 1.95 1.45 -1.95 1.45 0.1 21
DS -1.95 1.45 -1.95 -1.45 0.1 21
$PAD
Sh "1" R 1.4 1.05 0 0 0
Dr 0 0 0
At SMD N 00888000
Ne 36 "N-0000025"
Po -1.8 -0.725
$EndPAD
$PAD
Sh "2" R 1.4 1.05 0 0 0
Dr 0 0 0
At SMD N 00888000
Ne 35 "N-0000024"
Po -1.8 0.725
$EndPAD
$PAD
Sh "1" R 1.4 1.05 0 0 0
Dr 0 0 0
At SMD N 00888000
Ne 36 "N-0000025"
Po 1.8 -0.725
$EndPAD
$PAD
Sh "2" R 1.4 1.05 0 0 0
Dr 0 0 0
At SMD N 00888000
Ne 35 "N-0000024"
Po 1.8 0.725
$EndPAD
$PAD
Sh "" C 0.7 0.7 0 0 0
Dr 0.7 0 0
At HOLE N 00E0FFFF
Ne 0 ""
Po 0 -0.8
$EndPAD
$PAD
Sh "" C 0.7 0.7 0 0 0
Dr 0.7 0 0
At HOLE N 00E0FFFF
Ne 0 ""
Po 0 0.8
$EndPAD
$EndMODULE SW_PB_RA
$MODULE TCS3472-Wide-solderable
Po 16.39824 17.0434 0 15 541070FF 00000000 ~~
Li TCS3472-Wide-solderable
Sc 0
AR /521F87A5
Op 0 0 0
T0 -0.005 1.585 0.889 0.889 0 0.3048 N V 21 N "U110"
T1 0.05 -1.915 0.889 0.889 0 0.22225 N V 21 N "TCS34715FN"
DC 0 0 -0.0127 0.1143 0.15 21
DC -1.0033 -1.1938 -1.1049 -1.2954 0.15 21
T2 0.0127 0.2921 0.127 0.127 0 0.02 N V 21 N "foto"
DS 0 -1.2 1 -1.2 0.005 21
DS 1 -1.2 1 1.2 0.005 21
DS 1 1.2 -1 1.2 0.005 21
DS -1 1.2 -1 -1.2 0.005 21
DS -1 -1.2 0 -1.2 0.005 21
DS 0 -0.205 0.25 -0.205 0.01 21
DS 0.25 -0.205 0.25 0.2 0.01 21
DS 0.25 0.2 -0.245 0.2 0.01 21
DS -0.245 0.2 -0.245 -0.205 0.01 21
DS -0.245 -0.205 0 -0.205 0.01 21
DS 0 0 0 -0.025 0.005 21
DS 0 -0.025 0 0.025 0.005 21
DS 0 0.025 0 0 0.005 21
DS 0 0 -0.025 0 0.005 21
DS -0.025 0 0 0 0.005 21
DS 0 0 0.025 0 0.005 21
DS 0.025 0 0 0 0.005 21
T2 -0.005 2.17 0.127 1.524 0 0.03175 N V 21 N "+"
$PAD
Sh "2" R 1 0.4 0 0 -0
Dr 0 0 0
At SMD N 00888000
Ne 61 "SCL"
Po -0.8 0
$EndPAD
$PAD
Sh "5" R 1 0.4 0 0 -0
Dr 0 0 0
At SMD N 00888000
Ne 0 ""
Po 0.8 0
$EndPAD
$PAD
Sh "3" R 1 0.4 0 0 -0
Dr 0 0 0
At SMD N 00888000
Ne 22 "GND"
Po -0.8 0.65
$EndPAD
$PAD
Sh "1" R 1 0.4 0 0 -0
Dr 0 0 0
At SMD N 00888000
Ne 13 "3.3Vdd"
Po -0.8 -0.65
$EndPAD
$PAD
Sh "6" R 1 0.4 0 0 -0
Dr 0 0 0
At SMD N 00888000
Ne 62 "SDA"
Po 0.8 -0.65
$EndPAD
$PAD
Sh "4" R 1 0.4 0 0 -0
Dr 0 0 0
At SMD N 00888000
Ne 0 ""
Po 0.8 0.65
$EndPAD
$EndMODULE TCS3472-Wide-solderable
$MODULE WCSP-8_2
Po 17.125 29.675 0 15 535E5B1E 00000000 ~~
Li WCSP-8_2
Kw yzf, WCSP-8, tmp006
Sc 0
AR /522F8928
Op 0 0 0
At SMD
T0 -0.0254 -0.9144 0.2 0.2 0 0.02 N V 21 N "U113"
T1 0.0254 0.9652 0.2 0.2 0 0.02 N V 21 N "TMP006"
DS -0.7874 -0.7874 0.7874 -0.7874 0.02 21
DS 0.7874 -0.7874 0.7874 0.7874 0.02 21
DS 0.7874 0.7874 -0.7874 0.7874 0.02 21
DS -0.7874 0.7874 -0.7874 -0.7874 0.02 21
$PAD
Sh "a1" C 0.3 0.3 0 0 0
Dr 0 0 0
At SMD N 00888000
Ne 22 "GND"
Po -0.5 -0.5
$EndPAD
$PAD
Sh "a2" C 0.3 0.3 0 0 0
Dr 0 0 0
At SMD N 00888000
Ne 22 "GND"
Po 0 -0.5
$EndPAD
$PAD
Sh "a3" C 0.3 0.3 0 0 0
Dr 0 0 0
At SMD N 00888000
Ne 13 "3.3Vdd"
Po 0.5 -0.5
.LocalClearance 0.2
$EndPAD
$PAD
Sh "b3" C 0.3 0.3 0 0 0
Dr 0 0 0
At SMD N 00888000
Ne 61 "SCL"
Po 0.5 0
$EndPAD
$PAD
Sh "c3" C 0.3 0.3 0 0 0
Dr 0 0 0
At SMD N 00888000
Ne 62 "SDA"
Po 0.5 0.5
$EndPAD
$PAD
Sh "c2" C 0.3 0.3 0 0 0
Dr 0 0 0
At SMD N 00888000
Ne 33 "N-0000017"
Po 0 0.5
$EndPAD
$PAD
Sh "c1" C 0.3 0.3 0 0 0
Dr 0 0 0
At SMD N 00888000
Ne 62 "SDA"
Po -0.5 0.5
$EndPAD
$PAD
Sh "b1" C 0.3 0.3 0 0 0
Dr 0 0 0
At SMD N 00888000
Ne 22 "GND"
Po -0.5 0
$EndPAD
$PAD
Sh "a2" R 0.381 0.381 0 0 0
Dr 0 0 0
At SMD N 00008000
Ne 22 "GND"
Po 0 0
$EndPAD
$EndMODULE WCSP-8_2
$MODULE sc70-6
Po 39.705 74.922 0 15 490474FF 00000000 ~~
Li sc70-6
Cd SC70-6
Sc 0
AR /51CCBF2F
Op 0 0 0
At SMD
T0 0 -0.2794 0.29972 0.29972 0 0.06096 N V 21 N "U108"
T1 0 0.3556 0.29972 0.29972 0 0.06096 N I 21 N "DG4157"
DS 0 -0.6477 0 -1.2065 0.127 21
DS -0.4445 0.6477 -1.1049 -0.0127 0.127 21
DS -0.5969 0.6477 -1.1049 0.1524 0.127 21
DS 0.6477 -0.6477 0.6477 -1.2065 0.127 21
DS -0.6477 -0.6477 -0.6477 -1.2065 0.127 21
DS 0 0.6477 0 1.2065 0.127 21
DS 0.6477 0.6477 0.6477 1.2065 0.127 21
DS -0.6477 0.6477 -0.6477 1.2065 0.127 21
DS -1.1049 -0.6477 1.1049 -0.6477 0.127 21
DS 1.1049 -0.6477 1.1049 0.6477 0.127 21
DS 1.1049 0.6477 -1.1049 0.6477 0.127 21
DS -1.1049 0.6477 -1.1049 -0.6477 0.127 21
$PAD
Sh "1" R 0.4064 0.6604 0 0 0
Dr 0 0 0
At SMD N 00888000
Ne 70 "preselected ACT"
Po -0.6604 1.016
$EndPAD
$PAD
Sh "3" R 0.4064 0.6604 0 0 0
Dr 0 0 0
At SMD N 00888000
Ne 22 "GND"
Po 0.6604 1.016
$EndPAD
$PAD
Sh "2" R 0.4064 0.6604 0 0 0
Dr 0 0 0
At SMD N 00888000
Ne 22 "GND"
Po 0 1.016
$EndPAD
$PAD
Sh "4" R 0.4064 0.6604 0 0 0
Dr 0 0 0
At SMD N 00888000
Ne 6 "/actinic_switched"
Po 0.6604 -1.016
$EndPAD
$PAD
Sh "6" R 0.4064 0.6604 0 0 0
Dr 0 0 0
At SMD N 00888000
Ne 72 "toggle act ON/OFF"
Po -0.6604 -1.016
$EndPAD
$PAD
Sh "5" R 0.4064 0.6604 0 0 0
Dr 0 0 0
At SMD N 00888000
Ne 5 "/ACT_comm"
Po 0 -1.016
$EndPAD
$SHAPE3D
Na "smd/smd_transistors/sc70-6.wrl"
Sc 1 1 1
Of 0 0 0
Ro 0 0 0
$EndSHAPE3D
$EndMODULE sc70-6
$MODULE sfh-4045-940nm-LED
Po 17.2593 19.62658 0 15 5405D925 00000000 ~~
Li sfh-4045-940nm-LED
Cd Philips Lumileds Luxeon Z
Kw Luxeon Z
Sc 0
AR /5182DAF2
Op 0 0 0
T0 0.00254 -0.45466 0.2 0.2 0 0.05 N V 21 N "D102"
T1 0.00254 0.8255 0.2 0.2 0 0.05 N V 21 N "IRCALA"
DC 0 0 0.52 0.44 0.02 21
DS 1.6 0.85 -1.6 0.84 0.02 21
DS -1.6 -0.87 1.6 -0.86 0.02 21
DS 1.6 -0.85 1.6 0.85 0.02 21
DS -1.6 0.84 -1.6 -0.86 0.02 21
$PAD
Sh "2" R 1.4 1.7 0 0 0
Dr 0 0 0
At SMD N 00888000
Ne 7 "/cal-"
Po -1.4 0
$EndPAD
$PAD
Sh "1" R 1.4 1.7 0 0 0
Dr 0 0 0
At SMD N 00888000
Ne 8 "/calibration_LED"
Po 1.4 0
$EndPAD
$SHAPE3D
Na "walter\\smd_leds\\luxeon_m.wrl"
Sc 1 1 1
Of 0 0 0
Ro 0 0 0
$EndSHAPE3D
$EndMODULE sfh-4045-940nm-LED
$MODULE sod323
Po 33.9678 22.41134 0 15 511019A4 00000000 ~~
Li sod323
Cd SOD323
Sc 0
AR /531150B3
Op 0 0 0
T0 0 -1.09982 0.39878 0.39878 0 0.09906 N V 21 N "D106"
T1 0 1.19888 0.39878 0.39878 0 0.09906 N I 21 N "DIODE"
DS 0.8001 -0.70104 0.8001 0.70104 0.127 21
DS 0.70104 0.70104 0.70104 -0.70104 0.127 21
DS 0.59944 -0.70104 0.59944 0.70104 0.127 21
DS 0.50038 -0.70104 0.50038 0.70104 0.127 21
DS 0.89916 -0.70104 -0.89916 -0.70104 0.127 21
DS -0.89916 -0.70104 -0.89916 0.70104 0.127 21
DS -0.89916 0.70104 0.89916 0.70104 0.127 21
DS 0.89916 0.70104 0.89916 -0.70104 0.127 21
$PAD
Sh "2" R 1.00076 0.59944 0 0 0
Dr 0 0 0
At SMD N 00888000
Ne 49 "N-0000062"
Po 1.09982 0
$EndPAD
$PAD
Sh "1" R 1.00076 0.59944 0 0 0
Dr 0 0 0
At SMD N 00888000
Ne 52 "N-0000077"
Po -1.09982 0
$EndPAD
$SHAPE3D
Na "walter\\smd_diode\\sod323.wrl"
Sc 1 1 1
Of 0 0 0
Ro 0 0 0
$EndSHAPE3D
$EndMODULE sod323
$MODULE sot23
Po 34.3154 139.2428 0 15 53724766 00000000 ~~
Li sot23
Cd SOT23
Sc 0
AR /5361317B
Op 0 0 0
At SMD
T0 -0.98552 -0.91186 0.50038 0.50038 900 0.09906 N V 21 N "Q105"
T1 0.254 -0.20066 0.50038 0.50038 900 0.09906 N I 21 N "NPN_BCE"
DS 0.9525 0.6985 0.9525 1.3589 0.127 21
DS -0.9525 0.6985 -0.9525 1.3589 0.127 21
DS 0 -0.6985 0 -1.3589 0.127 21
DS -1.4986 -0.6985 1.4986 -0.6985 0.127 21
DS 1.4986 -0.6985 1.4986 0.6985 0.127 21
DS 1.4986 0.6985 -1.4986 0.6985 0.127 21
DS -1.4986 0.6985 -1.4986 -0.6985 0.127 21
$PAD
Sh "1" R 0.59944 1.00076 0 0 0
Dr 0 0 0
At SMD N 00888000
Ne 38 "N-0000038"
Po -0.9525 1.05664
$EndPAD
$PAD
Sh "2" R 0.59944 1.00076 0 0 0
Dr 0 0 0
At SMD N 00888000
Ne 55 "N-0000087"
Po 0 -1.05664
$EndPAD
$PAD
Sh "3" R 0.59944 1.00076 0 0 0
Dr 0 0 0
At SMD N 00888000
Ne 22 "GND"
Po 0.9525 1.05664
$EndPAD
$SHAPE3D
Na "smd/smd_transistors/sot23.wrl"
Sc 1 1 1
Of 0 0 0
Ro 0 0 0
$EndSHAPE3D
$EndMODULE sot23
$MODULE sot23-6
Po 38.4255 17.17132 0 15 490475C6 00000000 ~~
Li sot23-6
Cd SOT23-6
Sc 0
AR /531150E9
Op 0 0 0
T0 0 -1.9812 0.50038 0.50038 0 0.09906 N V 21 N "U116"
T1 0 0 0.50038 0.50038 0 0.09906 N I 21 N "SPST"
DS -0.8509 0.6985 -1.4986 0.0508 0.127 21
DS -1.0033 0.6985 -1.4986 0.2032 0.127 21
DS 0 -0.6985 0 -1.3589 0.127 21
DS 0.9525 -0.6985 0.9525 -1.3589 0.127 21
DS -0.9525 -0.6985 -0.9525 -1.3589 0.127 21
DS 0 0.6985 0 1.3589 0.127 21
DS 0.9525 0.6985 0.9525 1.3589 0.127 21
DS -0.9525 0.6985 -0.9525 1.3589 0.127 21
DS -1.4986 -0.6985 1.4986 -0.6985 0.127 21
DS 1.4986 -0.6985 1.4986 0.6985 0.127 21
DS 1.4986 0.6985 -1.4986 0.6985 0.127 21
DS -1.4986 0.6985 -1.4986 -0.6985 0.127 21
$PAD
Sh "1" R 0.59944 1.00076 0 0 0
Dr 0 0 0
At SMD N 00888000
Ne 52 "N-0000077"
Po -0.9525 1.05664
$EndPAD
$PAD
Sh "3" R 0.59944 1.00076 0 0 0
Dr 0 0 0
At SMD N 00888000
Ne 16 "AGND"
Po 0.9525 1.05664
$EndPAD
$PAD
Sh "2" R 0.59944 1.00076 0 0 0
Dr 0 0 0
At SMD N 00888000
Ne 12 "/signal"
Po 0 1.05664
$EndPAD
$PAD
Sh "4" R 0.59944 1.00076 0 0 0
Dr 0 0 0
At SMD N 00888000
Ne 24 "HOLD"
Po 0.9525 -1.05664
$EndPAD
$PAD
Sh "6" R 0.59944 1.00076 0 0 0
Dr 0 0 0
At SMD N 00888000
Ne 21 "DetVcc"
Po -0.9525 -1.05664
$EndPAD
$PAD
Sh "5" R 0.59944 1.00076 0 0 0
Dr 0 0 0
At SMD N 00888000
Ne 0 ""
Po 0 -1.05664
$EndPAD
$SHAPE3D
Na "walter\\smd_trans\\sot23-6.wrl"
Sc 1 1 1
Of 0 0 0
Ro 0 0 0
$EndSHAPE3D
$EndMODULE sot23-6
$EndLIBRARY
