(module ssop-16 (layer F.Cu) (tedit 49E9DD72)
  (descr SSOP-16)
  (fp_text reference SSOP-16 (at 0 0.508) (layer F.SilkS)
    (effects (font (size 0.50038 0.50038) (thickness 0.09906)))
  )
  (fp_text value U*** (at 0 -1.143) (layer F.SilkS)
    (effects (font (size 0.50038 0.50038) (thickness 0.09906)))
  )
  (fp_line (start -2.4765 1.9685) (end 2.4765 1.9685) (layer F.SilkS) (width 0.127))
  (fp_line (start 2.4765 1.9685) (end 2.4765 -1.9685) (layer F.SilkS) (width 0.127))
  (fp_line (start 2.4765 -1.9685) (end -2.4765 -1.9685) (layer F.SilkS) (width 0.127))
  (fp_line (start -2.4765 -1.9685) (end -2.4765 1.9685) (layer F.SilkS) (width 0.127))
  (fp_circle (center -1.8415 1.3335) (end -1.9685 1.5875) (layer F.SilkS) (width 0.127))
  (pad 4 smd rect (at -0.3175 2.667) (size 0.4064 1.651) (layers F.Cu F.Paste F.Mask))
  (pad 5 smd rect (at 0.3175 2.667) (size 0.4064 1.651) (layers F.Cu F.Paste F.Mask))
  (pad 6 smd rect (at 0.9525 2.667) (size 0.4064 1.651) (layers F.Cu F.Paste F.Mask))
  (pad 7 smd rect (at 1.5875 2.667) (size 0.4064 1.651) (layers F.Cu F.Paste F.Mask))
  (pad 16 smd rect (at -2.2225 -2.667) (size 0.4064 1.651) (layers F.Cu F.Paste F.Mask))
  (pad 1 smd rect (at -2.2225 2.667) (size 0.4064 1.651) (layers F.Cu F.Paste F.Mask))
  (pad 2 smd rect (at -1.5875 2.667) (size 0.4064 1.651) (layers F.Cu F.Paste F.Mask))
  (pad 3 smd rect (at -0.9525 2.667) (size 0.4064 1.651) (layers F.Cu F.Paste F.Mask))
  (pad 9 smd rect (at 2.2225 -2.667) (size 0.4064 1.651) (layers F.Cu F.Paste F.Mask))
  (pad 10 smd rect (at 1.5875 -2.667) (size 0.4064 1.651) (layers F.Cu F.Paste F.Mask))
  (pad 11 smd rect (at 0.9525 -2.667) (size 0.4064 1.651) (layers F.Cu F.Paste F.Mask))
  (pad 12 smd rect (at 0.3175 -2.667) (size 0.4064 1.651) (layers F.Cu F.Paste F.Mask))
  (pad 13 smd rect (at -0.3175 -2.667) (size 0.4064 1.651) (layers F.Cu F.Paste F.Mask))
  (pad 14 smd rect (at -0.9525 -2.667) (size 0.4064 1.651) (layers F.Cu F.Paste F.Mask))
  (pad 8 smd rect (at 2.2225 2.667) (size 0.4064 1.651) (layers F.Cu F.Paste F.Mask))
  (pad 15 smd rect (at -1.5875 -2.667) (size 0.4064 1.651) (layers F.Cu F.Paste F.Mask))
  (model walter\smd_dil\ssop-16.wrl
    (at (xyz 0 0 0))
    (scale (xyz 1 1 1))
    (rotate (xyz 0 0 0))
  )
)
