M48
;DRILL file {KiCad no-vcs-found-7d24a57~61~ubuntu16.04.1} date Tue Jan  9 09:36:38 2018
;FORMAT={-:-/ absolute / inch / decimal}
FMAT,2
INCH,TZ
T1C0.030
T2C0.047
%
G90
G05
M72
T1
X3.1657Y-5.5887
X3.272Y-5.5887
T2
X3.2227Y-3.7881
X3.2227Y-4.1818
X3.3212Y-3.7881
X3.3212Y-4.1818
X3.518Y-3.985
T0
M30
