(kicad_pcb (version 4) (host pcbnew "(2015-08-27 BZR 6130, Git 51a6d38)-product")

  (general
    (links 53)
    (no_connects 0)
    (area 119.0244 89.949999 185.064401 127.508001)
    (thickness 1.6)
    (drawings 19)
    (tracks 221)
    (zones 0)
    (modules 19)
    (nets 19)
  )

  (page A4)
  (layers
    (0 F.Cu signal)
    (31 B.Cu signal)
    (32 B.Adhes user hide)
    (33 F.Adhes user hide)
    (34 B.Paste user hide)
    (35 F.Paste user hide)
    (36 B.SilkS user hide)
    (37 F.SilkS user)
    (38 B.Mask user hide)
    (39 F.Mask user hide)
    (40 Dwgs.User user hide)
    (41 Cmts.User user hide)
    (42 Eco1.User user hide)
    (43 Eco2.User user hide)
    (44 Edge.Cuts user)
    (45 Margin user hide)
    (46 B.CrtYd user hide)
    (47 F.CrtYd user hide)
    (48 B.Fab user hide)
    (49 F.Fab user hide)
  )

  (setup
    (last_trace_width 0.25)
    (user_trace_width 0.5)
    (trace_clearance 0.2)
    (zone_clearance 0.508)
    (zone_45_only no)
    (trace_min 0.2)
    (segment_width 0.2)
    (edge_width 0.1)
    (via_size 0.6)
    (via_drill 0.4)
    (via_min_size 0.4)
    (via_min_drill 0.3)
    (uvia_size 0.3)
    (uvia_drill 0.1)
    (uvias_allowed no)
    (uvia_min_size 0.2)
    (uvia_min_drill 0.1)
    (pcb_text_width 0.3)
    (pcb_text_size 1.5 1.5)
    (mod_edge_width 0.15)
    (mod_text_size 1 1)
    (mod_text_width 0.15)
    (pad_size 1.5 1.5)
    (pad_drill 0.6)
    (pad_to_mask_clearance 0)
    (aux_axis_origin 0 0)
    (visible_elements 7FFFF7FF)
    (pcbplotparams
      (layerselection 0x010e0_80000001)
      (usegerberextensions true)
      (usegerberattributes true)
      (excludeedgelayer true)
      (linewidth 0.100000)
      (plotframeref false)
      (viasonmask false)
      (mode 1)
      (useauxorigin false)
      (hpglpennumber 1)
      (hpglpenspeed 20)
      (hpglpendiameter 15)
      (hpglpenoverlay 2)
      (psnegative false)
      (psa4output false)
      (plotreference true)
      (plotvalue true)
      (plotinvisibletext false)
      (padsonsilk false)
      (subtractmaskfromsilk true)
      (outputformat 1)
      (mirror false)
      (drillshape 0)
      (scaleselection 1)
      (outputdirectory Gerbers/))
  )

  (net 0 "")
  (net 1 +5V)
  (net 2 GND)
  (net 3 "Net-(C2-Pad1)")
  (net 4 "Net-(C2-Pad2)")
  (net 5 "Net-(C3-Pad1)")
  (net 6 "Net-(C7-Pad1)")
  (net 7 "Net-(C8-Pad1)")
  (net 8 "Net-(C10-Pad1)")
  (net 9 "Net-(D1-Pad1)")
  (net 10 "Net-(P6-Pad1)")
  (net 11 "Net-(P6-Pad3)")
  (net 12 "Net-(P6-Pad5)")
  (net 13 "Net-(P6-Pad7)")
  (net 14 "Net-(C3-Pad2)")
  (net 15 -10V)
  (net 16 "Net-(P5-Pad1)")
  (net 17 S1)
  (net 18 S2)

  (net_class Default "This is the default net class."
    (clearance 0.2)
    (trace_width 0.25)
    (via_dia 0.6)
    (via_drill 0.4)
    (uvia_dia 0.3)
    (uvia_drill 0.1)
    (add_net +5V)
    (add_net -10V)
    (add_net GND)
    (add_net "Net-(C10-Pad1)")
    (add_net "Net-(C2-Pad1)")
    (add_net "Net-(C2-Pad2)")
    (add_net "Net-(C3-Pad1)")
    (add_net "Net-(C3-Pad2)")
    (add_net "Net-(C7-Pad1)")
    (add_net "Net-(C8-Pad1)")
    (add_net "Net-(D1-Pad1)")
    (add_net "Net-(P5-Pad1)")
    (add_net "Net-(P6-Pad1)")
    (add_net "Net-(P6-Pad3)")
    (add_net "Net-(P6-Pad5)")
    (add_net "Net-(P6-Pad7)")
    (add_net S1)
    (add_net S2)
  )

  (net_class POWER ""
    (clearance 0.2)
    (trace_width 0.5)
    (via_dia 0.6)
    (via_drill 0.4)
    (uvia_dia 0.3)
    (uvia_drill 0.1)
  )

  (module Capacitors_SMD:C_0805_HandSoldering (layer F.Cu) (tedit 562007C6) (tstamp 5615ABF1)
    (at 144.0942 101.5492 180)
    (descr "Capacitor SMD 0805, hand soldering")
    (tags "capacitor 0805")
    (path /56157DBD)
    (attr smd)
    (fp_text reference C2 (at 3.683 -0.127 180) (layer F.SilkS)
      (effects (font (size 1 1) (thickness 0.15)))
    )
    (fp_text value 50n (at 0.6731 -1.2319 180) (layer F.Fab) hide
      (effects (font (size 1 1) (thickness 0.15)))
    )
    (fp_line (start -2.3 -1) (end 2.3 -1) (layer F.CrtYd) (width 0.05))
    (fp_line (start -2.3 1) (end 2.3 1) (layer F.CrtYd) (width 0.05))
    (fp_line (start -2.3 -1) (end -2.3 1) (layer F.CrtYd) (width 0.05))
    (fp_line (start 2.3 -1) (end 2.3 1) (layer F.CrtYd) (width 0.05))
    (fp_line (start 0.5 -0.85) (end -0.5 -0.85) (layer F.SilkS) (width 0.15))
    (fp_line (start -0.5 0.85) (end 0.5 0.85) (layer F.SilkS) (width 0.15))
    (pad 1 smd rect (at -1.25 0 180) (size 1.5 1.25) (layers F.Cu F.Paste F.Mask)
      (net 3 "Net-(C2-Pad1)"))
    (pad 2 smd rect (at 1.25 0 180) (size 1.5 1.25) (layers F.Cu F.Paste F.Mask)
      (net 4 "Net-(C2-Pad2)"))
    (model Capacitors_SMD.3dshapes/C_0805_HandSoldering.wrl
      (at (xyz 0 0 0))
      (scale (xyz 1 1 1))
      (rotate (xyz 0 0 0))
    )
  )

  (module Capacitors_SMD:C_0805_HandSoldering (layer F.Cu) (tedit 561F26F2) (tstamp 5615ABFD)
    (at 151.0157 109.2835 180)
    (descr "Capacitor SMD 0805, hand soldering")
    (tags "capacitor 0805")
    (path /561846D2)
    (attr smd)
    (fp_text reference C3 (at 0 -2.032 180) (layer F.SilkS)
      (effects (font (size 1 1) (thickness 0.15)))
    )
    (fp_text value 1n (at -2.032 2.159 180) (layer F.Fab) hide
      (effects (font (size 1 1) (thickness 0.15)))
    )
    (fp_line (start -2.3 -1) (end 2.3 -1) (layer F.CrtYd) (width 0.05))
    (fp_line (start -2.3 1) (end 2.3 1) (layer F.CrtYd) (width 0.05))
    (fp_line (start -2.3 -1) (end -2.3 1) (layer F.CrtYd) (width 0.05))
    (fp_line (start 2.3 -1) (end 2.3 1) (layer F.CrtYd) (width 0.05))
    (fp_line (start 0.5 -0.85) (end -0.5 -0.85) (layer F.SilkS) (width 0.15))
    (fp_line (start -0.5 0.85) (end 0.5 0.85) (layer F.SilkS) (width 0.15))
    (pad 1 smd rect (at -1.25 0 180) (size 1.5 1.25) (layers F.Cu F.Paste F.Mask)
      (net 5 "Net-(C3-Pad1)"))
    (pad 2 smd rect (at 1.25 0 180) (size 1.5 1.25) (layers F.Cu F.Paste F.Mask)
      (net 14 "Net-(C3-Pad2)"))
    (model Capacitors_SMD.3dshapes/C_0805_HandSoldering.wrl
      (at (xyz 0 0 0))
      (scale (xyz 1 1 1))
      (rotate (xyz 0 0 0))
    )
  )

  (module Capacitors_SMD:C_0805_HandSoldering (layer F.Cu) (tedit 561F271F) (tstamp 5615AC09)
    (at 155.8798 100.4824 270)
    (descr "Capacitor SMD 0805, hand soldering")
    (tags "capacitor 0805")
    (path /56157DBB)
    (attr smd)
    (fp_text reference C4 (at 0.127 -1.905 270) (layer F.SilkS)
      (effects (font (size 1 1) (thickness 0.15)))
    )
    (fp_text value 10u (at 0 2.1 270) (layer F.Fab) hide
      (effects (font (size 1 1) (thickness 0.15)))
    )
    (fp_line (start -2.3 -1) (end 2.3 -1) (layer F.CrtYd) (width 0.05))
    (fp_line (start -2.3 1) (end 2.3 1) (layer F.CrtYd) (width 0.05))
    (fp_line (start -2.3 -1) (end -2.3 1) (layer F.CrtYd) (width 0.05))
    (fp_line (start 2.3 -1) (end 2.3 1) (layer F.CrtYd) (width 0.05))
    (fp_line (start 0.5 -0.85) (end -0.5 -0.85) (layer F.SilkS) (width 0.15))
    (fp_line (start -0.5 0.85) (end 0.5 0.85) (layer F.SilkS) (width 0.15))
    (pad 1 smd rect (at -1.25 0 270) (size 1.5 1.25) (layers F.Cu F.Paste F.Mask)
      (net 1 +5V))
    (pad 2 smd rect (at 1.25 0 270) (size 1.5 1.25) (layers F.Cu F.Paste F.Mask)
      (net 2 GND))
    (model Capacitors_SMD.3dshapes/C_0805_HandSoldering.wrl
      (at (xyz 0 0 0))
      (scale (xyz 1 1 1))
      (rotate (xyz 0 0 0))
    )
  )

  (module Capacitors_SMD:C_0805_HandSoldering (layer F.Cu) (tedit 561F2701) (tstamp 5615AC15)
    (at 156.5402 107.2261 90)
    (descr "Capacitor SMD 0805, hand soldering")
    (tags "capacitor 0805")
    (path /56157DBC)
    (attr smd)
    (fp_text reference C5 (at -1.27 1.778 90) (layer F.SilkS)
      (effects (font (size 1 1) (thickness 0.15)))
    )
    (fp_text value 10u (at 0 2.1 90) (layer F.Fab) hide
      (effects (font (size 1 1) (thickness 0.15)))
    )
    (fp_line (start -2.3 -1) (end 2.3 -1) (layer F.CrtYd) (width 0.05))
    (fp_line (start -2.3 1) (end 2.3 1) (layer F.CrtYd) (width 0.05))
    (fp_line (start -2.3 -1) (end -2.3 1) (layer F.CrtYd) (width 0.05))
    (fp_line (start 2.3 -1) (end 2.3 1) (layer F.CrtYd) (width 0.05))
    (fp_line (start 0.5 -0.85) (end -0.5 -0.85) (layer F.SilkS) (width 0.15))
    (fp_line (start -0.5 0.85) (end 0.5 0.85) (layer F.SilkS) (width 0.15))
    (pad 1 smd rect (at -1.25 0 90) (size 1.5 1.25) (layers F.Cu F.Paste F.Mask)
      (net 2 GND))
    (pad 2 smd rect (at 1.25 0 90) (size 1.5 1.25) (layers F.Cu F.Paste F.Mask)
      (net 15 -10V))
    (model Capacitors_SMD.3dshapes/C_0805_HandSoldering.wrl
      (at (xyz 0 0 0))
      (scale (xyz 1 1 1))
      (rotate (xyz 0 0 0))
    )
  )

  (module Capacitors_SMD:C_0805_HandSoldering (layer F.Cu) (tedit 5615C9BC) (tstamp 5615AC2D)
    (at 167.5384 107.95 270)
    (descr "Capacitor SMD 0805, hand soldering")
    (tags "capacitor 0805")
    (path /56157DC3)
    (attr smd)
    (fp_text reference C7 (at 3.556 0 270) (layer F.SilkS)
      (effects (font (size 1 1) (thickness 0.15)))
    )
    (fp_text value 10u (at 0 2.1 270) (layer F.Fab) hide
      (effects (font (size 1 1) (thickness 0.15)))
    )
    (fp_line (start -2.3 -1) (end 2.3 -1) (layer F.CrtYd) (width 0.05))
    (fp_line (start -2.3 1) (end 2.3 1) (layer F.CrtYd) (width 0.05))
    (fp_line (start -2.3 -1) (end -2.3 1) (layer F.CrtYd) (width 0.05))
    (fp_line (start 2.3 -1) (end 2.3 1) (layer F.CrtYd) (width 0.05))
    (fp_line (start 0.5 -0.85) (end -0.5 -0.85) (layer F.SilkS) (width 0.15))
    (fp_line (start -0.5 0.85) (end 0.5 0.85) (layer F.SilkS) (width 0.15))
    (pad 1 smd rect (at -1.25 0 270) (size 1.5 1.25) (layers F.Cu F.Paste F.Mask)
      (net 6 "Net-(C7-Pad1)"))
    (pad 2 smd rect (at 1.25 0 270) (size 1.5 1.25) (layers F.Cu F.Paste F.Mask)
      (net 2 GND))
    (model Capacitors_SMD.3dshapes/C_0805_HandSoldering.wrl
      (at (xyz 0 0 0))
      (scale (xyz 1 1 1))
      (rotate (xyz 0 0 0))
    )
  )

  (module Capacitors_SMD:C_0805_HandSoldering (layer F.Cu) (tedit 5615BAC8) (tstamp 5615AC39)
    (at 170.0784 107.95 270)
    (descr "Capacitor SMD 0805, hand soldering")
    (tags "capacitor 0805")
    (path /56157DC7)
    (attr smd)
    (fp_text reference C8 (at 0 -2.1 270) (layer F.SilkS)
      (effects (font (size 1 1) (thickness 0.15)))
    )
    (fp_text value 100n (at 0 2.1 270) (layer F.Fab) hide
      (effects (font (size 1 1) (thickness 0.15)))
    )
    (fp_line (start -2.3 -1) (end 2.3 -1) (layer F.CrtYd) (width 0.05))
    (fp_line (start -2.3 1) (end 2.3 1) (layer F.CrtYd) (width 0.05))
    (fp_line (start -2.3 -1) (end -2.3 1) (layer F.CrtYd) (width 0.05))
    (fp_line (start 2.3 -1) (end 2.3 1) (layer F.CrtYd) (width 0.05))
    (fp_line (start 0.5 -0.85) (end -0.5 -0.85) (layer F.SilkS) (width 0.15))
    (fp_line (start -0.5 0.85) (end 0.5 0.85) (layer F.SilkS) (width 0.15))
    (pad 1 smd rect (at -1.25 0 270) (size 1.5 1.25) (layers F.Cu F.Paste F.Mask)
      (net 7 "Net-(C8-Pad1)"))
    (pad 2 smd rect (at 1.25 0 270) (size 1.5 1.25) (layers F.Cu F.Paste F.Mask)
      (net 2 GND))
    (model Capacitors_SMD.3dshapes/C_0805_HandSoldering.wrl
      (at (xyz 0 0 0))
      (scale (xyz 1 1 1))
      (rotate (xyz 0 0 0))
    )
  )

  (module Capacitors_SMD:C_0805_HandSoldering (layer F.Cu) (tedit 5615C9AF) (tstamp 5615AC45)
    (at 164.9984 107.061 270)
    (descr "Capacitor SMD 0805, hand soldering")
    (tags "capacitor 0805")
    (path /56157DC5)
    (attr smd)
    (fp_text reference C9 (at -0.127 1.905 270) (layer F.SilkS)
      (effects (font (size 1 1) (thickness 0.15)))
    )
    (fp_text value 10u (at 0 2.1 270) (layer F.Fab) hide
      (effects (font (size 1 1) (thickness 0.15)))
    )
    (fp_line (start -2.3 -1) (end 2.3 -1) (layer F.CrtYd) (width 0.05))
    (fp_line (start -2.3 1) (end 2.3 1) (layer F.CrtYd) (width 0.05))
    (fp_line (start -2.3 -1) (end -2.3 1) (layer F.CrtYd) (width 0.05))
    (fp_line (start 2.3 -1) (end 2.3 1) (layer F.CrtYd) (width 0.05))
    (fp_line (start 0.5 -0.85) (end -0.5 -0.85) (layer F.SilkS) (width 0.15))
    (fp_line (start -0.5 0.85) (end 0.5 0.85) (layer F.SilkS) (width 0.15))
    (pad 1 smd rect (at -1.25 0 270) (size 1.5 1.25) (layers F.Cu F.Paste F.Mask)
      (net 1 +5V))
    (pad 2 smd rect (at 1.25 0 270) (size 1.5 1.25) (layers F.Cu F.Paste F.Mask)
      (net 2 GND))
    (model Capacitors_SMD.3dshapes/C_0805_HandSoldering.wrl
      (at (xyz 0 0 0))
      (scale (xyz 1 1 1))
      (rotate (xyz 0 0 0))
    )
  )

  (module Capacitors_SMD:C_0805_HandSoldering (layer F.Cu) (tedit 561F221C) (tstamp 5615AC51)
    (at 165.7604 97.028 90)
    (descr "Capacitor SMD 0805, hand soldering")
    (tags "capacitor 0805")
    (path /56157DCC)
    (attr smd)
    (fp_text reference C10 (at -0.254 2.159 90) (layer F.SilkS)
      (effects (font (size 1 1) (thickness 0.15)))
    )
    (fp_text value 10u (at 3.175 -2.159 90) (layer F.Fab) hide
      (effects (font (size 1 1) (thickness 0.15)))
    )
    (fp_line (start -2.3 -1) (end 2.3 -1) (layer F.CrtYd) (width 0.05))
    (fp_line (start -2.3 1) (end 2.3 1) (layer F.CrtYd) (width 0.05))
    (fp_line (start -2.3 -1) (end -2.3 1) (layer F.CrtYd) (width 0.05))
    (fp_line (start 2.3 -1) (end 2.3 1) (layer F.CrtYd) (width 0.05))
    (fp_line (start 0.5 -0.85) (end -0.5 -0.85) (layer F.SilkS) (width 0.15))
    (fp_line (start -0.5 0.85) (end 0.5 0.85) (layer F.SilkS) (width 0.15))
    (pad 1 smd rect (at -1.25 0 90) (size 1.5 1.25) (layers F.Cu F.Paste F.Mask)
      (net 8 "Net-(C10-Pad1)"))
    (pad 2 smd rect (at 1.25 0 90) (size 1.5 1.25) (layers F.Cu F.Paste F.Mask)
      (net 2 GND))
    (model Capacitors_SMD.3dshapes/C_0805_HandSoldering.wrl
      (at (xyz 0 0 0))
      (scale (xyz 1 1 1))
      (rotate (xyz 0 0 0))
    )
  )

  (module "Handheld board:Pin_diode_SIP_down" (layer F.Cu) (tedit 562007D2) (tstamp 5615AC62)
    (at 132.6896 104.1908 90)
    (descr "Pin photodiode flat")
    (tags "PIN photo diode flat hammamatsu")
    (path /56157DCF)
    (fp_text reference D1 (at -2.4366 6.01076 90) (layer F.SilkS)
      (effects (font (size 0.5 0.5) (thickness 0.125)))
    )
    (fp_text value PhotoD (at 0.0635 6.4262 90) (layer F.SilkS) hide
      (effects (font (size 0.5 0.5) (thickness 0.125)))
    )
    (fp_line (start -2.18694 -3.5687) (end -3.44678 -2.32918) (layer F.SilkS) (width 0.15))
    (fp_line (start -2.39776 -2.2479) (end 2.4003 2.25044) (layer F.SilkS) (width 0.15))
    (fp_line (start -2.39268 2.2352) (end 2.4003 -2.25044) (layer F.SilkS) (width 0.15))
    (fp_line (start -2.4 -2.25) (end 2.4 -2.25) (layer F.SilkS) (width 0.15))
    (fp_line (start 2.4 -2.25) (end 2.4 2.25) (layer F.SilkS) (width 0.15))
    (fp_line (start 2.4 2.25) (end -2.4 2.25) (layer F.SilkS) (width 0.15))
    (fp_line (start -2.4 2.25) (end -2.4 -2.25) (layer F.SilkS) (width 0.15))
    (fp_line (start 3.5 -3.65) (end -3.5 -3.65) (layer F.SilkS) (width 0.3048))
    (fp_line (start -3.5 4.15) (end 3.5 4.15) (layer F.SilkS) (width 0.3048))
    (fp_line (start -3.5 -3.65) (end -3.5127 4.15) (layer F.SilkS) (width 0.3048))
    (fp_line (start 3.5 -3.65) (end 3.4873 4.15) (layer F.SilkS) (width 0.3048))
    (pad 1 thru_hole rect (at -2.54 7.65 90) (size 1.524 2.19964) (drill 1.00076) (layers *.Cu *.Mask F.SilkS)
      (net 9 "Net-(D1-Pad1)"))
    (pad 2 thru_hole oval (at 2.54 7.65 90) (size 1.524 2.19964) (drill 1.00076) (layers *.Cu *.Mask F.SilkS)
      (net 4 "Net-(C2-Pad2)"))
    (model walter\pin_strip\pin_strip_4.wrl
      (at (xyz 0 0 0))
      (scale (xyz 1 1 1))
      (rotate (xyz 0 0 0))
    )
  )

  (module Connect:PINHEAD1-2 (layer F.Cu) (tedit 56200901) (tstamp 5615AC94)
    (at 157.1498 94.8944)
    (path /56157DD5)
    (attr virtual)
    (fp_text reference P3 (at 3.81 0.508) (layer F.SilkS)
      (effects (font (size 1 1) (thickness 0.15)))
    )
    (fp_text value . (at 1.9558 3.9878) (layer F.Fab) hide
      (effects (font (size 1 1) (thickness 0.15)))
    )
    (fp_line (start 2.54 -1.27) (end -2.54 -1.27) (layer F.SilkS) (width 0.15))
    (fp_line (start 2.54 3.175) (end -2.54 3.175) (layer F.SilkS) (width 0.15))
    (fp_line (start -2.54 -3.175) (end 2.54 -3.175) (layer F.SilkS) (width 0.15))
    (fp_line (start -2.54 -3.175) (end -2.54 3.175) (layer F.SilkS) (width 0.15))
    (fp_line (start 2.54 -3.175) (end 2.54 3.175) (layer F.SilkS) (width 0.15))
    (pad 1 thru_hole oval (at -1.27 0) (size 1.50622 3.01498) (drill 0.99822) (layers *.Cu *.Mask)
      (net 1 +5V))
    (pad 2 thru_hole oval (at 1.27 0) (size 1.50622 3.01498) (drill 0.99822) (layers *.Cu *.Mask)
      (net 2 GND))
  )

  (module Connect:PINHEAD1-2 (layer F.Cu) (tedit 561F26CA) (tstamp 5615AC9F)
    (at 154.4574 117.094)
    (path /56157DD6)
    (attr virtual)
    (fp_text reference P4 (at -4.191 0) (layer F.SilkS)
      (effects (font (size 1 1) (thickness 0.15)))
    )
    (fp_text value CONN_01X02 (at 0 3.81) (layer F.Fab) hide
      (effects (font (size 1 1) (thickness 0.15)))
    )
    (fp_line (start 2.54 -1.27) (end -2.54 -1.27) (layer F.SilkS) (width 0.15))
    (fp_line (start 2.54 3.175) (end -2.54 3.175) (layer F.SilkS) (width 0.15))
    (fp_line (start -2.54 -3.175) (end 2.54 -3.175) (layer F.SilkS) (width 0.15))
    (fp_line (start -2.54 -3.175) (end -2.54 3.175) (layer F.SilkS) (width 0.15))
    (fp_line (start 2.54 -3.175) (end 2.54 3.175) (layer F.SilkS) (width 0.15))
    (pad 1 thru_hole oval (at -1.27 0) (size 1.50622 3.01498) (drill 0.99822) (layers *.Cu *.Mask)
      (net 2 GND))
    (pad 2 thru_hole oval (at 1.27 0) (size 1.50622 3.01498) (drill 0.99822) (layers *.Cu *.Mask)
      (net 15 -10V))
  )

  (module Connect:PINTST (layer F.Cu) (tedit 56200906) (tstamp 5615ACA5)
    (at 162.3314 95.504)
    (descr "module 1 pin (ou trou mecanique de percage)")
    (tags DEV)
    (path /56157DE1)
    (fp_text reference P5 (at -1.397 1.651) (layer F.SilkS)
      (effects (font (size 1 1) (thickness 0.15)))
    )
    (fp_text value . (at 2.8702 -3.2512) (layer F.Fab) hide
      (effects (font (size 1 1) (thickness 0.15)))
    )
    (fp_circle (center 0 0) (end -0.254 -0.762) (layer F.SilkS) (width 0.15))
    (pad 1 thru_hole circle (at 0 0) (size 1.143 1.143) (drill 0.635) (layers *.Cu *.Mask F.SilkS)
      (net 16 "Net-(P5-Pad1)"))
    (model Connect.3dshapes/PINTST.wrl
      (at (xyz 0 0 0))
      (scale (xyz 1 1 1))
      (rotate (xyz 0 0 0))
    )
  )

  (module Pin_Headers:Pin_Header_Straight_2x04 (layer F.Cu) (tedit 5615B283) (tstamp 5615ACBD)
    (at 177.9524 99.949)
    (descr "Through hole pin header")
    (tags "pin header")
    (path /56157DCB)
    (fp_text reference P6 (at 1.27 -3.048) (layer F.SilkS)
      (effects (font (size 1 1) (thickness 0.15)))
    )
    (fp_text value CONN_02X04 (at 0 -3.1) (layer F.Fab) hide
      (effects (font (size 1 1) (thickness 0.15)))
    )
    (fp_line (start -1.75 -1.75) (end -1.75 9.4) (layer F.CrtYd) (width 0.05))
    (fp_line (start 4.3 -1.75) (end 4.3 9.4) (layer F.CrtYd) (width 0.05))
    (fp_line (start -1.75 -1.75) (end 4.3 -1.75) (layer F.CrtYd) (width 0.05))
    (fp_line (start -1.75 9.4) (end 4.3 9.4) (layer F.CrtYd) (width 0.05))
    (fp_line (start -1.27 1.27) (end -1.27 8.89) (layer F.SilkS) (width 0.15))
    (fp_line (start -1.27 8.89) (end 3.81 8.89) (layer F.SilkS) (width 0.15))
    (fp_line (start 3.81 8.89) (end 3.81 -1.27) (layer F.SilkS) (width 0.15))
    (fp_line (start 3.81 -1.27) (end 1.27 -1.27) (layer F.SilkS) (width 0.15))
    (fp_line (start 0 -1.55) (end -1.55 -1.55) (layer F.SilkS) (width 0.15))
    (fp_line (start 1.27 -1.27) (end 1.27 1.27) (layer F.SilkS) (width 0.15))
    (fp_line (start 1.27 1.27) (end -1.27 1.27) (layer F.SilkS) (width 0.15))
    (fp_line (start -1.55 -1.55) (end -1.55 0) (layer F.SilkS) (width 0.15))
    (pad 1 thru_hole rect (at 0 0) (size 1.7272 1.7272) (drill 1.016) (layers *.Cu *.Mask F.SilkS)
      (net 10 "Net-(P6-Pad1)"))
    (pad 2 thru_hole oval (at 2.54 0) (size 1.7272 1.7272) (drill 1.016) (layers *.Cu *.Mask F.SilkS)
      (net 8 "Net-(C10-Pad1)"))
    (pad 3 thru_hole oval (at 0 2.54) (size 1.7272 1.7272) (drill 1.016) (layers *.Cu *.Mask F.SilkS)
      (net 11 "Net-(P6-Pad3)"))
    (pad 4 thru_hole oval (at 2.54 2.54) (size 1.7272 1.7272) (drill 1.016) (layers *.Cu *.Mask F.SilkS)
      (net 2 GND))
    (pad 5 thru_hole oval (at 0 5.08) (size 1.7272 1.7272) (drill 1.016) (layers *.Cu *.Mask F.SilkS)
      (net 12 "Net-(P6-Pad5)"))
    (pad 6 thru_hole oval (at 2.54 5.08) (size 1.7272 1.7272) (drill 1.016) (layers *.Cu *.Mask F.SilkS)
      (net 18 S2))
    (pad 7 thru_hole oval (at 0 7.62) (size 1.7272 1.7272) (drill 1.016) (layers *.Cu *.Mask F.SilkS)
      (net 13 "Net-(P6-Pad7)"))
    (pad 8 thru_hole oval (at 2.54 7.62) (size 1.7272 1.7272) (drill 1.016) (layers *.Cu *.Mask F.SilkS)
      (net 17 S1))
    (model Pin_Headers.3dshapes/Pin_Header_Straight_2x04.wrl
      (at (xyz 0.05 -0.15 0))
      (scale (xyz 1 1 1))
      (rotate (xyz 0 0 90))
    )
  )

  (module Resistors_SMD:R_0805_HandSoldering (layer F.Cu) (tedit 562007C0) (tstamp 5615ACD5)
    (at 144.7673 107.1245 180)
    (descr "Resistor SMD 0805, hand soldering")
    (tags "resistor 0805")
    (path /56157DE0)
    (attr smd)
    (fp_text reference R2 (at -0.635 -1.8669 180) (layer F.SilkS)
      (effects (font (size 1 1) (thickness 0.15)))
    )
    (fp_text value 0 (at 0 1.6256 180) (layer F.Fab) hide
      (effects (font (size 1 1) (thickness 0.15)))
    )
    (fp_line (start -2.4 -1) (end 2.4 -1) (layer F.CrtYd) (width 0.05))
    (fp_line (start -2.4 1) (end 2.4 1) (layer F.CrtYd) (width 0.05))
    (fp_line (start -2.4 -1) (end -2.4 1) (layer F.CrtYd) (width 0.05))
    (fp_line (start 2.4 -1) (end 2.4 1) (layer F.CrtYd) (width 0.05))
    (fp_line (start 0.6 0.875) (end -0.6 0.875) (layer F.SilkS) (width 0.15))
    (fp_line (start -0.6 -0.875) (end 0.6 -0.875) (layer F.SilkS) (width 0.15))
    (pad 1 smd rect (at -1.35 0 180) (size 1.5 1.3) (layers F.Cu F.Paste F.Mask)
      (net 15 -10V))
    (pad 2 smd rect (at 1.35 0 180) (size 1.5 1.3) (layers F.Cu F.Paste F.Mask)
      (net 9 "Net-(D1-Pad1)"))
    (model Resistors_SMD.3dshapes/R_0805_HandSoldering.wrl
      (at (xyz 0 0 0))
      (scale (xyz 1 1 1))
      (rotate (xyz 0 0 0))
    )
  )

  (module Resistors_SMD:R_0805_HandSoldering (layer F.Cu) (tedit 562007BE) (tstamp 5615ACE1)
    (at 143.3957 110.6805 270)
    (descr "Resistor SMD 0805, hand soldering")
    (tags "resistor 0805")
    (path /56157DDF)
    (attr smd)
    (fp_text reference R3 (at 2.8321 -1.5367 270) (layer F.SilkS)
      (effects (font (size 1 1) (thickness 0.15)))
    )
    (fp_text value 0 (at -0.0254 -1.7018 270) (layer F.Fab) hide
      (effects (font (size 1 1) (thickness 0.15)))
    )
    (fp_line (start -2.4 -1) (end 2.4 -1) (layer F.CrtYd) (width 0.05))
    (fp_line (start -2.4 1) (end 2.4 1) (layer F.CrtYd) (width 0.05))
    (fp_line (start -2.4 -1) (end -2.4 1) (layer F.CrtYd) (width 0.05))
    (fp_line (start 2.4 -1) (end 2.4 1) (layer F.CrtYd) (width 0.05))
    (fp_line (start 0.6 0.875) (end -0.6 0.875) (layer F.SilkS) (width 0.15))
    (fp_line (start -0.6 -0.875) (end 0.6 -0.875) (layer F.SilkS) (width 0.15))
    (pad 1 smd rect (at -1.35 0 270) (size 1.5 1.3) (layers F.Cu F.Paste F.Mask)
      (net 9 "Net-(D1-Pad1)"))
    (pad 2 smd rect (at 1.35 0 270) (size 1.5 1.3) (layers F.Cu F.Paste F.Mask)
      (net 2 GND))
    (model Resistors_SMD.3dshapes/R_0805_HandSoldering.wrl
      (at (xyz 0 0 0))
      (scale (xyz 1 1 1))
      (rotate (xyz 0 0 0))
    )
  )

  (module Resistors_SMD:R_0805_HandSoldering (layer F.Cu) (tedit 562007CE) (tstamp 5615ACF9)
    (at 144.1069 99.2378 180)
    (descr "Resistor SMD 0805, hand soldering")
    (tags "resistor 0805")
    (path /56157DB9)
    (attr smd)
    (fp_text reference R5 (at 0.3175 1.6891 180) (layer F.SilkS)
      (effects (font (size 1 1) (thickness 0.15)))
    )
    (fp_text value 1000 (at 3.556 1.6891 180) (layer F.Fab) hide
      (effects (font (size 1 1) (thickness 0.15)))
    )
    (fp_line (start -2.4 -1) (end 2.4 -1) (layer F.CrtYd) (width 0.05))
    (fp_line (start -2.4 1) (end 2.4 1) (layer F.CrtYd) (width 0.05))
    (fp_line (start -2.4 -1) (end -2.4 1) (layer F.CrtYd) (width 0.05))
    (fp_line (start 2.4 -1) (end 2.4 1) (layer F.CrtYd) (width 0.05))
    (fp_line (start 0.6 0.875) (end -0.6 0.875) (layer F.SilkS) (width 0.15))
    (fp_line (start -0.6 -0.875) (end 0.6 -0.875) (layer F.SilkS) (width 0.15))
    (pad 1 smd rect (at -1.35 0 180) (size 1.5 1.3) (layers F.Cu F.Paste F.Mask)
      (net 2 GND))
    (pad 2 smd rect (at 1.35 0 180) (size 1.5 1.3) (layers F.Cu F.Paste F.Mask)
      (net 4 "Net-(C2-Pad2)"))
    (model Resistors_SMD.3dshapes/R_0805_HandSoldering.wrl
      (at (xyz 0 0 0))
      (scale (xyz 1 1 1))
      (rotate (xyz 0 0 0))
    )
  )

  (module Resistors_SMD:R_0805_HandSoldering (layer F.Cu) (tedit 5615C991) (tstamp 5615AD1D)
    (at 161.0614 102.616)
    (descr "Resistor SMD 0805, hand soldering")
    (tags "resistor 0805")
    (path /5618295C)
    (attr smd)
    (fp_text reference R8 (at 0 -2.1) (layer F.SilkS)
      (effects (font (size 1 1) (thickness 0.15)))
    )
    (fp_text value 1K (at 0 2.1) (layer F.Fab) hide
      (effects (font (size 1 1) (thickness 0.15)))
    )
    (fp_line (start -2.4 -1) (end 2.4 -1) (layer F.CrtYd) (width 0.05))
    (fp_line (start -2.4 1) (end 2.4 1) (layer F.CrtYd) (width 0.05))
    (fp_line (start -2.4 -1) (end -2.4 1) (layer F.CrtYd) (width 0.05))
    (fp_line (start 2.4 -1) (end 2.4 1) (layer F.CrtYd) (width 0.05))
    (fp_line (start 0.6 0.875) (end -0.6 0.875) (layer F.SilkS) (width 0.15))
    (fp_line (start -0.6 -0.875) (end 0.6 -0.875) (layer F.SilkS) (width 0.15))
    (pad 1 smd rect (at -1.35 0) (size 1.5 1.3) (layers F.Cu F.Paste F.Mask)
      (net 5 "Net-(C3-Pad1)"))
    (pad 2 smd rect (at 1.35 0) (size 1.5 1.3) (layers F.Cu F.Paste F.Mask)
      (net 16 "Net-(P5-Pad1)"))
    (model Resistors_SMD.3dshapes/R_0805_HandSoldering.wrl
      (at (xyz 0 0 0))
      (scale (xyz 1 1 1))
      (rotate (xyz 0 0 0))
    )
  )

  (module Housings_DFN_QFN:QFN-20-1EP_4x4mm_Pitch0.5mm (layer F.Cu) (tedit 5615E035) (tstamp 5615AD63)
    (at 167.5384 102.362 90)
    (descr "20-Lead Plastic Quad Flat, No Lead Package (ML) - 4x4x0.9 mm Body [QFN]; (see Microchip Packaging Specification 00000049BS.pdf)")
    (tags "QFN 0.5")
    (path /56157DCE)
    (attr smd)
    (fp_text reference U2 (at 3.937 -1.905 90) (layer F.SilkS)
      (effects (font (size 1 1) (thickness 0.15)))
    )
    (fp_text value AD7699 (at -0.381 3.937 90) (layer F.Fab)
      (effects (font (size 1 1) (thickness 0.15)))
    )
    (fp_line (start -2.6 -2.6) (end -2.6 2.6) (layer F.CrtYd) (width 0.05))
    (fp_line (start 2.6 -2.6) (end 2.6 2.6) (layer F.CrtYd) (width 0.05))
    (fp_line (start -2.6 -2.6) (end 2.6 -2.6) (layer F.CrtYd) (width 0.05))
    (fp_line (start -2.6 2.6) (end 2.6 2.6) (layer F.CrtYd) (width 0.05))
    (fp_line (start 2.15 -2.15) (end 2.15 -1.375) (layer F.SilkS) (width 0.15))
    (fp_line (start -2.15 2.15) (end -2.15 1.375) (layer F.SilkS) (width 0.15))
    (fp_line (start 2.15 2.15) (end 2.15 1.375) (layer F.SilkS) (width 0.15))
    (fp_line (start -2.15 -2.15) (end -1.375 -2.15) (layer F.SilkS) (width 0.15))
    (fp_line (start -2.15 2.15) (end -1.375 2.15) (layer F.SilkS) (width 0.15))
    (fp_line (start 2.15 2.15) (end 1.375 2.15) (layer F.SilkS) (width 0.15))
    (fp_line (start 2.15 -2.15) (end 1.375 -2.15) (layer F.SilkS) (width 0.15))
    (pad 1 smd rect (at -1.965 -1 90) (size 0.73 0.3) (layers F.Cu F.Paste F.Mask)
      (net 1 +5V))
    (pad 2 smd rect (at -1.965 -0.5 90) (size 0.73 0.3) (layers F.Cu F.Paste F.Mask)
      (net 6 "Net-(C7-Pad1)"))
    (pad 3 smd rect (at -1.965 0 90) (size 0.73 0.3) (layers F.Cu F.Paste F.Mask)
      (net 7 "Net-(C8-Pad1)"))
    (pad 4 smd rect (at -1.965 0.5 90) (size 0.73 0.3) (layers F.Cu F.Paste F.Mask)
      (net 2 GND))
    (pad 5 smd rect (at -1.965 1 90) (size 0.73 0.3) (layers F.Cu F.Paste F.Mask)
      (net 2 GND))
    (pad 6 smd rect (at -1 1.965 180) (size 0.73 0.3) (layers F.Cu F.Paste F.Mask)
      (net 2 GND))
    (pad 7 smd rect (at -0.5 1.965 180) (size 0.73 0.3) (layers F.Cu F.Paste F.Mask)
      (net 2 GND))
    (pad 8 smd rect (at 0 1.965 180) (size 0.73 0.3) (layers F.Cu F.Paste F.Mask)
      (net 2 GND))
    (pad 9 smd rect (at 0.5 1.965 180) (size 0.73 0.3) (layers F.Cu F.Paste F.Mask)
      (net 2 GND))
    (pad 10 smd rect (at 1 1.965 180) (size 0.73 0.3) (layers F.Cu F.Paste F.Mask)
      (net 2 GND))
    (pad 11 smd rect (at 1.965 1 90) (size 0.73 0.3) (layers F.Cu F.Paste F.Mask)
      (net 13 "Net-(P6-Pad7)"))
    (pad 12 smd rect (at 1.965 0.5 90) (size 0.73 0.3) (layers F.Cu F.Paste F.Mask)
      (net 12 "Net-(P6-Pad5)"))
    (pad 13 smd rect (at 1.965 0 90) (size 0.73 0.3) (layers F.Cu F.Paste F.Mask)
      (net 11 "Net-(P6-Pad3)"))
    (pad 14 smd rect (at 1.965 -0.5 90) (size 0.73 0.3) (layers F.Cu F.Paste F.Mask)
      (net 10 "Net-(P6-Pad1)"))
    (pad 15 smd rect (at 1.965 -1 90) (size 0.73 0.3) (layers F.Cu F.Paste F.Mask)
      (net 8 "Net-(C10-Pad1)"))
    (pad 16 smd rect (at 1 -1.965 180) (size 0.73 0.3) (layers F.Cu F.Paste F.Mask)
      (net 2 GND))
    (pad 17 smd rect (at 0.5 -1.965 180) (size 0.73 0.3) (layers F.Cu F.Paste F.Mask)
      (net 16 "Net-(P5-Pad1)"))
    (pad 18 smd rect (at 0 -1.965 180) (size 0.73 0.3) (layers F.Cu F.Paste F.Mask)
      (net 2 GND))
    (pad 19 smd rect (at -0.5 -1.965 180) (size 0.73 0.3) (layers F.Cu F.Paste F.Mask)
      (net 2 GND))
    (pad 20 smd rect (at -1 -1.965 180) (size 0.73 0.3) (layers F.Cu F.Paste F.Mask)
      (net 1 +5V))
    (pad 21 smd rect (at 0.625 0.625 90) (size 1.25 1.25) (layers F.Cu F.Paste F.Mask)
      (solder_paste_margin_ratio -0.2))
    (pad 21 smd rect (at 0.625 -0.625 90) (size 1.25 1.25) (layers F.Cu F.Paste F.Mask)
      (solder_paste_margin_ratio -0.2))
    (pad 21 smd rect (at -0.625 0.625 90) (size 1.25 1.25) (layers F.Cu F.Paste F.Mask)
      (solder_paste_margin_ratio -0.2))
    (pad 21 smd rect (at -0.625 -0.625 90) (size 1.25 1.25) (layers F.Cu F.Paste F.Mask)
      (solder_paste_margin_ratio -0.2))
    (model Housings_DFN_QFN.3dshapes/QFN-20-1EP_4x4mm_Pitch0.5mm.wrl
      (at (xyz 0 0 0))
      (scale (xyz 1 1 1))
      (rotate (xyz 0 0 0))
    )
  )

  (module Housings_SOIC:SOIC-14_3.9x8.7mm_Pitch1.27mm (layer F.Cu) (tedit 561F255E) (tstamp 561F0E8E)
    (at 151.0157 103.0605)
    (descr "14-Lead Plastic Small Outline (SL) - Narrow, 3.90 mm Body [SOIC] (see Microchip Packaging Specification 00000049BS.pdf)")
    (tags "SOIC 1.27")
    (path /56180E22)
    (attr smd)
    (fp_text reference U1 (at 0 -5.375) (layer F.SilkS)
      (effects (font (size 1 1) (thickness 0.15)))
    )
    (fp_text value IVC102 (at -0.127 1.651 90) (layer F.Fab)
      (effects (font (size 1 1) (thickness 0.15)))
    )
    (fp_line (start -3.7 -4.65) (end -3.7 4.65) (layer F.CrtYd) (width 0.05))
    (fp_line (start 3.7 -4.65) (end 3.7 4.65) (layer F.CrtYd) (width 0.05))
    (fp_line (start -3.7 -4.65) (end 3.7 -4.65) (layer F.CrtYd) (width 0.05))
    (fp_line (start -3.7 4.65) (end 3.7 4.65) (layer F.CrtYd) (width 0.05))
    (fp_line (start -2.075 -4.45) (end -2.075 -4.335) (layer F.SilkS) (width 0.15))
    (fp_line (start 2.075 -4.45) (end 2.075 -4.335) (layer F.SilkS) (width 0.15))
    (fp_line (start 2.075 4.45) (end 2.075 4.335) (layer F.SilkS) (width 0.15))
    (fp_line (start -2.075 4.45) (end -2.075 4.335) (layer F.SilkS) (width 0.15))
    (fp_line (start -2.075 -4.45) (end 2.075 -4.45) (layer F.SilkS) (width 0.15))
    (fp_line (start -2.075 4.45) (end 2.075 4.45) (layer F.SilkS) (width 0.15))
    (fp_line (start -2.075 -4.335) (end -3.45 -4.335) (layer F.SilkS) (width 0.15))
    (pad 1 smd rect (at -2.7 -3.81) (size 1.5 0.6) (layers F.Cu F.Paste F.Mask)
      (net 2 GND))
    (pad 2 smd rect (at -2.7 -2.54) (size 1.5 0.6) (layers F.Cu F.Paste F.Mask)
      (net 3 "Net-(C2-Pad1)"))
    (pad 3 smd rect (at -2.7 -1.27) (size 1.5 0.6) (layers F.Cu F.Paste F.Mask)
      (net 14 "Net-(C3-Pad2)"))
    (pad 4 smd rect (at -2.7 0) (size 1.5 0.6) (layers F.Cu F.Paste F.Mask)
      (net 14 "Net-(C3-Pad2)"))
    (pad 5 smd rect (at -2.7 1.27) (size 1.5 0.6) (layers F.Cu F.Paste F.Mask)
      (net 14 "Net-(C3-Pad2)"))
    (pad 6 smd rect (at -2.7 2.54) (size 1.5 0.6) (layers F.Cu F.Paste F.Mask)
      (net 14 "Net-(C3-Pad2)"))
    (pad 7 smd rect (at -2.7 3.81) (size 1.5 0.6) (layers F.Cu F.Paste F.Mask))
    (pad 8 smd rect (at 2.7 3.81) (size 1.5 0.6) (layers F.Cu F.Paste F.Mask))
    (pad 9 smd rect (at 2.7 2.54) (size 1.5 0.6) (layers F.Cu F.Paste F.Mask)
      (net 15 -10V))
    (pad 10 smd rect (at 2.7 1.27) (size 1.5 0.6) (layers F.Cu F.Paste F.Mask)
      (net 5 "Net-(C3-Pad1)"))
    (pad 11 smd rect (at 2.7 0) (size 1.5 0.6) (layers F.Cu F.Paste F.Mask)
      (net 17 S1))
    (pad 12 smd rect (at 2.7 -1.27) (size 1.5 0.6) (layers F.Cu F.Paste F.Mask)
      (net 18 S2))
    (pad 13 smd rect (at 2.7 -2.54) (size 1.5 0.6) (layers F.Cu F.Paste F.Mask)
      (net 2 GND))
    (pad 14 smd rect (at 2.7 -3.81) (size 1.5 0.6) (layers F.Cu F.Paste F.Mask)
      (net 1 +5V))
    (model Housings_SOIC.3dshapes/SOIC-14_3.9x8.7mm_Pitch1.27mm.wrl
      (at (xyz 0 0 0))
      (scale (xyz 1 1 1))
      (rotate (xyz 0 0 0))
    )
  )

  (gr_line (start 185 125) (end 185 90) (angle 90) (layer Edge.Cuts) (width 0.1))
  (gr_line (start 135 125) (end 185 125) (angle 90) (layer Edge.Cuts) (width 0.1))
  (gr_line (start 135 90) (end 135 125) (angle 90) (layer Edge.Cuts) (width 0.1))
  (gr_line (start 185 90) (end 135 90) (angle 90) (layer Edge.Cuts) (width 0.1))
  (gr_text S1 (at 183.1594 107.569) (layer F.SilkS)
    (effects (font (size 1 1) (thickness 0.2)))
  )
  (gr_text S2 (at 183.1594 105.029) (layer F.SilkS)
    (effects (font (size 1 1) (thickness 0.2)))
  )
  (gr_text CNV (at 174.9044 107.696) (layer F.SilkS)
    (effects (font (size 1 1) (thickness 0.2)))
  )
  (gr_text DIN (at 174.7774 105.029) (layer F.SilkS)
    (effects (font (size 1 1) (thickness 0.2)))
  )
  (gr_text SCK (at 174.7774 102.489) (layer F.SilkS)
    (effects (font (size 1 1) (thickness 0.2)))
  )
  (gr_text SDO (at 174.5234 99.822) (layer F.SilkS)
    (effects (font (size 1 1) (thickness 0.2)))
  )
  (gr_text Output (at 164.5158 93.8022) (layer F.SilkS)
    (effects (font (size 1.5 1.5) (thickness 0.3)))
  )
  (gr_text +3V (at 182.5244 97.79) (layer F.SilkS)
    (effects (font (size 1 1) (thickness 0.2)))
  )
  (gr_text GND (at 183.0324 102.489) (layer F.SilkS)
    (effects (font (size 1 1) (thickness 0.2)))
  )
  (gr_text Pulse (at 181.5084 110.236) (layer F.SilkS)
    (effects (font (size 1 1) (thickness 0.2)))
  )
  (gr_text Input (at 132.5372 98.044) (layer F.SilkS)
    (effects (font (size 1.5 1.5) (thickness 0.3)))
  )
  (gr_text +5V (at 149.7584 94.869) (layer F.SilkS)
    (effects (font (size 1.5 1.5) (thickness 0.3)))
  )
  (gr_text -10V (at 160.1724 118.11) (layer F.SilkS)
    (effects (font (size 1.5 1.5) (thickness 0.3)))
  )
  (gr_text SPI (at 179.3494 94.996) (layer F.SilkS)
    (effects (font (size 1.5 1.5) (thickness 0.3)))
  )
  (gr_text OR! (at 140.3477 110.744) (layer F.SilkS)
    (effects (font (size 1.5 1.5) (thickness 0.3)))
  )

  (via (at 183.9214 91.694) (size 0.6) (drill 0.4) (layers F.Cu B.Cu) (net 0))
  (segment (start 155.8798 99.2324) (end 153.7338 99.2324) (width 0.25) (layer F.Cu) (net 1))
  (segment (start 153.7338 99.2324) (end 153.7157 99.2505) (width 0.25) (layer F.Cu) (net 1) (tstamp 56200A71))
  (segment (start 155.8798 99.2324) (end 160.0654 99.2324) (width 0.25) (layer F.Cu) (net 1))
  (segment (start 162.2371 105.811) (end 164.9984 105.811) (width 0.25) (layer F.Cu) (net 1) (tstamp 5620093B))
  (segment (start 161.036 104.6099) (end 162.2371 105.811) (width 0.25) (layer F.Cu) (net 1) (tstamp 56200939))
  (segment (start 161.036 100.203) (end 161.036 104.6099) (width 0.25) (layer F.Cu) (net 1) (tstamp 56200938))
  (segment (start 160.0654 99.2324) (end 161.036 100.203) (width 0.25) (layer F.Cu) (net 1) (tstamp 56200937))
  (segment (start 155.8798 94.8944) (end 156.0068 99.1054) (width 0.25) (layer F.Cu) (net 1) (status 20))
  (segment (start 156.0068 99.1054) (end 155.8798 99.2324) (width 0.25) (layer F.Cu) (net 1) (tstamp 561F21F8) (status 30))
  (segment (start 165.5694 103.358) (end 165.5734 103.362) (width 0.25) (layer F.Cu) (net 1) (tstamp 561F17F4))
  (segment (start 164.9984 105.811) (end 164.9984 103.937) (width 0.25) (layer F.Cu) (net 1))
  (segment (start 164.9984 103.937) (end 165.5734 103.362) (width 0.25) (layer F.Cu) (net 1) (tstamp 5616835E))
  (segment (start 165.5734 103.362) (end 166.5384 104.327) (width 0.25) (layer F.Cu) (net 1))
  (segment (start 166.5384 104.327) (end 166.5384 105.16) (width 0.25) (layer F.Cu) (net 1) (tstamp 5615D0AD))
  (segment (start 166.5384 105.16) (end 164.9984 105.811) (width 0.25) (layer F.Cu) (net 1) (tstamp 5615D0AF) (status 20))
  (segment (start 155.8998 99.0854) (end 156.0268 99.2124) (width 0.25) (layer F.Cu) (net 1) (tstamp 561F1E0D) (status 30))
  (segment (start 155.8798 101.7324) (end 156.9793 101.7324) (width 0.25) (layer F.Cu) (net 2))
  (via (at 157.226 101.4857) (size 0.6) (drill 0.4) (layers F.Cu B.Cu) (net 2))
  (segment (start 156.9793 101.7324) (end 157.226 101.4857) (width 0.25) (layer F.Cu) (net 2) (tstamp 56200AEF))
  (segment (start 148.3157 99.2505) (end 149.4028 99.2505) (width 0.25) (layer F.Cu) (net 2))
  (segment (start 153.1874 112.4712) (end 153.1874 117.094) (width 0.25) (layer B.Cu) (net 2) (tstamp 56200AE6))
  (segment (start 152.9842 112.268) (end 153.1874 112.4712) (width 0.25) (layer B.Cu) (net 2) (tstamp 56200AE5))
  (via (at 152.9842 112.268) (size 0.6) (drill 0.4) (layers F.Cu B.Cu) (net 2))
  (segment (start 151.1046 110.3884) (end 152.9842 112.268) (width 0.25) (layer F.Cu) (net 2) (tstamp 56200ADE))
  (segment (start 151.1046 104.7496) (end 151.1046 110.3884) (width 0.25) (layer F.Cu) (net 2) (tstamp 56200ADC))
  (segment (start 149.7584 103.4034) (end 151.1046 104.7496) (width 0.25) (layer F.Cu) (net 2) (tstamp 56200ADA))
  (segment (start 149.7584 99.6061) (end 149.7584 103.4034) (width 0.25) (layer F.Cu) (net 2) (tstamp 56200AD9))
  (segment (start 149.4028 99.2505) (end 149.7584 99.6061) (width 0.25) (layer F.Cu) (net 2) (tstamp 56200AD5))
  (segment (start 180.4924 102.489) (end 180.4924 102.3112) (width 0.25) (layer F.Cu) (net 2))
  (segment (start 180.4924 102.3112) (end 181.9402 100.8634) (width 0.25) (layer F.Cu) (net 2) (tstamp 56200ABF))
  (via (at 179.8574 95.758) (size 0.6) (drill 0.4) (layers F.Cu B.Cu) (net 2))
  (segment (start 167.0304 95.885) (end 165.7604 95.778) (width 0.25) (layer F.Cu) (net 2) (status 10))
  (via (at 167.1574 95.758) (size 0.6) (drill 0.4) (layers F.Cu B.Cu) (net 2))
  (segment (start 167.0304 95.885) (end 167.1574 95.758) (width 0.25) (layer F.Cu) (net 2) (tstamp 5615DFF3))
  (segment (start 179.8574 95.758) (end 167.1574 95.758) (width 0.25) (layer F.Cu) (net 2))
  (segment (start 181.0131 95.758) (end 179.8574 95.758) (width 0.25) (layer F.Cu) (net 2) (tstamp 56200AC5))
  (segment (start 181.9402 96.6851) (end 181.0131 95.758) (width 0.25) (layer F.Cu) (net 2) (tstamp 56200AC2))
  (segment (start 181.9402 100.8634) (end 181.9402 96.6851) (width 0.25) (layer F.Cu) (net 2) (tstamp 56200AC0))
  (segment (start 180.4924 102.489) (end 180.2003 102.489) (width 0.25) (layer F.Cu) (net 2))
  (segment (start 180.2003 102.489) (end 179.2478 103.4415) (width 0.25) (layer F.Cu) (net 2) (tstamp 56200AA8))
  (via (at 179.5272 109.9566) (size 0.6) (drill 0.4) (layers F.Cu B.Cu) (net 2))
  (segment (start 179.4637 109.9566) (end 179.5272 109.9566) (width 0.25) (layer F.Cu) (net 2) (tstamp 56200AAB))
  (segment (start 179.2478 109.7407) (end 179.4637 109.9566) (width 0.25) (layer F.Cu) (net 2) (tstamp 56200AAA))
  (segment (start 179.2478 103.4415) (end 179.2478 109.7407) (width 0.25) (layer F.Cu) (net 2) (tstamp 56200AA9))
  (segment (start 145.4569 99.2378) (end 146.7739 99.2378) (width 0.25) (layer F.Cu) (net 2))
  (segment (start 148.3157 98.1761) (end 148.3157 99.2505) (width 0.25) (layer F.Cu) (net 2) (tstamp 56200AA2))
  (segment (start 148.2471 98.1075) (end 148.3157 98.1761) (width 0.25) (layer F.Cu) (net 2) (tstamp 56200AA1))
  (via (at 148.2471 98.1075) (size 0.6) (drill 0.4) (layers F.Cu B.Cu) (net 2))
  (segment (start 147.9042 98.1075) (end 148.2471 98.1075) (width 0.25) (layer B.Cu) (net 2) (tstamp 56200A9F))
  (segment (start 146.8628 99.1489) (end 147.9042 98.1075) (width 0.25) (layer B.Cu) (net 2) (tstamp 56200A9E))
  (via (at 146.8628 99.1489) (size 0.6) (drill 0.4) (layers F.Cu B.Cu) (net 2))
  (segment (start 146.7739 99.2378) (end 146.8628 99.1489) (width 0.25) (layer F.Cu) (net 2) (tstamp 56200A9C))
  (segment (start 158.4198 94.8944) (end 159.8041 94.8944) (width 0.25) (layer F.Cu) (net 2))
  (via (at 161.0233 93.6752) (size 0.6) (drill 0.4) (layers F.Cu B.Cu) (net 2))
  (segment (start 159.8041 94.8944) (end 161.0233 93.6752) (width 0.25) (layer F.Cu) (net 2) (tstamp 56200A8B))
  (segment (start 153.7157 100.5205) (end 154.6679 100.5205) (width 0.25) (layer F.Cu) (net 2))
  (segment (start 154.6679 100.5205) (end 155.8798 101.7324) (width 0.25) (layer F.Cu) (net 2) (tstamp 56200A74))
  (segment (start 145.4696 99.2505) (end 145.4569 99.2378) (width 0.25) (layer F.Cu) (net 2) (tstamp 562007D0))
  (segment (start 143.3957 112.0305) (end 144.987 112.0305) (width 0.25) (layer F.Cu) (net 2))
  (via (at 145.0467 112.0902) (size 0.6) (drill 0.4) (layers F.Cu B.Cu) (net 2))
  (segment (start 144.987 112.0305) (end 145.0467 112.0902) (width 0.25) (layer F.Cu) (net 2) (tstamp 562007C5))
  (segment (start 169.9514 110.871) (end 180.4924 110.871) (width 0.25) (layer F.Cu) (net 2))
  (segment (start 170.0784 110.744) (end 169.9514 110.871) (width 0.25) (layer F.Cu) (net 2) (tstamp 5615D72A))
  (via (at 169.9514 110.871) (size 0.6) (drill 0.4) (layers F.Cu B.Cu) (net 2))
  (segment (start 170.0784 109.2) (end 170.0784 110.744) (width 0.25) (layer F.Cu) (net 2))
  (segment (start 180.4924 110.871) (end 183.9214 107.442) (width 0.25) (layer F.Cu) (net 2) (tstamp 561F27BD))
  (segment (start 164.9984 102.616) (end 164.7444 102.616) (width 0.25) (layer F.Cu) (net 2))
  (segment (start 165.1254 102.489) (end 164.9984 102.616) (width 0.25) (layer F.Cu) (net 2) (tstamp 5615DE01))
  (via (at 164.9984 102.616) (size 0.6) (drill 0.4) (layers F.Cu B.Cu) (net 2))
  (segment (start 165.5734 102.362) (end 165.1254 102.489) (width 0.25) (layer F.Cu) (net 2))
  (segment (start 164.7444 102.616) (end 162.7124 104.648) (width 0.25) (layer F.Cu) (net 2) (tstamp 561F2320))
  (segment (start 165.5734 101.362) (end 165.1414 101.362) (width 0.25) (layer F.Cu) (net 2))
  (via (at 164.8714 101.092) (size 0.6) (drill 0.4) (layers F.Cu B.Cu) (net 2))
  (segment (start 165.1414 101.362) (end 164.8714 101.092) (width 0.25) (layer F.Cu) (net 2) (tstamp 561F22FC))
  (segment (start 164.9984 108.311) (end 164.9984 109.855) (width 0.25) (layer F.Cu) (net 2))
  (via (at 164.9984 109.855) (size 0.6) (drill 0.4) (layers F.Cu B.Cu) (net 2))
  (segment (start 180.4924 102.489) (end 180.3654 102.489) (width 0.25) (layer F.Cu) (net 2))
  (segment (start 145.4569 99.2378) (end 145.4569 99.4448) (width 0.25) (layer F.Cu) (net 2) (status 30))
  (segment (start 168.5544 104.816998) (end 169.274402 104.816998) (width 0.25) (layer F.Cu) (net 2))
  (via (at 169.3164 104.775) (size 0.6) (drill 0.4) (layers F.Cu B.Cu) (net 2))
  (segment (start 169.274402 104.816998) (end 169.3164 104.775) (width 0.25) (layer F.Cu) (net 2) (tstamp 5615F894))
  (segment (start 168.5384 104.816998) (end 168.5544 104.816998) (width 0.25) (layer F.Cu) (net 2))
  (segment (start 168.5544 104.816998) (end 168.766402 104.816998) (width 0.25) (layer F.Cu) (net 2) (tstamp 5615F892))
  (segment (start 169.4434 104.14) (end 169.2564 104.327) (width 0.25) (layer F.Cu) (net 2) (tstamp 5615D3EF))
  (segment (start 169.4434 104.14) (end 169.3799 104.14) (width 0.25) (layer F.Cu) (net 2))
  (segment (start 168.766402 104.816998) (end 169.2564 104.327) (width 0.25) (layer F.Cu) (net 2) (tstamp 5615F824))
  (segment (start 168.0384 104.327) (end 168.0384 104.824998) (width 0.25) (layer F.Cu) (net 2))
  (segment (start 168.5384 104.816998) (end 168.5384 104.327) (width 0.25) (layer F.Cu) (net 2) (tstamp 5615F815))
  (segment (start 168.5544 104.832998) (end 168.5384 104.816998) (width 0.25) (layer F.Cu) (net 2) (tstamp 5615F812))
  (segment (start 168.0464 104.832998) (end 168.5544 104.832998) (width 0.25) (layer F.Cu) (net 2) (tstamp 5615F80F))
  (segment (start 168.0384 104.824998) (end 168.0464 104.832998) (width 0.25) (layer F.Cu) (net 2) (tstamp 5615F80C))
  (segment (start 169.5034 103.362) (end 170.4594 103.362) (width 0.25) (layer F.Cu) (net 2))
  (segment (start 169.5034 102.862) (end 170.4594 102.862) (width 0.25) (layer F.Cu) (net 2))
  (segment (start 170.4594 102.862) (end 170.4594 102.87) (width 0.25) (layer F.Cu) (net 2) (tstamp 5615D83F))
  (segment (start 169.5034 102.362) (end 170.4594 102.362) (width 0.25) (layer F.Cu) (net 2))
  (segment (start 169.5034 101.862) (end 170.4594 101.862) (width 0.25) (layer F.Cu) (net 2))
  (segment (start 170.4594 101.862) (end 170.4594 101.854) (width 0.25) (layer F.Cu) (net 2) (tstamp 5615D823))
  (segment (start 169.5034 101.362) (end 170.5704 101.362) (width 0.25) (layer F.Cu) (net 2))
  (segment (start 170.4594 101.473) (end 170.4594 101.854) (width 0.25) (layer F.Cu) (net 2) (tstamp 5615D813))
  (segment (start 170.4594 101.854) (end 170.4594 102.362) (width 0.25) (layer F.Cu) (net 2) (tstamp 5615D82E))
  (segment (start 170.4594 102.362) (end 170.4594 102.87) (width 0.25) (layer F.Cu) (net 2) (tstamp 5615D83C))
  (segment (start 170.4594 102.87) (end 170.4594 103.362) (width 0.25) (layer F.Cu) (net 2) (tstamp 5615D844))
  (segment (start 170.4594 103.362) (end 170.4594 104.14) (width 0.25) (layer F.Cu) (net 2) (tstamp 5615D848))
  (segment (start 170.5704 101.362) (end 170.4594 101.473) (width 0.25) (layer F.Cu) (net 2) (tstamp 5615D810))
  (segment (start 167.5384 109.2) (end 167.5384 110.744) (width 0.25) (layer F.Cu) (net 2))
  (via (at 167.5384 110.744) (size 0.6) (drill 0.4) (layers F.Cu B.Cu) (net 2))
  (segment (start 169.3799 104.14) (end 169.3799 104.2035) (width 0.25) (layer F.Cu) (net 2))
  (segment (start 169.3799 104.2035) (end 170.2054 104.521) (width 0.25) (layer F.Cu) (net 2) (tstamp 5615D669))
  (via (at 170.2054 104.521) (size 0.6) (drill 0.4) (layers F.Cu B.Cu) (net 2))
  (segment (start 165.5734 102.362) (end 165.5734 102.862) (width 0.25) (layer F.Cu) (net 2))
  (segment (start 165.5734 102.862) (end 165.5654 102.87) (width 0.25) (layer F.Cu) (net 2) (tstamp 5615D40F))
  (segment (start 169.3799 104.14) (end 170.4594 104.14) (width 0.25) (layer F.Cu) (net 2) (tstamp 5615D667))
  (segment (start 170.4594 104.14) (end 170.4594 104.14) (width 0.25) (layer F.Cu) (net 2) (tstamp 5615D819))
  (segment (start 172.8924 109.2) (end 170.0784 109.2) (width 0.25) (layer F.Cu) (net 2) (tstamp 5615D3FF))
  (segment (start 173.6344 108.458) (end 172.8924 109.2) (width 0.25) (layer F.Cu) (net 2) (tstamp 5615D3F9))
  (segment (start 173.6344 107.315) (end 173.6344 108.458) (width 0.25) (layer F.Cu) (net 2) (tstamp 5615D3F3))
  (segment (start 170.4594 104.14) (end 173.6344 107.315) (width 0.25) (layer F.Cu) (net 2) (tstamp 5615D3F1))
  (segment (start 169.5034 103.362) (end 169.5704 103.429) (width 0.25) (layer F.Cu) (net 2) (tstamp 5615D3D2))
  (segment (start 167.5384 109.2) (end 170.0784 109.2) (width 0.25) (layer F.Cu) (net 2) (tstamp 5615D3B5))
  (segment (start 145.3442 101.5492) (end 145.7579 101.5492) (width 0.25) (layer F.Cu) (net 3))
  (segment (start 145.7579 101.5492) (end 146.7866 100.5205) (width 0.25) (layer F.Cu) (net 3) (tstamp 562007CB))
  (segment (start 146.7866 100.5205) (end 148.3157 100.5205) (width 0.25) (layer F.Cu) (net 3) (tstamp 562007CC))
  (segment (start 148.1887 100.6475) (end 148.3157 100.5205) (width 0.25) (layer F.Cu) (net 3) (tstamp 561F10C6) (status 30))
  (segment (start 145.3442 101.5492) (end 145.3442 101.4422) (width 0.25) (layer F.Cu) (net 3) (status 30))
  (segment (start 145.3442 101.5492) (end 145.6182 101.5492) (width 0.25) (layer F.Cu) (net 3) (status 30))
  (segment (start 142.8442 101.5492) (end 140.4412 101.5492) (width 0.25) (layer F.Cu) (net 4))
  (segment (start 140.4412 101.5492) (end 140.3396 101.6508) (width 0.25) (layer F.Cu) (net 4) (tstamp 56200A81))
  (segment (start 140.4412 101.7651) (end 140.4031 101.8032) (width 0.25) (layer F.Cu) (net 4) (tstamp 562007D6) (status 30))
  (segment (start 142.7569 99.2378) (end 142.7569 101.4619) (width 0.25) (layer F.Cu) (net 4))
  (segment (start 142.7569 101.4619) (end 142.8442 101.5492) (width 0.25) (layer F.Cu) (net 4) (tstamp 562007D3))
  (segment (start 142.6299 99.3648) (end 142.8569 99.5918) (width 0.25) (layer F.Cu) (net 4) (tstamp 5615D255) (status 30))
  (segment (start 142.8569 99.5918) (end 142.8442 101.5492) (width 0.25) (layer F.Cu) (net 4) (tstamp 5615D258) (status 20))
  (segment (start 159.7114 102.616) (end 158.5214 102.616) (width 0.25) (layer F.Cu) (net 5))
  (segment (start 156.8069 104.3305) (end 153.7157 104.3305) (width 0.25) (layer F.Cu) (net 5) (tstamp 56200A7A))
  (segment (start 158.5214 102.616) (end 156.8069 104.3305) (width 0.25) (layer F.Cu) (net 5) (tstamp 56200A78))
  (segment (start 153.7157 104.3305) (end 152.6667 104.3305) (width 0.25) (layer F.Cu) (net 5))
  (segment (start 152.2657 104.7315) (end 152.2657 109.2835) (width 0.25) (layer F.Cu) (net 5) (tstamp 561F2541))
  (segment (start 152.6667 104.3305) (end 152.2657 104.7315) (width 0.25) (layer F.Cu) (net 5) (tstamp 561F2540))
  (segment (start 167.0384 104.327) (end 167.0384 106.2) (width 0.25) (layer F.Cu) (net 6))
  (segment (start 167.0384 106.2) (end 167.5384 106.7) (width 0.25) (layer F.Cu) (net 6) (tstamp 5615D1B9))
  (segment (start 167.5384 104.327) (end 167.5384 105.283) (width 0.25) (layer F.Cu) (net 7))
  (segment (start 168.5544 105.283) (end 169.9714 106.7) (width 0.25) (layer F.Cu) (net 7) (tstamp 5615D1C8))
  (segment (start 167.5384 105.283) (end 168.5544 105.283) (width 0.25) (layer F.Cu) (net 7) (tstamp 5615D1C1))
  (segment (start 169.9714 106.7) (end 170.0784 106.7) (width 0.25) (layer F.Cu) (net 7) (tstamp 5615D1CD))
  (segment (start 166.5384 100.397) (end 166.5384 99.056) (width 0.25) (layer F.Cu) (net 8))
  (segment (start 166.5384 99.056) (end 165.7604 98.278) (width 0.25) (layer F.Cu) (net 8) (tstamp 5615E216))
  (segment (start 165.7604 98.278) (end 165.2324 98.278) (width 0.25) (layer F.Cu) (net 8) (status 30))
  (segment (start 165.2324 98.278) (end 166.470758 97.282) (width 0.25) (layer F.Cu) (net 8) (tstamp 5615E007) (status 10))
  (segment (start 177.8254 97.282) (end 180.4924 99.949) (width 0.25) (layer F.Cu) (net 8) (tstamp 5615E010))
  (segment (start 166.470758 97.282) (end 177.8254 97.282) (width 0.25) (layer F.Cu) (net 8) (tstamp 5615E00B))
  (segment (start 143.4173 107.1245) (end 140.7333 107.1245) (width 0.25) (layer F.Cu) (net 9))
  (segment (start 140.7333 107.1245) (end 140.3396 106.7308) (width 0.25) (layer F.Cu) (net 9) (tstamp 56200A7E))
  (segment (start 143.4173 107.1245) (end 143.4173 109.3089) (width 0.25) (layer F.Cu) (net 9))
  (segment (start 143.4173 109.3089) (end 143.3957 109.3305) (width 0.25) (layer F.Cu) (net 9) (tstamp 562007C2))
  (segment (start 142.9601 106.6673) (end 143.4173 107.1245) (width 0.25) (layer F.Cu) (net 9) (tstamp 562007A5))
  (segment (start 143.4173 107.1245) (end 143.4173 106.7143) (width 0.25) (layer F.Cu) (net 9) (status 30))
  (segment (start 167.0384 100.397) (end 167.0384 98.417) (width 0.25) (layer F.Cu) (net 10))
  (segment (start 175.9204 97.917) (end 177.9524 99.949) (width 0.25) (layer F.Cu) (net 10) (tstamp 5615DF79))
  (segment (start 167.5384 97.917) (end 175.9204 97.917) (width 0.25) (layer F.Cu) (net 10) (tstamp 5615DF70))
  (segment (start 167.0384 98.417) (end 167.5384 97.917) (width 0.25) (layer F.Cu) (net 10) (tstamp 5615DF6A))
  (segment (start 167.5384 100.397) (end 167.5384 98.621002) (width 0.25) (layer F.Cu) (net 11))
  (segment (start 173.8884 98.425) (end 177.9524 102.489) (width 0.25) (layer F.Cu) (net 11) (tstamp 5615DF94))
  (segment (start 167.734402 98.425) (end 173.8884 98.425) (width 0.25) (layer F.Cu) (net 11) (tstamp 5615DF8F))
  (segment (start 167.5384 98.621002) (end 167.734402 98.425) (width 0.25) (layer F.Cu) (net 11) (tstamp 5615DF87))
  (segment (start 168.0384 100.397) (end 168.0384 99.195) (width 0.25) (layer F.Cu) (net 12))
  (segment (start 171.8564 98.933) (end 177.9524 105.029) (width 0.25) (layer F.Cu) (net 12) (tstamp 5615DFB5))
  (segment (start 168.3004 98.933) (end 171.8564 98.933) (width 0.25) (layer F.Cu) (net 12) (tstamp 5615DFA4))
  (segment (start 168.0384 99.195) (end 168.3004 98.933) (width 0.25) (layer F.Cu) (net 12) (tstamp 5615DFA0))
  (segment (start 168.5384 100.397) (end 168.5384 99.838) (width 0.25) (layer F.Cu) (net 13))
  (segment (start 169.9514 99.568) (end 177.9524 107.569) (width 0.25) (layer F.Cu) (net 13) (tstamp 5615DFC7))
  (segment (start 168.8084 99.568) (end 169.9514 99.568) (width 0.25) (layer F.Cu) (net 13) (tstamp 5615DFC3))
  (segment (start 168.5384 99.838) (end 168.8084 99.568) (width 0.25) (layer F.Cu) (net 13) (tstamp 5615DFBF))
  (segment (start 148.3157 105.6005) (end 149.6187 105.6005) (width 0.25) (layer F.Cu) (net 14))
  (segment (start 149.7657 105.7475) (end 149.7657 109.2835) (width 0.25) (layer F.Cu) (net 14) (tstamp 561F2545))
  (segment (start 149.6187 105.6005) (end 149.7657 105.7475) (width 0.25) (layer F.Cu) (net 14) (tstamp 561F2544))
  (segment (start 148.3157 104.3305) (end 146.4437 104.3305) (width 0.25) (layer F.Cu) (net 14))
  (segment (start 148.3157 103.0605) (end 146.6977 103.0605) (width 0.25) (layer F.Cu) (net 14))
  (segment (start 146.6977 103.0605) (end 146.4437 103.3145) (width 0.25) (layer F.Cu) (net 14) (tstamp 561F1121))
  (segment (start 148.3157 101.7905) (end 147.5867 101.7905) (width 0.25) (layer F.Cu) (net 14) (status 30))
  (segment (start 147.5867 101.7905) (end 146.4437 103.0605) (width 0.25) (layer F.Cu) (net 14) (tstamp 561F10E0) (status 10))
  (segment (start 146.4437 103.0605) (end 146.4437 103.3145) (width 0.25) (layer F.Cu) (net 14) (tstamp 561F10E3))
  (segment (start 146.4437 103.3145) (end 146.4437 104.3305) (width 0.25) (layer F.Cu) (net 14) (tstamp 561F1124))
  (segment (start 146.4437 104.3305) (end 146.4437 105.2195) (width 0.25) (layer F.Cu) (net 14) (tstamp 561F1132))
  (segment (start 146.4437 105.2195) (end 146.9517 105.7275) (width 0.25) (layer F.Cu) (net 14) (tstamp 561F10E7))
  (segment (start 146.9517 105.7275) (end 148.3157 105.6005) (width 0.25) (layer F.Cu) (net 14) (tstamp 561F10E8) (status 20))
  (segment (start 156.5402 105.9761) (end 156.4567 105.9761) (width 0.25) (layer F.Cu) (net 15))
  (segment (start 156.4567 105.9761) (end 155.2448 107.188) (width 0.25) (layer F.Cu) (net 15) (tstamp 56200A91))
  (segment (start 156.1973 114.3762) (end 156.1973 116.6241) (width 0.25) (layer F.Cu) (net 15) (tstamp 56200A95))
  (segment (start 155.2448 113.4237) (end 156.1973 114.3762) (width 0.25) (layer F.Cu) (net 15) (tstamp 56200A94))
  (segment (start 155.2448 107.188) (end 155.2448 113.4237) (width 0.25) (layer F.Cu) (net 15) (tstamp 56200A92))
  (segment (start 156.1973 116.6241) (end 155.7274 117.094) (width 0.25) (layer F.Cu) (net 15) (tstamp 56200A96))
  (segment (start 151.2697 113.8555) (end 154.6479 113.8555) (width 0.25) (layer F.Cu) (net 15))
  (segment (start 145.6563 107.1245) (end 151.2697 113.8555) (width 0.25) (layer F.Cu) (net 15) (tstamp 561F2071) (status 10))
  (segment (start 155.7274 114.935) (end 155.7274 117.094) (width 0.25) (layer F.Cu) (net 15) (tstamp 56200A87))
  (segment (start 154.6479 113.8555) (end 155.7274 114.935) (width 0.25) (layer F.Cu) (net 15) (tstamp 56200A85))
  (segment (start 153.7157 105.6005) (end 156.1646 105.6005) (width 0.25) (layer F.Cu) (net 15))
  (segment (start 156.1646 105.6005) (end 156.5402 105.9761) (width 0.25) (layer F.Cu) (net 15) (tstamp 56200972))
  (segment (start 146.1173 107.1245) (end 145.6563 107.1245) (width 0.25) (layer F.Cu) (net 15) (status 30))
  (segment (start 162.4114 102.616) (end 162.4114 95.584) (width 0.25) (layer F.Cu) (net 16) (status 20))
  (segment (start 162.4114 95.584) (end 162.3314 95.504) (width 0.25) (layer F.Cu) (net 16) (tstamp 561F1EAB) (status 30))
  (segment (start 162.4114 102.616) (end 163.7284 102.616) (width 0.25) (layer F.Cu) (net 16))
  (segment (start 164.4824 101.862) (end 165.5734 101.862) (width 0.25) (layer F.Cu) (net 16) (tstamp 561F1ABF))
  (segment (start 163.7284 102.616) (end 164.4824 101.862) (width 0.25) (layer F.Cu) (net 16) (tstamp 561F1ABC))
  (segment (start 153.7157 103.0605) (end 151.8285 103.0605) (width 0.25) (layer F.Cu) (net 17))
  (segment (start 151.8285 91.567) (end 152.4635 91.567) (width 0.25) (layer F.Cu) (net 17) (tstamp 56200A6B))
  (segment (start 150.3426 93.0529) (end 151.8285 91.567) (width 0.25) (layer F.Cu) (net 17) (tstamp 56200A6A))
  (segment (start 150.3426 101.5746) (end 150.3426 93.0529) (width 0.25) (layer F.Cu) (net 17) (tstamp 56200A68))
  (segment (start 151.8285 103.0605) (end 150.3426 101.5746) (width 0.25) (layer F.Cu) (net 17) (tstamp 56200A66))
  (segment (start 183.515 104.5464) (end 180.4924 107.569) (width 0.25) (layer F.Cu) (net 17) (tstamp 561F1D4C))
  (segment (start 183.515 94.7166) (end 183.515 104.5464) (width 0.25) (layer F.Cu) (net 17) (tstamp 561F1D42))
  (segment (start 180.3654 91.567) (end 183.515 94.7166) (width 0.25) (layer F.Cu) (net 17) (tstamp 561F1D3F))
  (segment (start 152.4635 91.567) (end 180.3654 91.567) (width 0.25) (layer F.Cu) (net 17) (tstamp 56200A6E))
  (segment (start 153.0985 92.456) (end 151.4094 94.1451) (width 0.25) (layer F.Cu) (net 18))
  (segment (start 152.3111 101.7905) (end 153.7157 101.7905) (width 0.25) (layer F.Cu) (net 18) (tstamp 56200A5D))
  (segment (start 151.4094 100.8888) (end 152.3111 101.7905) (width 0.25) (layer F.Cu) (net 18) (tstamp 56200A5C))
  (segment (start 151.4094 94.1451) (end 151.4094 100.8888) (width 0.25) (layer F.Cu) (net 18) (tstamp 56200A5A))
  (segment (start 182.5625 102.9589) (end 180.4924 105.029) (width 0.25) (layer F.Cu) (net 18) (tstamp 561F1D12))
  (segment (start 182.5625 95.0341) (end 182.5625 102.9589) (width 0.25) (layer F.Cu) (net 18) (tstamp 561F1D0E))
  (segment (start 179.9844 92.456) (end 182.5625 95.0341) (width 0.25) (layer F.Cu) (net 18) (tstamp 561F1D0A))
  (segment (start 153.0985 92.456) (end 179.9844 92.456) (width 0.25) (layer F.Cu) (net 18) (tstamp 56200A58))

  (zone (net 2) (net_name GND) (layer B.Cu) (tstamp 5615CDAA) (hatch edge 0.508)
    (connect_pads (clearance 0.508))
    (min_thickness 0.254)
    (fill yes (arc_segments 16) (thermal_gap 0.508) (thermal_bridge_width 0.508))
    (polygon
      (pts
        (xy 119.0244 90.297) (xy 185.0644 90.297) (xy 185.0644 127.508) (xy 119.0244 127.508)
      )
    )
    (filled_polygon
      (pts
        (xy 184.315 90.845034) (xy 184.108199 90.759162) (xy 183.736233 90.758838) (xy 183.392457 90.900883) (xy 183.129208 91.163673)
        (xy 182.986562 91.507201) (xy 182.986238 91.879167) (xy 183.128283 92.222943) (xy 183.391073 92.486192) (xy 183.734601 92.628838)
        (xy 184.106567 92.629162) (xy 184.315 92.543039) (xy 184.315 124.315) (xy 135.685 124.315) (xy 135.685 117.221)
        (xy 151.79929 117.221) (xy 151.79929 117.97538) (xy 151.953554 118.496919) (xy 152.29566 118.919724) (xy 152.773525 119.179427)
        (xy 152.845726 119.193783) (xy 153.0604 119.071162) (xy 153.0604 117.221) (xy 151.79929 117.221) (xy 135.685 117.221)
        (xy 135.685 116.21262) (xy 151.79929 116.21262) (xy 151.79929 116.967) (xy 153.0604 116.967) (xy 153.0604 115.116838)
        (xy 153.3144 115.116838) (xy 153.3144 116.967) (xy 153.3344 116.967) (xy 153.3344 117.221) (xy 153.3144 117.221)
        (xy 153.3144 119.071162) (xy 153.529074 119.193783) (xy 153.601275 119.179427) (xy 154.07914 118.919724) (xy 154.421246 118.496919)
        (xy 154.444384 118.418694) (xy 154.444954 118.421561) (xy 154.745858 118.871896) (xy 155.196193 119.1728) (xy 155.7274 119.278464)
        (xy 156.258607 119.1728) (xy 156.708942 118.871896) (xy 157.009846 118.421561) (xy 157.11551 117.890354) (xy 157.11551 116.297646)
        (xy 157.009846 115.766439) (xy 156.708942 115.316104) (xy 156.258607 115.0152) (xy 155.7274 114.909536) (xy 155.196193 115.0152)
        (xy 154.745858 115.316104) (xy 154.444954 115.766439) (xy 154.444384 115.769306) (xy 154.421246 115.691081) (xy 154.07914 115.268276)
        (xy 153.601275 115.008573) (xy 153.529074 114.994217) (xy 153.3144 115.116838) (xy 153.0604 115.116838) (xy 152.845726 114.994217)
        (xy 152.773525 115.008573) (xy 152.29566 115.268276) (xy 151.953554 115.691081) (xy 151.79929 116.21262) (xy 135.685 116.21262)
        (xy 135.685 105.9688) (xy 138.59234 105.9688) (xy 138.59234 107.4928) (xy 138.636618 107.728117) (xy 138.77569 107.944241)
        (xy 138.98789 108.089231) (xy 139.23978 108.14024) (xy 141.43942 108.14024) (xy 141.674737 108.095962) (xy 141.890861 107.95689)
        (xy 142.035851 107.74469) (xy 142.08686 107.4928) (xy 142.08686 105.9688) (xy 142.042582 105.733483) (xy 141.90351 105.517359)
        (xy 141.69131 105.372369) (xy 141.43942 105.32136) (xy 139.23978 105.32136) (xy 139.004463 105.365638) (xy 138.788339 105.50471)
        (xy 138.643349 105.71691) (xy 138.59234 105.9688) (xy 135.685 105.9688) (xy 135.685 101.6508) (xy 138.570793 101.6508)
        (xy 138.677133 102.185409) (xy 138.979965 102.638628) (xy 139.433184 102.94146) (xy 139.967793 103.0478) (xy 140.711407 103.0478)
        (xy 141.246016 102.94146) (xy 141.699235 102.638628) (xy 141.799213 102.489) (xy 176.424441 102.489) (xy 176.538515 103.062489)
        (xy 176.863371 103.54867) (xy 177.178152 103.759) (xy 176.863371 103.96933) (xy 176.538515 104.455511) (xy 176.424441 105.029)
        (xy 176.538515 105.602489) (xy 176.863371 106.08867) (xy 177.178152 106.299) (xy 176.863371 106.50933) (xy 176.538515 106.995511)
        (xy 176.424441 107.569) (xy 176.538515 108.142489) (xy 176.863371 108.62867) (xy 177.349552 108.953526) (xy 177.923041 109.0676)
        (xy 177.981759 109.0676) (xy 178.555248 108.953526) (xy 179.041429 108.62867) (xy 179.2224 108.357828) (xy 179.403371 108.62867)
        (xy 179.889552 108.953526) (xy 180.463041 109.0676) (xy 180.521759 109.0676) (xy 181.095248 108.953526) (xy 181.581429 108.62867)
        (xy 181.906285 108.142489) (xy 182.020359 107.569) (xy 181.906285 106.995511) (xy 181.581429 106.50933) (xy 181.266648 106.299)
        (xy 181.581429 106.08867) (xy 181.906285 105.602489) (xy 182.020359 105.029) (xy 181.906285 104.455511) (xy 181.581429 103.96933)
        (xy 181.258172 103.753336) (xy 181.38089 103.695821) (xy 181.775088 103.263947) (xy 181.947358 102.848026) (xy 181.826217 102.616)
        (xy 180.6194 102.616) (xy 180.6194 102.636) (xy 180.3654 102.636) (xy 180.3654 102.616) (xy 180.3454 102.616)
        (xy 180.3454 102.362) (xy 180.3654 102.362) (xy 180.3654 102.342) (xy 180.6194 102.342) (xy 180.6194 102.362)
        (xy 181.826217 102.362) (xy 181.947358 102.129974) (xy 181.775088 101.714053) (xy 181.38089 101.282179) (xy 181.258172 101.224664)
        (xy 181.581429 101.00867) (xy 181.906285 100.522489) (xy 182.020359 99.949) (xy 181.906285 99.375511) (xy 181.581429 98.88933)
        (xy 181.095248 98.564474) (xy 180.521759 98.4504) (xy 180.463041 98.4504) (xy 179.889552 98.564474) (xy 179.423958 98.875574)
        (xy 179.419162 98.850083) (xy 179.28009 98.633959) (xy 179.06789 98.488969) (xy 178.816 98.43796) (xy 177.0888 98.43796)
        (xy 176.853483 98.482238) (xy 176.637359 98.62131) (xy 176.492369 98.83351) (xy 176.44136 99.0854) (xy 176.44136 100.8126)
        (xy 176.485638 101.047917) (xy 176.62471 101.264041) (xy 176.83691 101.409031) (xy 176.880531 101.417864) (xy 176.863371 101.42933)
        (xy 176.538515 101.915511) (xy 176.424441 102.489) (xy 141.799213 102.489) (xy 142.002067 102.185409) (xy 142.108407 101.6508)
        (xy 142.002067 101.116191) (xy 141.699235 100.662972) (xy 141.246016 100.36014) (xy 140.711407 100.2538) (xy 139.967793 100.2538)
        (xy 139.433184 100.36014) (xy 138.979965 100.662972) (xy 138.677133 101.116191) (xy 138.570793 101.6508) (xy 135.685 101.6508)
        (xy 135.685 94.098046) (xy 154.49169 94.098046) (xy 154.49169 95.690754) (xy 154.597354 96.221961) (xy 154.898258 96.672296)
        (xy 155.348593 96.9732) (xy 155.8798 97.078864) (xy 156.411007 96.9732) (xy 156.861342 96.672296) (xy 157.162246 96.221961)
        (xy 157.162816 96.219094) (xy 157.185954 96.297319) (xy 157.52806 96.720124) (xy 158.005925 96.979827) (xy 158.078126 96.994183)
        (xy 158.2928 96.871562) (xy 158.2928 95.0214) (xy 158.5468 95.0214) (xy 158.5468 96.871562) (xy 158.761474 96.994183)
        (xy 158.833675 96.979827) (xy 159.31154 96.720124) (xy 159.653646 96.297319) (xy 159.80791 95.77578) (xy 159.80791 95.742935)
        (xy 161.124691 95.742935) (xy 161.307982 96.186535) (xy 161.64708 96.526225) (xy 162.090359 96.71029) (xy 162.570335 96.710709)
        (xy 163.013935 96.527418) (xy 163.353625 96.18832) (xy 163.53769 95.745041) (xy 163.538109 95.265065) (xy 163.354818 94.821465)
        (xy 163.01572 94.481775) (xy 162.572441 94.29771) (xy 162.092465 94.297291) (xy 161.648865 94.480582) (xy 161.309175 94.81968)
        (xy 161.12511 95.262959) (xy 161.124691 95.742935) (xy 159.80791 95.742935) (xy 159.80791 95.0214) (xy 158.5468 95.0214)
        (xy 158.2928 95.0214) (xy 158.2728 95.0214) (xy 158.2728 94.7674) (xy 158.2928 94.7674) (xy 158.2928 92.917238)
        (xy 158.5468 92.917238) (xy 158.5468 94.7674) (xy 159.80791 94.7674) (xy 159.80791 94.01302) (xy 159.653646 93.491481)
        (xy 159.31154 93.068676) (xy 158.833675 92.808973) (xy 158.761474 92.794617) (xy 158.5468 92.917238) (xy 158.2928 92.917238)
        (xy 158.078126 92.794617) (xy 158.005925 92.808973) (xy 157.52806 93.068676) (xy 157.185954 93.491481) (xy 157.162816 93.569706)
        (xy 157.162246 93.566839) (xy 156.861342 93.116504) (xy 156.411007 92.8156) (xy 155.8798 92.709936) (xy 155.348593 92.8156)
        (xy 154.898258 93.116504) (xy 154.597354 93.566839) (xy 154.49169 94.098046) (xy 135.685 94.098046) (xy 135.685 90.685)
        (xy 184.315 90.685)
      )
    )
  )
  (zone (net 2) (net_name GND) (layer F.Cu) (tstamp 5615F92E) (hatch edge 0.508)
    (connect_pads (clearance 0.508))
    (min_thickness 0.254)
    (fill yes (arc_segments 16) (thermal_gap 0.508) (thermal_bridge_width 0.508))
    (polygon
      (pts
        (xy 185.0644 127.381) (xy 119.0244 127.381) (xy 119.0244 90.424) (xy 185.0644 90.297) (xy 185.0644 127.381)
      )
    )
    (filled_polygon
      (pts
        (xy 184.315 90.845034) (xy 184.108199 90.759162) (xy 183.736233 90.758838) (xy 183.392457 90.900883) (xy 183.129208 91.163673)
        (xy 182.986562 91.507201) (xy 182.986238 91.879167) (xy 183.128283 92.222943) (xy 183.391073 92.486192) (xy 183.734601 92.628838)
        (xy 184.106567 92.629162) (xy 184.315 92.543039) (xy 184.315 124.315) (xy 135.685 124.315) (xy 135.685 117.221)
        (xy 151.79929 117.221) (xy 151.79929 117.97538) (xy 151.953554 118.496919) (xy 152.29566 118.919724) (xy 152.773525 119.179427)
        (xy 152.845726 119.193783) (xy 153.0604 119.071162) (xy 153.0604 117.221) (xy 151.79929 117.221) (xy 135.685 117.221)
        (xy 135.685 116.21262) (xy 151.79929 116.21262) (xy 151.79929 116.967) (xy 153.0604 116.967) (xy 153.0604 115.116838)
        (xy 152.845726 114.994217) (xy 152.773525 115.008573) (xy 152.29566 115.268276) (xy 151.953554 115.691081) (xy 151.79929 116.21262)
        (xy 135.685 116.21262) (xy 135.685 112.31625) (xy 142.1107 112.31625) (xy 142.1107 112.906809) (xy 142.207373 113.140198)
        (xy 142.386001 113.318827) (xy 142.61939 113.4155) (xy 143.10995 113.4155) (xy 143.2687 113.25675) (xy 143.2687 112.1575)
        (xy 143.5227 112.1575) (xy 143.5227 113.25675) (xy 143.68145 113.4155) (xy 144.17201 113.4155) (xy 144.405399 113.318827)
        (xy 144.584027 113.140198) (xy 144.6807 112.906809) (xy 144.6807 112.31625) (xy 144.52195 112.1575) (xy 143.5227 112.1575)
        (xy 143.2687 112.1575) (xy 142.26945 112.1575) (xy 142.1107 112.31625) (xy 135.685 112.31625) (xy 135.685 101.6508)
        (xy 138.570793 101.6508) (xy 138.677133 102.185409) (xy 138.979965 102.638628) (xy 139.433184 102.94146) (xy 139.967793 103.0478)
        (xy 140.711407 103.0478) (xy 141.246016 102.94146) (xy 141.673896 102.655559) (xy 141.84231 102.770631) (xy 142.0942 102.82164)
        (xy 143.5942 102.82164) (xy 143.829517 102.777362) (xy 144.045641 102.63829) (xy 144.093334 102.568489) (xy 144.13011 102.625641)
        (xy 144.34231 102.770631) (xy 144.5942 102.82164) (xy 145.725112 102.82164) (xy 145.708802 102.934303) (xy 145.6837 103.0605)
        (xy 145.6837 105.2195) (xy 145.741552 105.510339) (xy 145.906299 105.756901) (xy 145.976458 105.82706) (xy 145.3673 105.82706)
        (xy 145.131983 105.871338) (xy 144.915859 106.01041) (xy 144.770869 106.22261) (xy 144.768219 106.235697) (xy 144.63139 106.023059)
        (xy 144.41919 105.878069) (xy 144.1673 105.82706) (xy 142.6673 105.82706) (xy 142.431983 105.871338) (xy 142.215859 106.01041)
        (xy 142.08686 106.199206) (xy 142.08686 105.9688) (xy 142.042582 105.733483) (xy 141.90351 105.517359) (xy 141.69131 105.372369)
        (xy 141.43942 105.32136) (xy 139.23978 105.32136) (xy 139.004463 105.365638) (xy 138.788339 105.50471) (xy 138.643349 105.71691)
        (xy 138.59234 105.9688) (xy 138.59234 107.4928) (xy 138.636618 107.728117) (xy 138.77569 107.944241) (xy 138.98789 108.089231)
        (xy 139.23978 108.14024) (xy 141.43942 108.14024) (xy 141.674737 108.095962) (xy 141.890861 107.95689) (xy 141.940323 107.8845)
        (xy 142.040558 107.8845) (xy 142.064138 108.009817) (xy 142.20321 108.225941) (xy 142.214261 108.233492) (xy 142.149269 108.32861)
        (xy 142.09826 108.5805) (xy 142.09826 110.0805) (xy 142.142538 110.315817) (xy 142.28161 110.531941) (xy 142.49381 110.676931)
        (xy 142.52719 110.683691) (xy 142.386001 110.742173) (xy 142.207373 110.920802) (xy 142.1107 111.154191) (xy 142.1107 111.74475)
        (xy 142.26945 111.9035) (xy 143.2687 111.9035) (xy 143.2687 111.8835) (xy 143.5227 111.8835) (xy 143.5227 111.9035)
        (xy 144.52195 111.9035) (xy 144.6807 111.74475) (xy 144.6807 111.154191) (xy 144.584027 110.920802) (xy 144.405399 110.742173)
        (xy 144.269413 110.685846) (xy 144.281017 110.683662) (xy 144.497141 110.54459) (xy 144.642131 110.33239) (xy 144.69314 110.0805)
        (xy 144.69314 108.5805) (xy 144.648862 108.345183) (xy 144.591536 108.256096) (xy 144.618741 108.23859) (xy 144.763731 108.02639)
        (xy 144.766381 108.013303) (xy 144.90321 108.225941) (xy 145.11541 108.370931) (xy 145.3673 108.42194) (xy 145.748711 108.42194)
        (xy 150.686032 114.342257) (xy 150.713025 114.364056) (xy 150.732299 114.392901) (xy 150.827578 114.456564) (xy 150.916735 114.528564)
        (xy 150.950014 114.538373) (xy 150.978861 114.557648) (xy 151.091255 114.580005) (xy 151.201174 114.612404) (xy 151.235672 114.608731)
        (xy 151.2697 114.6155) (xy 154.333098 114.6155) (xy 154.918408 115.20081) (xy 154.745858 115.316104) (xy 154.444954 115.766439)
        (xy 154.444384 115.769306) (xy 154.421246 115.691081) (xy 154.07914 115.268276) (xy 153.601275 115.008573) (xy 153.529074 114.994217)
        (xy 153.3144 115.116838) (xy 153.3144 116.967) (xy 153.3344 116.967) (xy 153.3344 117.221) (xy 153.3144 117.221)
        (xy 153.3144 119.071162) (xy 153.529074 119.193783) (xy 153.601275 119.179427) (xy 154.07914 118.919724) (xy 154.421246 118.496919)
        (xy 154.444384 118.418694) (xy 154.444954 118.421561) (xy 154.745858 118.871896) (xy 155.196193 119.1728) (xy 155.7274 119.278464)
        (xy 156.258607 119.1728) (xy 156.708942 118.871896) (xy 157.009846 118.421561) (xy 157.11551 117.890354) (xy 157.11551 116.297646)
        (xy 157.009846 115.766439) (xy 156.9573 115.687798) (xy 156.9573 114.3762) (xy 156.899448 114.085361) (xy 156.899448 114.08536)
        (xy 156.734701 113.838799) (xy 156.0048 113.108898) (xy 156.0048 109.8611) (xy 156.25445 109.8611) (xy 156.4132 109.70235)
        (xy 156.4132 108.6031) (xy 156.6672 108.6031) (xy 156.6672 109.70235) (xy 156.82595 109.8611) (xy 157.29151 109.8611)
        (xy 157.524899 109.764427) (xy 157.703527 109.585798) (xy 157.8002 109.352409) (xy 157.8002 108.76185) (xy 157.64145 108.6031)
        (xy 156.6672 108.6031) (xy 156.4132 108.6031) (xy 156.3932 108.6031) (xy 156.3932 108.59675) (xy 163.7384 108.59675)
        (xy 163.7384 109.187309) (xy 163.835073 109.420698) (xy 164.013701 109.599327) (xy 164.24709 109.696) (xy 164.71265 109.696)
        (xy 164.8714 109.53725) (xy 164.8714 108.438) (xy 165.1254 108.438) (xy 165.1254 109.53725) (xy 165.28415 109.696)
        (xy 165.74971 109.696) (xy 165.983099 109.599327) (xy 166.096675 109.48575) (xy 166.2784 109.48575) (xy 166.2784 110.076309)
        (xy 166.375073 110.309698) (xy 166.553701 110.488327) (xy 166.78709 110.585) (xy 167.25265 110.585) (xy 167.4114 110.42625)
        (xy 167.4114 109.327) (xy 167.6654 109.327) (xy 167.6654 110.42625) (xy 167.82415 110.585) (xy 168.28971 110.585)
        (xy 168.523099 110.488327) (xy 168.701727 110.309698) (xy 168.7984 110.076309) (xy 168.7984 109.48575) (xy 168.8184 109.48575)
        (xy 168.8184 110.076309) (xy 168.915073 110.309698) (xy 169.093701 110.488327) (xy 169.32709 110.585) (xy 169.79265 110.585)
        (xy 169.9514 110.42625) (xy 169.9514 109.327) (xy 170.2054 109.327) (xy 170.2054 110.42625) (xy 170.36415 110.585)
        (xy 170.82971 110.585) (xy 171.063099 110.488327) (xy 171.241727 110.309698) (xy 171.3384 110.076309) (xy 171.3384 109.48575)
        (xy 171.17965 109.327) (xy 170.2054 109.327) (xy 169.9514 109.327) (xy 168.97715 109.327) (xy 168.8184 109.48575)
        (xy 168.7984 109.48575) (xy 168.63965 109.327) (xy 167.6654 109.327) (xy 167.4114 109.327) (xy 166.43715 109.327)
        (xy 166.2784 109.48575) (xy 166.096675 109.48575) (xy 166.161727 109.420698) (xy 166.2584 109.187309) (xy 166.2584 108.59675)
        (xy 166.09965 108.438) (xy 165.1254 108.438) (xy 164.8714 108.438) (xy 163.89715 108.438) (xy 163.7384 108.59675)
        (xy 156.3932 108.59675) (xy 156.3932 108.3491) (xy 156.4132 108.3491) (xy 156.4132 108.3291) (xy 156.6672 108.3291)
        (xy 156.6672 108.3491) (xy 157.64145 108.3491) (xy 157.8002 108.19035) (xy 157.8002 107.599791) (xy 157.703527 107.366402)
        (xy 157.56229 107.225164) (xy 157.616641 107.19019) (xy 157.761631 106.97799) (xy 157.81264 106.7261) (xy 157.81264 105.2261)
        (xy 157.768362 104.990783) (xy 157.62929 104.774659) (xy 157.515377 104.696825) (xy 158.496312 103.71589) (xy 158.49731 103.717441)
        (xy 158.70951 103.862431) (xy 158.9614 103.91344) (xy 160.276 103.91344) (xy 160.276 104.6099) (xy 160.333852 104.900739)
        (xy 160.498599 105.147301) (xy 161.699699 106.348401) (xy 161.946261 106.513148) (xy 162.2371 106.571) (xy 163.727842 106.571)
        (xy 163.770238 106.796317) (xy 163.90931 107.012441) (xy 163.977406 107.058969) (xy 163.835073 107.201302) (xy 163.7384 107.434691)
        (xy 163.7384 108.02525) (xy 163.89715 108.184) (xy 164.8714 108.184) (xy 164.8714 108.164) (xy 165.1254 108.164)
        (xy 165.1254 108.184) (xy 166.09965 108.184) (xy 166.2584 108.02525) (xy 166.2584 107.434691) (xy 166.161727 107.201302)
        (xy 166.02049 107.060064) (xy 166.074841 107.02509) (xy 166.219831 106.81289) (xy 166.26596 106.585098) (xy 166.26596 107.45)
        (xy 166.310238 107.685317) (xy 166.44931 107.901441) (xy 166.517406 107.947969) (xy 166.375073 108.090302) (xy 166.2784 108.323691)
        (xy 166.2784 108.91425) (xy 166.43715 109.073) (xy 167.4114 109.073) (xy 167.4114 109.053) (xy 167.6654 109.053)
        (xy 167.6654 109.073) (xy 168.63965 109.073) (xy 168.7984 108.91425) (xy 168.7984 108.323691) (xy 168.701727 108.090302)
        (xy 168.56049 107.949064) (xy 168.614841 107.91409) (xy 168.759831 107.70189) (xy 168.80831 107.462491) (xy 168.850238 107.685317)
        (xy 168.98931 107.901441) (xy 169.057406 107.947969) (xy 168.915073 108.090302) (xy 168.8184 108.323691) (xy 168.8184 108.91425)
        (xy 168.97715 109.073) (xy 169.9514 109.073) (xy 169.9514 109.053) (xy 170.2054 109.053) (xy 170.2054 109.073)
        (xy 171.17965 109.073) (xy 171.3384 108.91425) (xy 171.3384 108.323691) (xy 171.241727 108.090302) (xy 171.10049 107.949064)
        (xy 171.154841 107.91409) (xy 171.299831 107.70189) (xy 171.35084 107.45) (xy 171.35084 105.95) (xy 171.306562 105.714683)
        (xy 171.16749 105.498559) (xy 170.95529 105.353569) (xy 170.7034 105.30256) (xy 169.648762 105.30256) (xy 169.276862 104.93066)
        (xy 169.3234 104.818309) (xy 169.3234 104.61275) (xy 169.16465 104.454) (xy 168.3914 104.454) (xy 168.3914 104.25944)
        (xy 168.7884 104.25944) (xy 169.023717 104.215162) (xy 169.047279 104.2) (xy 169.16465 104.2) (xy 169.3764 103.98825)
        (xy 169.3764 103.876229) (xy 169.384831 103.86389) (xy 169.43584 103.612) (xy 169.43584 101.112) (xy 169.391562 100.876683)
        (xy 169.3764 100.853121) (xy 169.3764 100.73575) (xy 169.33584 100.69519) (xy 169.33584 100.328) (xy 169.636598 100.328)
        (xy 169.885598 100.577) (xy 169.78915 100.577) (xy 169.6304 100.73575) (xy 169.6304 103.98825) (xy 169.78915 104.147)
        (xy 169.994709 104.147) (xy 170.228098 104.050327) (xy 170.406727 103.871699) (xy 170.5034 103.63831) (xy 170.5034 103.59575)
        (xy 170.34465 103.437) (xy 170.341426 103.437) (xy 170.406727 103.371699) (xy 170.5034 103.13831) (xy 170.5034 103.08569)
        (xy 170.410744 102.862) (xy 170.5034 102.63831) (xy 170.5034 102.58569) (xy 170.410744 102.362) (xy 170.5034 102.13831)
        (xy 170.5034 102.08569) (xy 170.410744 101.862) (xy 170.5034 101.63831) (xy 170.5034 101.58569) (xy 170.406727 101.352301)
        (xy 170.341426 101.287) (xy 170.34465 101.287) (xy 170.470124 101.161526) (xy 176.499625 107.191027) (xy 176.424441 107.569)
        (xy 176.538515 108.142489) (xy 176.863371 108.62867) (xy 177.349552 108.953526) (xy 177.923041 109.0676) (xy 177.981759 109.0676)
        (xy 178.555248 108.953526) (xy 179.041429 108.62867) (xy 179.2224 108.357828) (xy 179.403371 108.62867) (xy 179.889552 108.953526)
        (xy 180.463041 109.0676) (xy 180.521759 109.0676) (xy 181.095248 108.953526) (xy 181.581429 108.62867) (xy 181.906285 108.142489)
        (xy 182.020359 107.569) (xy 181.945175 107.191027) (xy 184.052401 105.083801) (xy 184.217148 104.837239) (xy 184.275 104.5464)
        (xy 184.275 94.7166) (xy 184.217148 94.425761) (xy 184.052401 94.179199) (xy 180.902801 91.029599) (xy 180.656239 90.864852)
        (xy 180.3654 90.807) (xy 151.8285 90.807) (xy 151.537661 90.864852) (xy 151.291099 91.029599) (xy 149.805199 92.515499)
        (xy 149.640452 92.762061) (xy 149.5826 93.0529) (xy 149.5826 98.569374) (xy 149.425398 98.412173) (xy 149.192009 98.3155)
        (xy 148.60145 98.3155) (xy 148.4427 98.47425) (xy 148.4427 99.1235) (xy 148.4627 99.1235) (xy 148.4627 99.3775)
        (xy 148.4427 99.3775) (xy 148.4427 99.3975) (xy 148.1887 99.3975) (xy 148.1887 99.3775) (xy 147.08945 99.3775)
        (xy 146.9307 99.53625) (xy 146.9307 99.67681) (xy 146.965366 99.7605) (xy 146.8419 99.7605) (xy 146.8419 99.52355)
        (xy 146.68315 99.3648) (xy 145.5839 99.3648) (xy 145.5839 99.3848) (xy 145.3299 99.3848) (xy 145.3299 99.3648)
        (xy 145.3099 99.3648) (xy 145.3099 99.1108) (xy 145.3299 99.1108) (xy 145.3299 98.11155) (xy 145.5839 98.11155)
        (xy 145.5839 99.1108) (xy 146.68315 99.1108) (xy 146.8419 98.95205) (xy 146.8419 98.82419) (xy 146.9307 98.82419)
        (xy 146.9307 98.96475) (xy 147.08945 99.1235) (xy 148.1887 99.1235) (xy 148.1887 98.47425) (xy 148.02995 98.3155)
        (xy 147.439391 98.3155) (xy 147.206002 98.412173) (xy 147.027373 98.590801) (xy 146.9307 98.82419) (xy 146.8419 98.82419)
        (xy 146.8419 98.46149) (xy 146.745227 98.228101) (xy 146.566598 98.049473) (xy 146.333209 97.9528) (xy 145.74265 97.9528)
        (xy 145.5839 98.11155) (xy 145.3299 98.11155) (xy 145.17115 97.9528) (xy 144.580591 97.9528) (xy 144.347202 98.049473)
        (xy 144.168573 98.228101) (xy 144.112246 98.364087) (xy 144.110062 98.352483) (xy 143.97099 98.136359) (xy 143.75879 97.991369)
        (xy 143.5069 97.94036) (xy 142.0069 97.94036) (xy 141.771583 97.984638) (xy 141.555459 98.12371) (xy 141.410469 98.33591)
        (xy 141.35946 98.5878) (xy 141.35946 99.8878) (xy 141.403738 100.123117) (xy 141.54281 100.339241) (xy 141.682387 100.43461)
        (xy 141.642759 100.46011) (xy 141.565298 100.573478) (xy 141.246016 100.36014) (xy 140.711407 100.2538) (xy 139.967793 100.2538)
        (xy 139.433184 100.36014) (xy 138.979965 100.662972) (xy 138.677133 101.116191) (xy 138.570793 101.6508) (xy 135.685 101.6508)
        (xy 135.685 90.685) (xy 184.315 90.685)
      )
    )
    (filled_polygon
      (pts
        (xy 154.4848 113.0955) (xy 151.625494 113.0955) (xy 149.507596 110.55594) (xy 150.5157 110.55594) (xy 150.751017 110.511662)
        (xy 150.967141 110.37259) (xy 151.014834 110.302789) (xy 151.05161 110.359941) (xy 151.26381 110.504931) (xy 151.5157 110.55594)
        (xy 153.0157 110.55594) (xy 153.251017 110.511662) (xy 153.467141 110.37259) (xy 153.612131 110.16039) (xy 153.66314 109.9085)
        (xy 153.66314 108.6585) (xy 153.618862 108.423183) (xy 153.47979 108.207059) (xy 153.26759 108.062069) (xy 153.0257 108.013085)
        (xy 153.0257 107.81794) (xy 154.4657 107.81794) (xy 154.4848 107.814346)
      )
    )
    (filled_polygon
      (pts
        (xy 149.805199 102.112001) (xy 151.291099 103.597901) (xy 151.537661 103.762648) (xy 151.8285 103.8205) (xy 152.101898 103.8205)
        (xy 151.728299 104.194099) (xy 151.563552 104.440661) (xy 151.5057 104.7315) (xy 151.5057 108.012942) (xy 151.280383 108.055338)
        (xy 151.064259 108.19441) (xy 151.016566 108.264211) (xy 150.97979 108.207059) (xy 150.76759 108.062069) (xy 150.5257 108.013085)
        (xy 150.5257 105.7475) (xy 150.476182 105.498559) (xy 150.467848 105.45666) (xy 150.303101 105.210099) (xy 150.156101 105.063099)
        (xy 149.909539 104.898352) (xy 149.668604 104.850427) (xy 149.71314 104.6305) (xy 149.71314 104.0305) (xy 149.668862 103.795183)
        (xy 149.605022 103.695972) (xy 149.662131 103.61239) (xy 149.71314 103.3605) (xy 149.71314 102.7605) (xy 149.668862 102.525183)
        (xy 149.605022 102.425972) (xy 149.662131 102.34239) (xy 149.71314 102.0905) (xy 149.71314 101.974225)
      )
    )
    (filled_polygon
      (pts
        (xy 164.670073 102.871699) (xy 164.671442 102.873068) (xy 164.611969 102.96011) (xy 164.58732 103.08183) (xy 164.5734 103.09575)
        (xy 164.5734 103.13831) (xy 164.575067 103.142335) (xy 164.56096 103.212) (xy 164.56096 103.299638) (xy 164.460999 103.399599)
        (xy 164.296252 103.646161) (xy 164.2384 103.937) (xy 164.2384 104.438962) (xy 164.138083 104.457838) (xy 163.921959 104.59691)
        (xy 163.776969 104.80911) (xy 163.727985 105.051) (xy 162.551902 105.051) (xy 161.796 104.295098) (xy 161.796 103.91344)
        (xy 163.1614 103.91344) (xy 163.396717 103.869162) (xy 163.612841 103.73009) (xy 163.757831 103.51789) (xy 163.789006 103.363945)
        (xy 164.019239 103.318148) (xy 164.265801 103.153401) (xy 164.634173 102.785029)
      )
    )
    (filled_polygon
      (pts
        (xy 179.60391 103.695821) (xy 179.726628 103.753336) (xy 179.403371 103.96933) (xy 179.2224 104.240172) (xy 179.041429 103.96933)
        (xy 178.726648 103.759) (xy 179.041429 103.54867) (xy 179.222392 103.277839)
      )
    )
    (filled_polygon
      (pts
        (xy 160.276 100.517802) (xy 160.276 101.31856) (xy 158.9614 101.31856) (xy 158.726083 101.362838) (xy 158.509959 101.50191)
        (xy 158.364969 101.71411) (xy 158.328464 101.894378) (xy 158.230561 101.913852) (xy 157.983999 102.078599) (xy 156.492098 103.5705)
        (xy 155.070614 103.5705) (xy 155.11314 103.3605) (xy 155.11314 103.111042) (xy 155.12849 103.1174) (xy 155.59405 103.1174)
        (xy 155.7528 102.95865) (xy 155.7528 101.8594) (xy 156.0068 101.8594) (xy 156.0068 102.95865) (xy 156.16555 103.1174)
        (xy 156.63111 103.1174) (xy 156.864499 103.020727) (xy 157.043127 102.842098) (xy 157.1398 102.608709) (xy 157.1398 102.01815)
        (xy 156.98105 101.8594) (xy 156.0068 101.8594) (xy 155.7528 101.8594) (xy 155.7328 101.8594) (xy 155.7328 101.6054)
        (xy 155.7528 101.6054) (xy 155.7528 101.5854) (xy 156.0068 101.5854) (xy 156.0068 101.6054) (xy 156.98105 101.6054)
        (xy 157.1398 101.44665) (xy 157.1398 100.856091) (xy 157.043127 100.622702) (xy 156.90189 100.481464) (xy 156.956241 100.44649)
        (xy 157.101231 100.23429) (xy 157.150215 99.9924) (xy 159.750598 99.9924)
      )
    )
    (filled_polygon
      (pts
        (xy 180.6194 102.362) (xy 180.6394 102.362) (xy 180.6394 102.616) (xy 180.6194 102.616) (xy 180.6194 102.636)
        (xy 180.3654 102.636) (xy 180.3654 102.616) (xy 180.3454 102.616) (xy 180.3454 102.362) (xy 180.3654 102.362)
        (xy 180.3654 102.342) (xy 180.6194 102.342)
      )
    )
    (filled_polygon
      (pts
        (xy 181.8025 95.348902) (xy 181.8025 99.220186) (xy 181.581429 98.88933) (xy 181.095248 98.564474) (xy 180.521759 98.4504)
        (xy 180.463041 98.4504) (xy 180.134044 98.515842) (xy 178.362801 96.744599) (xy 178.116239 96.579852) (xy 177.8254 96.522)
        (xy 167.0204 96.522) (xy 167.0204 96.06375) (xy 166.86165 95.905) (xy 165.8874 95.905) (xy 165.8874 95.925)
        (xy 165.6334 95.925) (xy 165.6334 95.905) (xy 164.65915 95.905) (xy 164.5004 96.06375) (xy 164.5004 96.654309)
        (xy 164.597073 96.887698) (xy 164.73831 97.028936) (xy 164.683959 97.06391) (xy 164.538969 97.27611) (xy 164.48796 97.528)
        (xy 164.48796 98.160623) (xy 164.476832 98.196044) (xy 164.480488 98.237339) (xy 164.4724 98.278) (xy 164.48796 98.356225)
        (xy 164.48796 99.028) (xy 164.532238 99.263317) (xy 164.67131 99.479441) (xy 164.88351 99.624431) (xy 165.1354 99.67544)
        (xy 165.7784 99.67544) (xy 165.7784 99.847116) (xy 165.74096 100.032) (xy 165.74096 100.69519) (xy 165.7004 100.73575)
        (xy 165.7004 100.847771) (xy 165.691969 100.86011) (xy 165.650567 101.06456) (xy 165.4464 101.06456) (xy 165.4464 100.73575)
        (xy 165.28765 100.577) (xy 165.082091 100.577) (xy 164.848702 100.673673) (xy 164.670073 100.852301) (xy 164.5734 101.08569)
        (xy 164.5734 101.102) (xy 164.4824 101.102) (xy 164.191561 101.159852) (xy 163.944999 101.324599) (xy 163.676213 101.593385)
        (xy 163.62549 101.514559) (xy 163.41329 101.369569) (xy 163.1714 101.320585) (xy 163.1714 96.370227) (xy 163.353625 96.18832)
        (xy 163.53769 95.745041) (xy 163.538109 95.265065) (xy 163.387967 94.901691) (xy 164.5004 94.901691) (xy 164.5004 95.49225)
        (xy 164.65915 95.651) (xy 165.6334 95.651) (xy 165.6334 94.55175) (xy 165.8874 94.55175) (xy 165.8874 95.651)
        (xy 166.86165 95.651) (xy 167.0204 95.49225) (xy 167.0204 94.901691) (xy 166.923727 94.668302) (xy 166.745099 94.489673)
        (xy 166.51171 94.393) (xy 166.04615 94.393) (xy 165.8874 94.55175) (xy 165.6334 94.55175) (xy 165.47465 94.393)
        (xy 165.00909 94.393) (xy 164.775701 94.489673) (xy 164.597073 94.668302) (xy 164.5004 94.901691) (xy 163.387967 94.901691)
        (xy 163.354818 94.821465) (xy 163.01572 94.481775) (xy 162.572441 94.29771) (xy 162.092465 94.297291) (xy 161.648865 94.480582)
        (xy 161.309175 94.81968) (xy 161.12511 95.262959) (xy 161.124691 95.742935) (xy 161.307982 96.186535) (xy 161.64708 96.526225)
        (xy 161.6514 96.528019) (xy 161.6514 99.782333) (xy 161.573401 99.665599) (xy 160.602801 98.694999) (xy 160.356239 98.530252)
        (xy 160.0654 98.4724) (xy 157.150358 98.4724) (xy 157.107962 98.247083) (xy 156.96889 98.030959) (xy 156.75669 97.885969)
        (xy 156.730207 97.880606) (xy 156.697076 96.782055) (xy 156.861342 96.672296) (xy 157.162246 96.221961) (xy 157.162816 96.219094)
        (xy 157.185954 96.297319) (xy 157.52806 96.720124) (xy 158.005925 96.979827) (xy 158.078126 96.994183) (xy 158.2928 96.871562)
        (xy 158.2928 95.0214) (xy 158.5468 95.0214) (xy 158.5468 96.871562) (xy 158.761474 96.994183) (xy 158.833675 96.979827)
        (xy 159.31154 96.720124) (xy 159.653646 96.297319) (xy 159.80791 95.77578) (xy 159.80791 95.0214) (xy 158.5468 95.0214)
        (xy 158.2928 95.0214) (xy 158.2728 95.0214) (xy 158.2728 94.7674) (xy 158.2928 94.7674) (xy 158.2928 94.7474)
        (xy 158.5468 94.7474) (xy 158.5468 94.7674) (xy 159.80791 94.7674) (xy 159.80791 94.01302) (xy 159.653646 93.491481)
        (xy 159.430745 93.216) (xy 179.669598 93.216)
      )
    )
    (filled_polygon
      (pts
        (xy 154.597354 93.566839) (xy 154.49169 94.098046) (xy 154.49169 95.690754) (xy 154.597354 96.221961) (xy 154.898258 96.672296)
        (xy 155.178726 96.859698) (xy 155.208402 97.84369) (xy 155.019483 97.879238) (xy 154.803359 98.01831) (xy 154.658369 98.23051)
        (xy 154.636666 98.337682) (xy 154.4657 98.30306) (xy 152.9657 98.30306) (xy 152.730383 98.347338) (xy 152.514259 98.48641)
        (xy 152.369269 98.69861) (xy 152.31826 98.9505) (xy 152.31826 99.5505) (xy 152.362538 99.785817) (xy 152.420878 99.87648)
        (xy 152.3307 100.09419) (xy 152.3307 100.23475) (xy 152.48945 100.3935) (xy 153.5887 100.3935) (xy 153.5887 100.3735)
        (xy 153.8427 100.3735) (xy 153.8427 100.3935) (xy 153.8627 100.3935) (xy 153.8627 100.6475) (xy 153.8427 100.6475)
        (xy 153.8427 100.6675) (xy 153.5887 100.6675) (xy 153.5887 100.6475) (xy 152.48945 100.6475) (xy 152.366176 100.770774)
        (xy 152.1694 100.573998) (xy 152.1694 94.459902) (xy 153.413302 93.216) (xy 154.831777 93.216)
      )
    )
  )
)
