(module drill1.2 (layer F.Cu) (tedit 566B392A)
  (descr "drill, 1.2mm, non plated")
  (tags "drill, 1.2mm, non plated")
  (attr smd)
  (fp_text reference REF** (at 0 0.3) (layer F.SilkS)
    (effects (font (size 0.2 0.2) (thickness 0.02)))
  )
  (fp_text value drill1.2 (at 0 -0.1) (layer F.Fab)
    (effects (font (size 0.2 0.2) (thickness 0.02)))
  )
  (pad "" np_thru_hole circle (at 0 0) (size 1.2 1.2) (drill 1.2) (layers *.Cu *.Mask F.SilkS))
)
