(module sot323-5 (layer F.Cu) (tedit 490476AD)
  (descr SOT323-5)
  (fp_text reference SOT323-5 (at 0 -1.6256) (layer F.SilkS)
    (effects (font (size 0.29972 0.29972) (thickness 0.06096)))
  )
  (fp_text value Q*** (at 0 0) (layer F.SilkS) hide
    (effects (font (size 0.29972 0.29972) (thickness 0.06096)))
  )
  (fp_line (start -0.4445 0.6477) (end -1.1049 -0.0127) (layer F.SilkS) (width 0.127))
  (fp_line (start -0.5969 0.6477) (end -1.1049 0.1524) (layer F.SilkS) (width 0.127))
  (fp_line (start 0.6477 -0.6477) (end 0.6477 -1.2065) (layer F.SilkS) (width 0.127))
  (fp_line (start -0.6477 -0.6477) (end -0.6477 -1.2065) (layer F.SilkS) (width 0.127))
  (fp_line (start 0 0.6477) (end 0 1.2065) (layer F.SilkS) (width 0.127))
  (fp_line (start 0.6477 0.6477) (end 0.6477 1.2065) (layer F.SilkS) (width 0.127))
  (fp_line (start -0.6477 0.6477) (end -0.6477 1.2065) (layer F.SilkS) (width 0.127))
  (fp_line (start -1.1049 -0.6477) (end 1.1049 -0.6477) (layer F.SilkS) (width 0.127))
  (fp_line (start 1.1049 -0.6477) (end 1.1049 0.6477) (layer F.SilkS) (width 0.127))
  (fp_line (start 1.1049 0.6477) (end -1.1049 0.6477) (layer F.SilkS) (width 0.127))
  (fp_line (start -1.1049 0.6477) (end -1.1049 -0.6477) (layer F.SilkS) (width 0.127))
  (pad 1 smd rect (at -0.65024 1.00076) (size 0.50038 0.8001) (layers F.Cu F.Paste F.Mask))
  (pad 3 smd rect (at 0.65024 1.00076) (size 0.50038 0.8001) (layers F.Cu F.Paste F.Mask))
  (pad 2 smd rect (at 0 1.00076) (size 0.50038 0.8001) (layers F.Cu F.Paste F.Mask))
  (pad 4 smd rect (at 0.65024 -1.00076) (size 0.50038 0.8001) (layers F.Cu F.Paste F.Mask))
  (pad 5 smd rect (at -0.65024 -1.00076) (size 0.50038 0.8001) (layers F.Cu F.Paste F.Mask))
  (model walter\smd_trans\sot323-5.wrl
    (at (xyz 0 0 0))
    (scale (xyz 1 1 1))
    (rotate (xyz 0 0 0))
  )
)
