(module LZ100UA00 (layer F.Cu) (tedit 51E6E1EA)
  (descr http://www.ledengin.com/files/products/LZ1/LZ1-00UA00.pdf)
  (tags "UV, led, ledengin,")
  (attr smd)
  (fp_text reference LZ100UA00 (at -0.03048 -3.55854) (layer F.SilkS)
    (effects (font (thickness 0.3048)))
  )
  (fp_text value VAL** (at 0.02286 3.6957) (layer F.SilkS)
    (effects (font (thickness 0.3048)))
  )
  (fp_circle (center 0 0) (end 1.6 -0.1016) (layer F.SilkS) (width 0.1))
  (fp_line (start -2.2 -2.2) (end 2.2 -2.2) (layer F.SilkS) (width 0.1))
  (fp_line (start 2.2 -2.2) (end 2.2 2.2) (layer F.SilkS) (width 0.1))
  (fp_line (start 2.2 2.2) (end -2.2 2.2) (layer F.SilkS) (width 0.1))
  (fp_line (start -2.2 2.2) (end -2.2 -2.2) (layer F.SilkS) (width 0.1))
  (pad 3 smd circle (at 0 0) (size 3.2 3.2) (layers F.Cu F.Paste F.Mask))
  (pad 1 smd rect (at 1.84658 -2.0701) (size 1.2 0.77) (layers F.Cu F.Paste F.Mask))
  (pad 1 smd rect (at 1.84912 2.06248) (size 1.2 0.77) (layers F.Cu F.Paste F.Mask))
  (pad 2 smd rect (at -1.85166 2.06248) (size 1.2 0.77) (layers F.Cu F.Paste F.Mask))
  (pad 2 smd rect (at -1.84 -2.07) (size 1.2 0.77) (layers F.Cu F.Paste F.Mask))
  (pad 1 smd rect (at 1.58242 -1.59512 45) (size 0.35 0.605) (layers F.Cu F.Paste F.Mask))
  (pad 1 smd rect (at 2.05994 -1.48082) (size 0.775 0.45) (layers F.Cu F.Paste F.Mask))
  (pad 2 smd rect (at -2.05232 -1.48336) (size 0.775 0.45) (layers F.Cu F.Paste F.Mask))
  (pad 2 smd rect (at -2.06502 1.4732) (size 0.775 0.45) (layers F.Cu F.Paste F.Mask))
  (pad 1 smd rect (at 2.06248 1.47574) (size 0.775 0.45) (layers F.Cu F.Paste F.Mask))
  (pad 2 smd rect (at -1.57734 -1.59512 45) (size 0.605 0.35) (layers F.Cu F.Paste F.Mask))
  (pad 2 smd rect (at -1.59004 1.5875 315) (size 0.605 0.35) (layers F.Cu F.Paste F.Mask))
  (pad 1 smd rect (at 1.5875 1.5875 45) (size 0.605 0.35) (layers F.Cu F.Paste F.Mask))
)
