(module LED_0603_cathode_up_anode_1 (layer F.Cu) (tedit 5B971483)
  (descr "LED SMD 0603 (1608 Metric), square (rectangular) end terminal, IPC_7351 nominal, (Body size source: http://www.tortai-tech.com/upload/download/2011102023233369053.pdf), generated with kicad-footprint-generator")
  (tags diode)
  (attr smd)
  (fp_text reference REF** (at 1.43 0 -90) (layer F.SilkS)
    (effects (font (size 0.6 0.6) (thickness 0.1)))
  )
  (fp_text value LED_0603_cathode_up_anode_1 (at 0 1.43) (layer F.Fab)
    (effects (font (size 1 1) (thickness 0.15)))
  )
  (fp_line (start 0.4 0.8) (end 0.4 -0.5) (layer F.Fab) (width 0.1))
  (fp_line (start 0.4 -0.5) (end 0.1 -0.8) (layer F.Fab) (width 0.1))
  (fp_line (start 0.1 -0.8) (end -0.4 -0.8) (layer F.Fab) (width 0.1))
  (fp_line (start -0.4 -0.8) (end -0.4 0.8) (layer F.Fab) (width 0.1))
  (fp_line (start -0.4 0.8) (end 0.4 0.8) (layer F.Fab) (width 0.1))
  (fp_line (start -0.73 -1.48) (end 0.73 -1.48) (layer F.CrtYd) (width 0.05))
  (fp_line (start 0.73 -1.48) (end 0.73 1.48) (layer F.CrtYd) (width 0.05))
  (fp_line (start 0.73 1.48) (end -0.73 1.48) (layer F.CrtYd) (width 0.05))
  (fp_line (start -0.73 1.48) (end -0.73 -1.48) (layer F.CrtYd) (width 0.05))
  (fp_text user %R (at 0 0 270) (layer F.Fab)
    (effects (font (size 0.4 0.4) (thickness 0.06)))
  )
  (pad 2 smd roundrect (at 0 -0.7875 270) (size 0.875 0.95) (layers F.Cu F.Paste F.Mask)(roundrect_rratio 0.25))
  (pad 1 smd roundrect (at 0 0.7875 270) (size 0.875 0.95) (layers F.Cu F.Paste F.Mask)(roundrect_rratio 0.25))
  (model ${KISYS3DMOD}/LED_SMD.3dshapes/LED_0603_1608Metric.wrl
    (at (xyz 0 0 0))
    (scale (xyz 1 1 1))
    (rotate (xyz 0 0 90))
  )
)
