(module Led_0603_QBLP617 (layer F.Cu) (tedit 5B96FF97)
  (descr "SMD LED, 0603")
  (fp_text reference REF** (at -1.27 0 90) (layer F.SilkS)
    (effects (font (size 0.59944 0.59944) (thickness 0.11938)))
  )
  (fp_text value "Power LED" (at -0.127 -1.27) (layer F.SilkS) hide
    (effects (font (size 0.59944 0.59944) (thickness 0.11938)))
  )
  (fp_line (start 0.09906 -0.022352) (end -0.09906 -0.022352) (layer F.SilkS) (width 0.127))
  (fp_line (start -0.20066 0.076708) (end 0.20066 0.076708) (layer F.SilkS) (width 0.127))
  (fp_line (start 0.20066 0.076708) (end 0 -0.121412) (layer F.SilkS) (width 0.127))
  (fp_line (start 0 -0.121412) (end -0.20066 0.076708) (layer F.SilkS) (width 0.127))
  (fp_line (start -0.628622 0.799872) (end -0.628622 -0.800328) (layer F.SilkS) (width 0.127))
  (fp_line (start -0.628622 -0.800328) (end 0.572138 -0.800328) (layer F.SilkS) (width 0.127))
  (fp_line (start 0.582958 -0.800328) (end 0.582958 0.799872) (layer F.SilkS) (width 0.127))
  (fp_line (start -0.628622 0.799872) (end 0.572138 0.799872) (layer F.SilkS) (width 0.127))
  (fp_text user K (at 0 -2.159 270) (layer F.SilkS)
    (effects (font (size 1 1) (thickness 0.15)))
  )
  (pad 2 smd rect (at -0.001242 1.049772 90) (size 1.2 1.2) (layers F.Cu F.Paste F.Mask))
  (pad 1 smd rect (at -0.001242 -1.050228 90) (size 1.2 1.2) (layers F.Cu F.Paste F.Mask))
  (model walter\smd_leds\led_0603.wrl
    (at (xyz 0 0 0))
    (scale (xyz 1 1 1))
    (rotate (xyz 0 0 0))
  )
)
