(module VLMU1610 (layer F.Cu) (tedit 5AA1823A)
  (descr "LED 0603 smd package")
  (tags "LED led 0603 SMD smd SMT smt smdled SMDLED smtled SMTLED")
  (attr smd)
  (fp_text reference D10 (at 0.5588 -2.3876) (layer F.SilkS)
    (effects (font (size 1 1) (thickness 0.15)))
  )
  (fp_text value LED_Z (at 0.3048 1.778) (layer F.Fab)
    (effects (font (size 0.7 0.7) (thickness 0.1)))
  )
  (fp_line (start -0.8 -0.8) (end 0.8 -0.8) (layer F.SilkS) (width 0.12))
  (fp_line (start -0.8 0.4) (end -0.8 -0.4) (layer F.Fab) (width 0.1))
  (fp_line (start -0.8 -0.4) (end 0.8 -0.4) (layer F.Fab) (width 0.1))
  (fp_line (start 0.8 -0.4) (end 0.8 0.4) (layer F.Fab) (width 0.1))
  (fp_line (start 0.8 0.4) (end -0.8 0.4) (layer F.Fab) (width 0.1))
  (fp_line (start -1.524116 -0.178074) (end -1.124116 -0.178074) (layer F.Fab) (width 0.1))
  (fp_line (start -1.124116 -0.178074) (end -1.324116 0.121926) (layer F.Fab) (width 0.1))
  (fp_line (start -1.324116 0.121926) (end -1.524116 -0.178074) (layer F.Fab) (width 0.1))
  (fp_line (start -1.524116 0.171926) (end -1.124116 0.171926) (layer F.Fab) (width 0.1))
  (fp_line (start -0.8 -0.8) (end -0.8 0.8) (layer F.SilkS) (width 0.12))
  (fp_line (start -0.8 0.8128) (end 0.8 0.8128) (layer F.SilkS) (width 0.12))
  (fp_line (start 0.8128 -0.7872) (end 0.8128 0.8128) (layer F.SilkS) (width 0.12))
  (fp_arc (start 0 0.15) (end -0.3 0.15) (angle -180) (layer F.SilkS) (width 0.1))
  (fp_line (start -0.3 0.15) (end 0.3 0.15) (layer F.SilkS) (width 0.1))
  (pad 2 smd rect (at 0 0.475 180) (size 1.6 0.65) (layers F.Cu F.Paste F.Mask))
  (pad 1 smd rect (at 0 -0.475 180) (size 1.6 0.65) (layers F.Cu F.Paste F.Mask))
  (model ${KISYS3DMOD}/LEDs.3dshapes/LED_0603.wrl
    (at (xyz 0 0 0))
    (scale (xyz 1 1 1))
    (rotate (xyz 0 0 180))
  )
)
