(module Cree_CLM3C (layer F.Cu) (tedit 4D0B7E6E)
  (fp_text reference LD** (at 0 -1.651) (layer F.SilkS)
    (effects (font (size 0.8001 0.8001) (thickness 0.14986)))
  )
  (fp_text value Cree_CLM3C (at 0 1.80086) (layer F.SilkS)
    (effects (font (size 0.8001 0.8001) (thickness 0.14986)))
  )
  (fp_line (start -1.5494 -0.55118) (end -1.04902 -1.04902) (layer F.SilkS) (width 0.381))
  (fp_line (start -1.5494 0) (end -1.5494 -1.04902) (layer F.SilkS) (width 0.381))
  (fp_line (start -1.5494 -1.04902) (end 1.5494 -1.04902) (layer F.SilkS) (width 0.381))
  (fp_line (start 1.5494 -1.04902) (end 1.5494 1.04902) (layer F.SilkS) (width 0.381))
  (fp_line (start 1.5494 1.04902) (end -1.5494 1.04902) (layer F.SilkS) (width 0.381))
  (fp_line (start -1.5494 1.04902) (end -1.5494 0) (layer F.SilkS) (width 0.381))
  (pad 1 smd rect (at -1.12522 0) (size 1.19888 1.80086) (layers F.Cu F.Paste F.Mask))
  (pad 2 smd rect (at 1.12522 0) (size 1.19888 1.80086) (layers F.Cu F.Paste F.Mask))
  (model walter\smd_leds\cree_clm3c.wrl
    (at (xyz 0 0 0))
    (scale (xyz 1 1 1))
    (rotate (xyz 0 0 0))
  )
)
