(module C_2917 (layer F.Cu) (tedit 571FB0F5)
  (descr "Capacitor SMD 2917, reflow soldering, AVX (see smccp.pdf)")
  (tags "capacitor 2917")
  (attr smd)
  (fp_text reference C67 (at -3.5814 -2.6924) (layer F.SilkS)
    (effects (font (size 0.4 0.4) (thickness 0.1)))
  )
  (fp_text value 100u (at 0 0 90) (layer F.Fab)
    (effects (font (size 0.4 0.4) (thickness 0.1)))
  )
  (fp_line (start -4.13 -2.42) (end 4.13 -2.42) (layer F.CrtYd) (width 0.05))
  (fp_line (start -4.13 2.42) (end 4.13 2.42) (layer F.CrtYd) (width 0.05))
  (fp_line (start -4.13 -2.42) (end -4.13 2.42) (layer F.CrtYd) (width 0.05))
  (fp_line (start 4.13 -2.42) (end 4.13 2.42) (layer F.CrtYd) (width 0.05))
  (fp_line (start 1 -2.15) (end -1 -2.15) (layer F.SilkS) (width 0.15))
  (fp_line (start -1 2.15) (end 1 2.15) (layer F.SilkS) (width 0.15))
  (pad 1 smd rect (at -3.015 0) (size 2 2.5) (layers F.Cu F.Paste F.Mask))
  (pad 2 smd rect (at 3.015 0) (size 2 2.5) (layers F.Cu F.Paste F.Mask))
  (model Capacitors_SMD.3dshapes/C_1210.wrl
    (at (xyz 0 0 0))
    (scale (xyz 1 1 1))
    (rotate (xyz 0 0 0))
  )
)
