M48
;DRILL file {Pcbnew (2013-07-07 BZR 4022)-stable} date 9/19/2014 4:43:26 PM
;FORMAT={-:-/ absolute / metric / decimal}
FMAT,2
METRIC,TZ
T1C0.500
T2C0.635
T3C0.700
T4C0.800
T5C0.813
T6C1.000
T7C1.001
%
G90
G05
M71
T1
X15.524Y-32.903
X47.401Y-32.903
T2
X14.681Y-38.176
X14.722Y-15.362
X14.808Y-113.767
X15.062Y-26.881
X15.189Y-111.531
X15.215Y-104.75
X15.525Y-29.675
X15.525Y-31.295
X15.535Y-28.005
X15.748Y-40.538
X15.748Y-112.446
X15.811Y-103.188
X15.824Y-137.516
X16.012Y-24.216
X16.027Y-22.459
X16.053Y-110.109
X16.16Y-37.04
X16.205Y-42.189
X16.32Y-34.04
X16.51Y-106.807
X17.125Y-28.005
X17.125Y-31.29
X17.145Y-114.808
X17.252Y-19.655
X17.257Y-21.758
X17.272Y-73.152
X17.272Y-74.676
X17.399Y-106.172
X17.399Y-117.475
X17.419Y-123.932
X17.831Y-72.149
X17.9Y-134.22
X17.996Y-75.921
X18.283Y-24.374
X18.288Y-51.435
X18.288Y-117.475
X18.43Y-106.765
X18.62Y-44.27
X18.64Y-37.8
X18.815Y-28.005
X18.815Y-31.295
X18.825Y-29.675
X18.83Y-35.78
X18.923Y-72.111
X18.994Y-25.944
X19.088Y-75.921
X19.241Y-126.365
X19.65Y-32.76
X19.812Y-117.856
X20.701Y-116.967
X20.777Y-123.253
X20.795Y-24.62
X21.272Y-90.106
X21.476Y-83.591
X21.59Y-35.865
X21.765Y-24.595
X22.21Y-91.463
X22.22Y-89.367
X22.28Y-32.44
X22.352Y-101.473
X22.479Y-100.381
X22.708Y-92.507
X22.796Y-35.369
X22.83Y-74.036
X23.05Y-36.893
X23.47Y-136.296
X23.513Y-101.412
X23.835Y-24.47
X24.194Y-82.321
X24.257Y-98.984
X24.282Y-90.094
X24.359Y-91.592
X24.384Y-92.964
X24.575Y-113.093
X24.719Y-24.46
X24.961Y-23.348
X25.07Y-85.75
X25.248Y-36.551
X25.349Y-69.799
X25.466Y-96.434
X25.723Y-24.094
X25.822Y-97.818
X25.845Y-125.603
X26.035Y-131.191
X26.416Y-113.03
X26.416Y-141.224
X26.65Y-119.87
X26.708Y-106.54
X26.794Y-89.548
X26.987Y-117.475
X27.051Y-118.618
X27.12Y-83.18
X27.25Y-85.31
X27.473Y-120.724
X27.813Y-109.728
X27.925Y-79.141
X27.986Y-71.28
X28.148Y-101.509
X28.258Y-117.475
X28.321Y-126.888
X28.799Y-120.838
X28.844Y-31.186
X28.905Y-23.038
X28.91Y-96.82
X28.956Y-128.778
X29.032Y-91.973
X29.032Y-95.133
X29.205Y-101.412
X29.352Y-116.67
X29.515Y-134.239
X29.561Y-89.037
X29.718Y-84.353
X29.743Y-86.609
X29.967Y-96.815
X29.972Y-120.907
X30.239Y-128.791
X30.363Y-101.45
X30.607Y-131.445
X30.607Y-138.836
X30.615Y-89.057
X30.764Y-116.698
X30.81Y-120.145
X30.861Y-109.537
X31.115Y-106.807
X31.19Y-85.19
X31.191Y-134.531
X31.318Y-137.897
X31.542Y-117.737
X31.559Y-119.062
X32.184Y-76.998
X32.21Y-98.321
X32.296Y-80.429
X32.751Y-109.21
X32.834Y-79.393
X32.913Y-78.224
X32.982Y-93.967
X33.147Y-107.569
X33.274Y-100.965
X33.299Y-141.478
X33.492Y-32.7
X33.591Y-99.543
X33.718Y-122.364
X33.731Y-138.709
X33.77Y-83.85
X33.972Y-81.559
X34.227Y-91.072
X34.24Y-101.7
X34.29Y-106.426
X34.671Y-115.443
X34.798Y-131.826
X34.861Y-83.642
X34.91Y-32.532
X34.925Y-108.204
X35.08Y-29.373
X35.3Y-74.95
X35.611Y-70.409
X35.611Y-135.687
X36.57Y-74.71
X37.16Y-91.072
X37.31Y-71.78
X37.33Y-83.67
X37.401Y-87.63
X37.409Y-97.363
X37.874Y-19.33
X38.07Y-85.55
X38.1Y-93.116
X38.19Y-84.34
X38.38Y-71.78
X38.583Y-104.902
X38.652Y-18.289
X38.689Y-32.553
X39.192Y-36.982
X39.243Y-118.237
X39.268Y-35.255
X39.73Y-71.81
X39.908Y-25.049
X40.056Y-69.494
X40.132Y-77.506
X40.132Y-78.44
X40.55Y-117.21
X41.41Y-110.9
X41.537Y-19.155
X41.798Y-75.979
X42.08Y-111.78
X42.255Y-71.79
X42.342Y-73.508
X42.362Y-22.696
X42.37Y-23.88
X42.448Y-25.306
X42.632Y-18.893
X42.64Y-80.34
X42.86Y-112.7
X42.926Y-123.952
X42.982Y-20.517
X43.07Y-85.76
X43.356Y-16.318
X43.716Y-21.687
X43.942Y-126.111
X46.558Y-38.176
X46.599Y-15.362
X46.685Y-113.767
X46.939Y-26.881
X47.066Y-111.531
X47.092Y-104.75
X47.402Y-29.675
X47.402Y-31.295
X47.412Y-28.005
X47.625Y-40.538
X47.625Y-112.446
X47.688Y-103.188
X47.701Y-137.516
X47.889Y-24.216
X47.904Y-22.459
X47.93Y-110.109
X48.037Y-37.04
X48.082Y-42.189
X48.197Y-34.04
X48.387Y-106.807
X49.002Y-28.005
X49.002Y-31.29
X49.022Y-114.808
X49.129Y-19.655
X49.134Y-21.758
X49.149Y-73.152
X49.149Y-74.676
X49.276Y-106.172
X49.276Y-117.475
X49.296Y-123.932
X49.708Y-72.149
X49.777Y-134.22
X49.873Y-75.921
X50.16Y-24.374
X50.165Y-51.435
X50.165Y-117.475
X50.307Y-106.765
X50.497Y-44.27
X50.517Y-37.8
X50.692Y-28.005
X50.692Y-31.295
X50.702Y-29.675
X50.707Y-35.78
X50.8Y-72.111
X50.871Y-25.944
X50.965Y-75.921
X51.117Y-126.365
X51.527Y-32.76
X51.689Y-117.856
X52.578Y-116.967
X52.654Y-123.253
X52.672Y-24.62
X53.149Y-90.106
X53.353Y-83.591
X53.467Y-35.865
X53.642Y-24.595
X54.087Y-91.463
X54.097Y-89.367
X54.157Y-32.44
X54.229Y-101.473
X54.356Y-100.381
X54.585Y-92.507
X54.673Y-35.369
X54.707Y-74.036
X54.927Y-36.893
X55.347Y-136.296
X55.39Y-101.412
X55.712Y-24.47
X56.07Y-82.321
X56.134Y-98.984
X56.159Y-90.094
X56.236Y-91.592
X56.261Y-92.964
X56.451Y-113.093
X56.596Y-24.46
X56.838Y-23.348
X56.947Y-85.75
X57.125Y-36.551
X57.226Y-69.799
X57.343Y-96.434
X57.6Y-24.094
X57.699Y-97.818
X57.721Y-125.603
X57.912Y-131.191
X58.293Y-113.03
X58.293Y-141.224
X58.527Y-119.87
X58.585Y-106.54
X58.671Y-89.548
X58.864Y-117.475
X58.928Y-118.618
X58.997Y-83.18
X59.127Y-85.31
X59.35Y-120.724
X59.69Y-109.728
X59.802Y-79.141
X59.863Y-71.28
X60.025Y-101.509
X60.134Y-117.475
X60.198Y-126.888
X60.676Y-120.838
X60.721Y-31.186
X60.782Y-23.038
X60.787Y-96.82
X60.833Y-128.778
X60.909Y-91.973
X60.909Y-95.133
X61.082Y-101.412
X61.229Y-116.67
X61.392Y-134.239
X61.438Y-89.037
X61.595Y-84.353
X61.62Y-86.609
X61.844Y-96.815
X61.849Y-120.907
X62.116Y-128.791
X62.24Y-101.45
X62.484Y-131.445
X62.484Y-138.836
X62.492Y-89.057
X62.641Y-116.698
X62.687Y-120.145
X62.738Y-109.537
X62.992Y-106.807
X63.067Y-85.19
X63.068Y-134.531
X63.195Y-137.897
X63.419Y-117.737
X63.436Y-119.062
X64.061Y-76.998
X64.087Y-98.321
X64.173Y-80.429
X64.628Y-109.21
X64.711Y-79.393
X64.79Y-78.224
X64.859Y-93.967
X65.024Y-107.569
X65.151Y-100.965
X65.176Y-141.478
X65.369Y-32.7
X65.468Y-99.543
X65.596Y-122.364
X65.608Y-138.709
X65.647Y-83.85
X65.849Y-81.559
X66.103Y-91.072
X66.117Y-101.7
X66.167Y-106.426
X66.548Y-115.443
X66.675Y-131.826
X66.739Y-83.642
X66.787Y-32.532
X66.802Y-108.204
X66.957Y-29.373
X67.177Y-74.95
X67.488Y-70.409
X67.488Y-135.687
X68.447Y-74.71
X69.037Y-91.072
X69.187Y-71.78
X69.207Y-83.67
X69.278Y-87.63
X69.286Y-97.363
X69.751Y-19.33
X69.947Y-85.55
X69.977Y-93.116
X70.067Y-84.34
X70.257Y-71.78
X70.46Y-104.902
X70.529Y-18.289
X70.566Y-32.553
X71.069Y-36.982
X71.12Y-118.237
X71.145Y-35.255
X71.607Y-71.81
X71.785Y-25.049
X71.933Y-69.494
X72.009Y-77.506
X72.009Y-78.44
X72.427Y-117.21
X73.287Y-110.9
X73.414Y-19.155
X73.675Y-75.979
X73.957Y-111.78
X74.132Y-71.79
X74.219Y-73.508
X74.239Y-22.696
X74.247Y-23.88
X74.325Y-25.306
X74.509Y-18.893
X74.517Y-80.34
X74.737Y-112.7
X74.803Y-123.952
X74.859Y-20.517
X74.947Y-85.76
X75.233Y-16.318
X75.593Y-21.687
X75.819Y-126.111
X79.578Y-84.43
X79.578Y-130.531
X79.654Y-78.628
X79.654Y-124.729
X79.908Y-52.413
X79.908Y-98.514
X80.034Y-70.768
X80.034Y-116.869
X80.154Y-74.908
X80.154Y-121.009
X80.524Y-67.361
X80.524Y-113.462
X80.814Y-63.428
X80.814Y-109.529
X81.509Y-66.827
X81.509Y-112.928
X81.686Y-77.673
X81.686Y-123.774
X82.245Y-86.512
X82.245Y-132.613
X82.855Y-68.605
X82.855Y-114.706
X83.261Y-64.313
X83.261Y-110.414
X83.337Y-72.492
X83.337Y-118.593
X83.525Y-54.869
X83.525Y-100.97
X83.576Y-57.018
X83.576Y-103.119
X83.668Y-80.01
X83.668Y-126.111
X83.795Y-82.525
X83.795Y-128.626
X83.947Y-84.138
X83.947Y-130.238
X84.272Y-57.76
X84.272Y-103.861
X84.587Y-54.879
X84.587Y-100.98
X84.887Y-69.342
X84.887Y-115.443
X85.141Y-78.08
X85.141Y-124.181
X85.852Y-72.136
X85.852Y-118.237
X85.954Y-60.147
X85.954Y-106.248
X86.157Y-63.5
X86.157Y-109.601
X86.665Y-55.55
X86.665Y-101.651
X86.677Y-80.01
X86.677Y-126.111
X87.503Y-73.406
X87.503Y-119.507
X87.528Y-63.068
X87.528Y-109.169
X87.757Y-64.414
X87.757Y-110.515
X88.062Y-51.816
X88.062Y-97.917
X88.265Y-56.286
X88.265Y-102.387
X88.976Y-78.422
X88.976Y-124.523
X89.344Y-84.138
X89.344Y-130.238
X89.764Y-81.128
X89.764Y-127.229
X89.789Y-73.279
X89.789Y-119.38
X89.936Y-61.041
X89.936Y-107.142
X90.259Y-87.3
X90.259Y-133.401
X91.783Y-93.04
X91.783Y-139.141
X92.05Y-83.439
X92.05Y-129.54
X92.964Y-69.723
X92.964Y-115.824
X93.167Y-86.131
X93.167Y-132.232
X94.234Y-87.249
X94.234Y-133.35
X95.25Y-87.884
X95.25Y-133.985
X96.088Y-86.385
X96.088Y-132.486
X96.342Y-84.061
X96.342Y-130.162
X98.369Y-74.279
X98.369Y-120.38
X98.933Y-56.332
X98.933Y-102.433
X98.979Y-59.289
X98.979Y-105.39
X98.989Y-57.607
X98.989Y-103.708
X99.695Y-53.396
X99.695Y-99.497
X99.766Y-54.534
X99.766Y-100.635
X99.888Y-61.189
X99.888Y-107.29
X99.893Y-55.875
X99.893Y-101.976
X99.913Y-57.993
X99.913Y-104.094
X99.934Y-59.644
X99.934Y-105.745
X100.147Y-74.076
X100.147Y-120.177
X100.188Y-62.387
X100.188Y-108.488
X100.198Y-83.287
X100.198Y-129.388
X100.813Y-53.406
X100.813Y-99.507
X100.823Y-54.585
X100.823Y-100.686
X101.229Y-62.301
X101.229Y-108.402
X101.595Y-74.584
X101.595Y-120.685
X101.625Y-69.921
X101.625Y-116.022
X102.57Y-52.659
X102.57Y-98.76
X102.85Y-84.602
X102.85Y-130.703
X103.591Y-52.817
X103.591Y-98.918
X104.77Y-52.238
X104.77Y-98.339
X105.517Y-52.857
X105.517Y-98.958
X106.548Y-75.702
X106.548Y-121.803
X107.051Y-52.837
X107.051Y-98.938
X108.224Y-75.651
X108.224Y-121.752
X108.229Y-54.143
X108.229Y-100.244
X108.58Y-72.603
X108.58Y-118.704
X108.732Y-69.441
X108.732Y-115.541
T3
X29.49Y-139.9
X29.49Y-141.5
X61.367Y-139.9
X61.367Y-141.5
T4
X19.304Y-119.761
X19.304Y-122.301
X19.304Y-124.841
X40.64Y-114.681
X40.64Y-124.841
X40.64Y-127.381
X40.64Y-129.921
X40.64Y-132.461
X40.64Y-135.001
X40.64Y-137.541
X51.181Y-119.761
X51.181Y-122.301
X51.181Y-124.841
X72.517Y-114.681
X72.517Y-124.841
X72.517Y-127.381
X72.517Y-129.921
X72.517Y-132.461
X72.517Y-135.001
X72.517Y-137.541
T5
X22.098Y-107.061
X22.098Y-109.601
X22.098Y-112.141
X22.098Y-114.681
X22.098Y-117.221
X22.098Y-119.761
X22.098Y-122.301
X22.098Y-124.841
X22.098Y-127.381
X22.098Y-129.921
X22.098Y-132.461
X22.098Y-135.001
X22.098Y-137.541
X22.098Y-140.081
X24.638Y-127.381
X24.638Y-129.921
X24.638Y-132.461
X25.21Y-137.61
X25.21Y-140.15
X37.338Y-107.061
X37.338Y-109.601
X37.338Y-112.141
X37.338Y-114.681
X37.338Y-117.221
X37.338Y-119.761
X37.338Y-122.301
X37.338Y-124.841
X37.338Y-127.381
X37.338Y-129.921
X37.338Y-132.461
X37.338Y-135.001
X37.338Y-137.541
X37.338Y-140.081
X53.975Y-107.061
X53.975Y-109.601
X53.975Y-112.141
X53.975Y-114.681
X53.975Y-117.221
X53.975Y-119.761
X53.975Y-122.301
X53.975Y-124.841
X53.975Y-127.381
X53.975Y-129.921
X53.975Y-132.461
X53.975Y-135.001
X53.975Y-137.541
X53.975Y-140.081
X56.515Y-127.381
X56.515Y-129.921
X56.515Y-132.461
X57.087Y-137.61
X57.087Y-140.15
X69.215Y-107.061
X69.215Y-109.601
X69.215Y-112.141
X69.215Y-114.681
X69.215Y-117.221
X69.215Y-119.761
X69.215Y-122.301
X69.215Y-124.841
X69.215Y-127.381
X69.215Y-129.921
X69.215Y-132.461
X69.215Y-135.001
X69.215Y-137.541
X69.215Y-140.081
T6
X26.09Y-65.91
X28.63Y-36.21
X28.63Y-65.91
X31.17Y-36.21
X31.17Y-65.91
X33.71Y-36.21
X33.71Y-65.91
X36.25Y-36.21
X36.25Y-65.91
X57.967Y-65.91
X60.507Y-36.21
X60.507Y-65.91
X63.047Y-36.21
X63.047Y-65.91
X65.587Y-36.21
X65.587Y-65.91
X68.127Y-36.21
X68.127Y-65.91
T7
X29.945Y-15.826
X29.945Y-20.906
X61.822Y-15.826
X61.822Y-20.906
X103.374Y-66.858
X103.374Y-112.959
X108.454Y-66.858
X108.454Y-112.959
T0
M30
