(module Luxeon_M (layer F.Cu) (tedit 4FB3594C)
  (descr "Philips Lumileds Luxeon M")
  (fp_text reference LD? (at 0 -4.30022) (layer F.SilkS)
    (effects (font (size 0.99568 0.99568) (thickness 0.19812)))
  )
  (fp_text value Luxeon_M (at 0 4.50088) (layer F.SilkS)
    (effects (font (size 0.99822 0.99822) (thickness 0.19812)))
  )
  (fp_line (start -3.0988 3.0988) (end -2.70002 3.0988) (layer F.SilkS) (width 0.254))
  (fp_line (start -3.0988 3.0988) (end -3.0988 2.70002) (layer F.SilkS) (width 0.254))
  (fp_line (start 3.0988 -3.0988) (end 3.0988 -2.70002) (layer F.SilkS) (width 0.254))
  (fp_line (start 3.0988 -3.0988) (end 2.70002 -3.0988) (layer F.SilkS) (width 0.254))
  (fp_line (start -3.0988 -2.70002) (end -3.0988 -3.0988) (layer F.SilkS) (width 0.254))
  (fp_line (start -3.0988 -3.0988) (end -2.70002 -3.0988) (layer F.SilkS) (width 0.254))
  (fp_circle (center 0 0) (end -3.2004 0) (layer F.SilkS) (width 0.254))
  (fp_line (start -3.49758 -3.49758) (end 3.49758 -3.49758) (layer F.SilkS) (width 0.254))
  (fp_line (start 3.49758 -3.49758) (end 3.49758 3.49758) (layer F.SilkS) (width 0.254))
  (fp_line (start 3.49758 3.49758) (end -3.49758 3.49758) (layer F.SilkS) (width 0.254))
  (fp_line (start -3.49758 3.49758) (end -3.49758 -3.49758) (layer F.SilkS) (width 0.254))
  (pad 1 smd rect (at 1.60274 0) (size 0.5461 3.52806) (layers F.Cu F.Paste F.Mask)
    (solder_mask_margin 0.0508) (solder_paste_margin -0.0508))
  (pad 2 smd rect (at -1.60274 0) (size 0.5461 3.52806) (layers F.Cu F.Paste F.Mask)
    (solder_mask_margin 0.0508) (solder_paste_margin -0.0508))
  (pad 3 smd rect (at 0 0) (size 2.25806 3.52806) (layers F.Cu F.Paste F.Mask)
    (solder_mask_margin 0.0508) (solder_paste_margin -0.0508))
  (pad 2 smd rect (at -2.413 0) (size 2.16916 4.99618) (layers F.Cu))
  (pad 1 smd rect (at 2.413 0) (size 2.16916 4.99618) (layers F.Cu))
  (pad 3 smd rect (at 0 0) (size 2.25806 6.9977) (layers F.Cu))
  (pad 3 smd rect (at 0 -2.94386) (size 6.07568 0.39116) (layers F.Cu))
  (pad 3 smd rect (at 0 2.94386) (size 6.07568 0.39116) (layers F.Cu))
  (pad 3 smd rect (at 0 -3.31978) (size 5.37718 0.36068) (layers F.Cu))
  (pad 3 smd rect (at 0 3.31978) (size 5.37718 0.36068) (layers F.Cu))
  (model walter\smd_leds\luxeon_m.wrl
    (at (xyz 0 0 0))
    (scale (xyz 1 1 1))
    (rotate (xyz 0 0 0))
  )
)
