(module SOT-363_SC-70-6-Vishay (layer F.Cu) (tedit 5B96E6CF)
  (descr "SOT-363, SC-70-6")
  (tags "SOT-363 SC-70-6")
  (attr smd)
  (fp_text reference REF** (at 0 -2) (layer F.SilkS)
    (effects (font (size 1 1) (thickness 0.15)))
  )
  (fp_text value SOT-363_SC-70-6-Vishay (at 0 2 180) (layer F.Fab)
    (effects (font (size 1 1) (thickness 0.15)))
  )
  (fp_text user %R (at 0 0 180) (layer F.Fab)
    (effects (font (size 0.5 0.5) (thickness 0.075)))
  )
  (fp_line (start -1.16 -0.7) (end -1.16 1.2) (layer F.SilkS) (width 0.12))
  (fp_line (start 1.16 0.7) (end 1.16 -0.7) (layer F.SilkS) (width 0.12))
  (fp_line (start 1.4 -1.6) (end -1.4 -1.6) (layer F.CrtYd) (width 0.05))
  (fp_line (start -1.4 1.6) (end 1.4 1.6) (layer F.CrtYd) (width 0.05))
  (fp_line (start -1.4 1.6) (end -1.4 -1.6) (layer F.CrtYd) (width 0.05))
  (fp_line (start -1.1 -0.675) (end -1.1 0.175) (layer F.Fab) (width 0.1))
  (fp_line (start -0.6 0.675) (end 1.1 0.675) (layer F.Fab) (width 0.1))
  (fp_line (start 1.4 1.6) (end 1.4 -1.6) (layer F.CrtYd) (width 0.05))
  (fp_line (start -1.1 -0.675) (end 1.1 -0.675) (layer F.Fab) (width 0.1))
  (fp_line (start 1.1 -0.675) (end 1.1 0.675) (layer F.Fab) (width 0.1))
  (fp_line (start -1.1 0.175) (end -0.6 0.675) (layer F.Fab) (width 0.1))
  (fp_circle (center -1.778 1.27) (end -1.778 1.016) (layer F.SilkS) (width 0.15))
  (pad 1 smd rect (at -0.65 0.95 90) (size 0.65 0.4) (layers F.Cu F.Paste F.Mask))
  (pad 3 smd rect (at 0.65 0.95 90) (size 0.65 0.4) (layers F.Cu F.Paste F.Mask))
  (pad 5 smd rect (at 0 -0.95 90) (size 0.65 0.4) (layers F.Cu F.Paste F.Mask))
  (pad 2 smd rect (at 0 0.95 90) (size 0.65 0.4) (layers F.Cu F.Paste F.Mask))
  (pad 4 smd rect (at 0.65 -0.95 90) (size 0.65 0.4) (layers F.Cu F.Paste F.Mask))
  (pad 6 smd rect (at -0.65 -0.95 90) (size 0.65 0.4) (layers F.Cu F.Paste F.Mask))
  (model ${KISYS3DMOD}/Package_TO_SOT_SMD.3dshapes/SOT-363_SC-70-6.wrl
    (at (xyz 0 0 0))
    (scale (xyz 1 1 1))
    (rotate (xyz 0 0 0))
  )
)
