(module Elko_vert_11.2x7.5mm_RM2.5 (layer F.Cu) (tedit 5454A17B)
  (descr "Electrolytic Capacitor, vertical, diameter 7,5mm, RM 2,5mm, radial,")
  (tags "Electrolytic Capacitor, vertical, diameter 7,5mm, RM 2,5mm, Elko, Electrolytkondensator, Kondensator gepolt, Durchmesser 7,5mm, radial,")
  (fp_text reference REF** (at 1.27 -5.08) (layer F.SilkS)
    (effects (font (size 1 1) (thickness 0.15)))
  )
  (fp_text value Elko_vert_11.2x7.5mm_RM2.5 (at 1.27 6.35) (layer F.Fab)
    (effects (font (size 1 1) (thickness 0.15)))
  )
  (fp_line (start -0.508 -2.54) (end -0.508 -1.27) (layer F.SilkS) (width 0.15))
  (fp_line (start -1.143 -1.905) (end 0 -1.905) (layer F.SilkS) (width 0.15))
  (fp_line (start -0.508 -2.54) (end -0.508 -1.27) (layer F.Cu) (width 0.15))
  (fp_line (start -1.143 -1.905) (end 0 -1.905) (layer F.Cu) (width 0.15))
  (fp_circle (center 1.27 0) (end 5.08 0) (layer F.SilkS) (width 0.15))
  (pad 2 thru_hole circle (at 2.54 0) (size 1.50114 1.50114) (drill 0.8001) (layers *.Cu *.Mask F.SilkS))
  (pad 1 thru_hole circle (at 0 0) (size 1.50114 1.50114) (drill 0.8001) (layers *.Cu *.Mask F.SilkS))
  (model Capacitors_Elko_ThroughHole.3dshapes/Elko_vert_11.2x7.5mm_RM2.5.wrl
    (at (xyz 0 0 0))
    (scale (xyz 1 1 1))
    (rotate (xyz 0 0 0))
  )
)
