M48
;DRILL file {KiCad (2016-03-03 BZR 6607, Git 8dc0a33)-product} date 7/18/2016 5:06:19 PM
;FORMAT={-:-/ absolute / inch / decimal}
FMAT,2
INCH,TZ
T1C0.008
T2C0.010
T3C0.010
T4C0.012
T5C0.016
T6C0.020
T7C0.022
T8C0.024
T9C0.028
T10C0.031
T11C0.051
%
G90
G05
M72
T1
X2.6189Y-2.8078
X2.6189Y-2.8478
X2.6389Y-2.8278
X2.6589Y-2.8078
X2.6589Y-2.8478
T2
X2.61Y-3.5415
X2.6104Y-3.5077
T3
X8.4344Y-3.5059
X8.4344Y-3.5284
X8.4344Y-3.5634
X8.4344Y-3.5859
X8.4344Y-3.6237
X8.4344Y-3.6462
X8.4344Y-3.6812
X8.4344Y-3.7037
X8.4344Y-3.7418
X8.4344Y-3.7643
X8.4344Y-3.7993
X8.4344Y-3.8218
X8.4569Y-3.5059
X8.4569Y-3.5284
X8.4569Y-3.5634
X8.4569Y-3.5859
X8.4569Y-3.6237
X8.4569Y-3.6462
X8.4569Y-3.6812
X8.4569Y-3.7037
X8.4569Y-3.7418
X8.4569Y-3.7643
X8.4569Y-3.7993
X8.4569Y-3.8218
X8.4794Y-3.5059
X8.4794Y-3.5284
X8.4794Y-3.5634
X8.4794Y-3.5859
X8.4794Y-3.6237
X8.4794Y-3.6462
X8.4794Y-3.6812
X8.4794Y-3.7037
X8.4794Y-3.7418
X8.4794Y-3.7643
X8.4794Y-3.7993
X8.4794Y-3.8218
X8.5081Y-3.5674
X8.5081Y-3.5899
X8.5081Y-3.6249
X8.5081Y-3.6474
X8.5086Y-3.6868
X8.5086Y-3.7093
X8.5086Y-3.7443
X8.5086Y-3.7668
X8.5306Y-3.5674
X8.5306Y-3.5899
X8.5306Y-3.6249
X8.5306Y-3.6474
X8.5311Y-3.6868
X8.5311Y-3.7093
X8.5311Y-3.7443
X8.5311Y-3.7668
X8.5531Y-3.5674
X8.5531Y-3.5899
X8.5531Y-3.6249
X8.5531Y-3.6474
X8.5536Y-3.6868
X8.5536Y-3.7093
X8.5536Y-3.7443
X8.5536Y-3.7668
T4
X1.8006Y-3.4704
X1.85Y-2.785
X1.8756Y-3.7887
X1.8924Y-3.882
X1.9025Y-3.0061
X1.9085Y-3.9342
X1.945Y-2.785
X1.96Y-4.16
X1.98Y-4.19
X2.0699Y-3.6465
X2.0768Y-3.304
X2.12Y-3.235
X2.1338Y-2.9258
X2.1496Y-3.7834
X2.1586Y-3.8348
X2.1657Y-3.9213
X2.1687Y-3.3958
X2.1782Y-3.808
X2.1876Y-3.5546
X2.2041Y-3.7869
X2.2286Y-3.8389
X2.2565Y-3.5101
X2.2573Y-3.5554
X2.2573Y-3.8223
X2.29Y-3.98
X2.3002Y-3.5759
X2.3059Y-3.2181
X2.3289Y-3.5318
X2.36Y-3.82
X2.365Y-3.74
X2.3665Y-3.2189
X2.385Y-3.285
X2.3945Y-3.3169
X2.395Y-3.675
X2.395Y-3.845
X2.3957Y-3.6024
X2.4258Y-3.1345
X2.5959Y-2.9074
X2.6176Y-2.8826
X2.6203Y-2.7682
X2.6384Y-2.907
X2.6546Y-3.0251
X2.6593Y-2.768
X2.6636Y-2.8833
X2.6935Y-2.9054
X2.755Y-3.0361
X2.7617Y-2.953
X2.775Y-3.13
X2.8282Y-2.8137
X2.8546Y-2.7754
X2.9471Y-3.0395
X2.98Y-2.745
X3.035Y-2.75
X3.0453Y-3.7496
X3.0461Y-3.7154
X3.0488Y-3.6283
X3.055Y-3.355
X3.0685Y-3.0489
X3.0728Y-4.0354
X3.075Y-2.8675
X3.0854Y-3.6827
X3.093Y-4.197
X3.1161Y-3.9764
X3.118Y-3.908
X3.122Y-3.7486
X3.122Y-3.719
X3.1263Y-3.1278
X3.135Y-3.685
X3.142Y-3.954
X3.1512Y-3.0379
X3.1624Y-3.2737
X3.177Y-3.946
X3.1864Y-3.0534
X3.1878Y-2.8744
X3.188Y-2.9559
X3.1975Y-2.74
X3.212Y-3.953
X3.2127Y-3.879
X3.22Y-4.107
X3.224Y-3.724
X3.2241Y-3.7579
X3.265Y-3.919
X3.2719Y-3.8459
X3.277Y-4.022
X3.3063Y-3.003
X3.345Y-4.155
X3.361Y-4.107
X3.3711Y-3.707
X3.3766Y-3.7774
X3.38Y-3.265
X3.389Y-3.5981
X3.397Y-3.971
X3.4006Y-4.1656
X3.4353Y-3.6125
X3.4597Y-3.7617
X3.4687Y-3.6133
X3.4711Y-3.7089
X3.495Y-2.87
X3.5027Y-3.6118
X3.5092Y-3.7043
X3.515Y-2.7275
X3.5227Y-4.2168
X3.5266Y-4.0475
X3.5325Y-2.7875
X3.5337Y-4.1026
X3.5345Y-3.6128
X3.5446Y-3.8062
X3.555Y-3.32
X3.5675Y-3.0625
X3.5675Y-3.1275
X3.5691Y-2.9877
X3.57Y-3.614
X3.579Y-3.803
X3.5894Y-4.0093
X3.5896Y-4.0672
X3.6271Y-3.5969
X3.6355Y-3.816
X3.6404Y-4.068
X3.6542Y-4.1022
X3.663Y-3.961
X3.6916Y-4.1625
X3.6931Y-4.1026
X3.695Y-3.4425
X3.6998Y-3.6558
X3.7018Y-3.7837
X3.7027Y-3.7165
X3.7167Y-3.103
X3.7298Y-4.0999
X3.731Y-3.964
X3.742Y-3.689
X3.742Y-3.73
X3.742Y-3.761
X3.755Y-4.202
X3.7554Y-3.4845
X3.7616Y-2.8762
X3.7628Y-3.0993
X3.765Y-3.964
X3.77Y-4.228
X3.7727Y-3.4593
X3.774Y-4.103
X3.777Y-3.711
X3.7904Y-3.7877
X3.798Y-3.965
X3.8054Y-3.4605
X3.8219Y-3.0081
X3.8254Y-3.2374
X3.8357Y-3.4562
X3.8435Y-3.8778
X3.8628Y-3.4408
X3.87Y-4.23
X3.8905Y-3.713
X3.899Y-3.997
X3.9027Y-3.8132
X3.9105Y-3.686
X3.919Y-4.064
X3.9223Y-3.3113
X3.925Y-3.16
X3.925Y-4.112
X3.9275Y-3.0437
X3.9309Y-3.3648
X3.951Y-3.5958
X3.952Y-4.059
X3.9534Y-3.0177
X3.9557Y-3.7759
X3.968Y-3.66
X3.9746Y-3.3424
X3.9882Y-3.7641
X3.99Y-2.755
X3.99Y-2.805
X4.0132Y-3.2688
X4.016Y-3.569
X4.0282Y-3.0436
X4.03Y-3.1
X4.03Y-4.12
X4.0443Y-3.2566
X4.045Y-2.81
X4.06Y-3.045
X4.0662Y-4.0706
X4.075Y-4.105
X4.0934Y-4.1604
X4.095Y-4.06
X4.0973Y-3.099
X4.11Y-4.09
X4.115Y-4.1862
X4.1201Y-3.0797
X4.1266Y-3.1141
X4.127Y-3.1646
X4.1307Y-4.2138
X4.1479Y-3.0416
X4.154Y-3.403
X4.155Y-3.56
X4.1651Y-3.7385
X4.175Y-3.48
X4.1825Y-3.177
X4.1849Y-3.14
X4.1967Y-3.4562
X4.1998Y-4.0538
X4.203Y-3.4259
X4.2046Y-3.3885
X4.2172Y-3.9404
X4.24Y-4.125
X4.2498Y-2.9306
X4.25Y-3.1525
X4.265Y-3.485
X4.2816Y-3.6724
X4.2833Y-2.931
X4.2849Y-3.1168
X4.297Y-3.2934
X4.2983Y-4.0627
X4.3028Y-3.0083
X4.305Y-3.485
X4.3215Y-4.1192
X4.33Y-3.795
X4.3371Y-2.9689
X4.3426Y-3.1774
X4.3431Y-4.0597
X4.3601Y-3.0245
X4.3622Y-3.1213
X4.3727Y-4.0609
X4.3854Y-3.2291
X4.3854Y-3.3005
X4.39Y-3.47
X4.39Y-3.795
X4.395Y-3.57
X4.4095Y-4.1613
X4.4281Y-3.1251
X4.4349Y-3.2814
X4.44Y-3.58
X4.4408Y-3.3105
X4.4415Y-3.8408
X4.4486Y-3.4644
X4.455Y-3.66
X4.4676Y-3.2428
X4.4683Y-3.3263
X4.4695Y-4.1593
X4.4754Y-3.2715
X4.48Y-3.4434
X4.49Y-3.545
X4.49Y-3.795
X4.495Y-3.495
X4.4967Y-3.218
X4.4998Y-3.1885
X4.5026Y-4.1621
X4.5047Y-3.6535
X4.515Y-2.815
X4.5209Y-3.087
X4.5658Y-4.065
X4.5853Y-3.4211
X4.6034Y-4.0544
X4.6034Y-4.0869
X4.615Y-2.845
X4.6252Y-3.7602
X4.6262Y-3.0345
X4.63Y-3.635
X4.6339Y-4.1056
X4.6349Y-4.0623
X4.6443Y-2.7459
X4.6474Y-2.8666
X4.65Y-3.195
X4.6524Y-3.2799
X4.6581Y-4.1444
X4.6617Y-3.3491
X4.6817Y-3.0767
X4.7Y-4.035
X4.703Y-3.2141
X4.7042Y-3.155
X4.7058Y-3.399
X4.7152Y-2.8566
X4.7258Y-3.0357
X4.7358Y-3.2696
X4.7469Y-2.906
X4.7499Y-3.2401
X4.7502Y-3.6726
X4.7528Y-3.5682
X4.7551Y-3.5351
X4.7565Y-3.4913
X4.7565Y-3.0341
X4.7577Y-3.6
X4.7595Y-3.3517
X4.78Y-4.11
X4.79Y-3.89
X4.7943Y-2.827
X4.8402Y-2.906
X4.855Y-3.4096
X4.8746Y-3.2648
X4.8796Y-3.3056
X4.8812Y-3.5417
X4.8814Y-3.4661
X4.8816Y-3.5805
X4.91Y-4.055
X4.912Y-3.092
X4.9215Y-4.1274
X4.9228Y-4.1835
X4.931Y-2.7259
X4.931Y-2.7559
X4.9638Y-3.6214
X4.9644Y-3.4149
X4.9664Y-3.3644
X4.9747Y-3.7786
X4.9757Y-3.5231
X4.978Y-3.469
X4.978Y-3.691
X4.9837Y-2.8702
X4.9837Y-3.0166
X4.9984Y-3.6695
X5.0003Y-3.1497
X5.0062Y-3.1884
X5.025Y-3.1235
X5.0272Y-3.2388
X5.0294Y-3.9857
X5.0581Y-4.1459
X5.0663Y-3.6468
X5.0778Y-3.6105
X5.0868Y-2.7343
X5.108Y-3.608
X5.1095Y-3.3695
X5.11Y-3.175
X5.111Y-2.8259
X5.1258Y-4.1294
X5.13Y-3.205
X5.1428Y-4.0786
X5.1428Y-3.7636
X5.15Y-3.377
X5.155Y-3.485
X5.1713Y-4.0702
X5.2016Y-2.726
X5.2018Y-3.1475
X5.2175Y-4.1688
X5.218Y-2.9876
X5.2324Y-3.7022
X5.235Y-3.325
X5.2365Y-3.4629
X5.245Y-3.02
X5.255Y-3.825
X5.26Y-3.675
X5.264Y-2.872
X5.27Y-3.06
X5.275Y-3.1559
X5.281Y-3.418
X5.2876Y-4.1664
X5.295Y-3.825
X5.3042Y-3.1705
X5.312Y-4.1841
X5.3191Y-3.6617
X5.33Y-3.1559
X5.3451Y-3.5593
X5.3731Y-3.0357
X5.3731Y-4.079
X5.3731Y-4.1459
X5.375Y-3.8
X5.4046Y-4.1459
X5.41Y-3.82
X5.4191Y-3.283
X5.4203Y-3.1499
X5.4203Y-4.0672
X5.4203Y-4.1066
X5.4215Y-3.316
X5.4223Y-3.4436
X5.425Y-2.735
X5.4294Y-3.4141
X5.43Y-3.66
X5.4498Y-3.392
X5.4743Y-3.3727
X5.4752Y-4.1815
X5.4833Y-2.8259
X5.495Y-3.155
X5.5Y-3.085
X5.5286Y-3.8468
X5.58Y-2.73
X5.6302Y-4.0755
X5.7195Y-4.02
X5.7392Y-4.1109
X5.745Y-3.085
X5.745Y-3.155
X5.7471Y-4.1656
X5.7681Y-3.2157
X5.7719Y-4.1877
X5.7752Y-2.8638
X5.8016Y-2.9429
X5.805Y-3.08
X5.8256Y-2.8547
X5.8286Y-4.0554
X5.84Y-3.15
X5.848Y-2.8181
X5.85Y-3.085
X5.8845Y-4.1404
X5.9294Y-4.0633
X5.9483Y-4.1247
X5.9664Y-4.0633
X5.978Y-3.878
X5.9971Y-4.0633
X6.0018Y-2.7511
X6.008Y-2.908
X6.0093Y-3.0849
X6.0181Y-3.7154
X6.0364Y-4.166
X6.0605Y-3.0613
X6.07Y-3.735
X6.0799Y-2.8024
X6.0882Y-2.8315
X6.1Y-2.94
X6.115Y-3.794
X6.1191Y-4.1633
X6.125Y-4.1971
X6.13Y-2.96
X6.155Y-3.42
X6.1605Y-2.8074
X6.188Y-4.1499
X6.195Y-3.265
X6.1998Y-4.083
X6.201Y-3.5865
X6.2071Y-3.5555
X6.2195Y-4.1499
X6.2282Y-3.7373
X6.2337Y-3.0609
X6.239Y-4.0382
X6.2392Y-4.0711
X6.2392Y-4.1105
X6.25Y-3.76
X6.27Y-3.85
X6.28Y-2.8
X6.2884Y-4.2109
X6.3034Y-3.0597
X6.31Y-3.835
X6.3282Y-2.8247
X6.4242Y-2.9223
X6.5042Y-4.0412
X6.561Y-4.1035
X6.5695Y-4.1625
X6.6Y-4.075
X6.6481Y-4.0936
X6.6707Y-4.1983
X6.672Y-2.744
X6.695Y-2.91
X6.727Y-4.0578
X6.78Y-4.14
X6.8522Y-4.1259
X6.8648Y-2.9255
X6.8668Y-4.0648
X6.8977Y-4.0652
X6.91Y-2.975
X6.9439Y-4.168
X6.995Y-2.715
X7.003Y-2.7735
X7.027Y-4.1704
X7.0309Y-4.2081
X7.0416Y-2.8928
X7.085Y-2.82
X7.0896Y-4.0751
X7.09Y-4.145
X7.12Y-4.145
X7.1369Y-4.0593
X7.1369Y-4.0987
X7.188Y-4.2129
X7.2902Y-3.7189
X7.295Y-3.93
X7.465Y-2.97
X7.52Y-2.97
X7.5487Y-4.0345
X7.6114Y-3.0181
X8.425Y-3.29
X8.4437Y-3.0803
X8.453Y-3.1845
X8.455Y-3.305
X8.4585Y-3.216
X8.478Y-3.085
X8.51Y-3.095
X8.5806Y-3.1526
X8.6152Y-3.307
X8.6745Y-3.2789
X8.76Y-3.15
X8.795Y-3.26
X8.851Y-3.1774
X8.95Y-3.315
X8.985Y-3.245
X9.0028Y-3.0929
X9.0522Y-3.1337
X9.054Y-3.4036
X9.0565Y-3.2038
X9.1298Y-3.4578
X9.135Y-3.565
X9.1398Y-3.265
X9.14Y-3.525
X9.17Y-3.59
X9.1733Y-3.267
X9.1892Y-3.4601
X9.2Y-3.51
X9.2162Y-3.3414
X9.2495Y-3.3151
X9.32Y-3.115
X9.3268Y-3.3682
X9.3465Y-3.1426
X9.41Y-3.325
X9.44Y-3.84
X9.48Y-3.375
X9.5852Y-3.3609
X9.5955Y-3.081
X9.6491Y-3.1255
X9.705Y-3.785
X9.7151Y-3.3937
X9.7585Y-3.6349
X9.7821Y-3.7054
X9.7943Y-3.54
X9.8085Y-3.644
X9.8158Y-3.473
T5
X2.0014Y-3.7924
X2.0014Y-3.8239
X2.0014Y-3.8554
X2.0014Y-3.9184
X2.0014Y-3.9499
X2.0014Y-3.9814
X2.029Y-3.7767
X2.029Y-3.8396
X2.029Y-3.8711
X2.029Y-3.9026
X2.029Y-3.9341
X2.029Y-3.9971
T8
X9.8424Y-3.1042
X9.8424Y-3.1542
X9.8424Y-3.2042
T9
X2.0972Y-3.0276
X2.1759Y-3.0276
X2.2547Y-3.0276
X2.3334Y-3.0276
X4.365Y-3.71
X4.365Y-3.76
X4.415Y-3.71
X4.415Y-3.76
X4.465Y-3.71
X4.465Y-3.76
X4.515Y-3.71
X4.515Y-3.76
X4.565Y-3.71
X4.565Y-3.76
T10
X9.4994Y-3.1546
X9.5494Y-3.1046
X9.5494Y-3.2046
X9.5994Y-3.1546
T6
X1.7815Y-3.0575G85X1.7559Y-3.0575
G05
X1.7815Y-3.3331G85X1.7559Y-3.3331
G05
X1.7829Y-3.7101G85X1.7593Y-3.7101
G05
X1.7829Y-4.0637G85X1.7593Y-4.0637
G05
X2.0172Y-3.7243G85X1.9935Y-3.7243
G05
X2.0172Y-4.0495G85X1.9935Y-4.0495
G05
T7
X1.874Y-3.0909G85X1.874Y-3.1028
G05
X1.874Y-3.2878G85X1.874Y-3.2996
G05
T11
X9.2896Y-3.566G85X9.2408Y-3.566
G05
X9.2896Y-3.766G85X9.2408Y-3.766
G05
T0
M30
