 0.0007,       0
 0.0207,       0
 0.0407,       0
 0.0607,       0
 0.0807,       0
 0.1007,       0
 0.1207,       0
 0.1406,       0
 0.1606,       0
 0.1806,       0
 0.2006,       0
 0.2206,       0
 0.2406,       0
 0.2606,       1
 0.2806,       2
 0.3006,      32
 0.3205,     256
 0.3405,    1070
 0.3605,    3023
 0.3805,    4967
 0.4005,    4922
 0.4205,    2801
 0.4405,     996
 0.4605,     209
 0.4804,      27
 0.5004,       6
 0.5204,       2
 0.5404,       0
 0.5604,       1
 0.5804,       0
 0.6004,       1
 0.6204,       2
 0.6404,       1
 0.6603,       0
 0.6803,     195
 0.7003,     211
 0.7203,     227
 0.7403,     204
 0.7603,     192
 0.7803,     175
 0.8003,     187
 0.8203,     241
 0.8402,     333
 0.8602,     379
 0.8802,     432
 0.9002,     391
 0.9202,     376
 0.9402,     376
 0.9602,     366
 0.9802,     300
 1.0001,     245
 1.0201,     216
 1.0401,     213
 1.0601,     210
 1.0801,     239
 1.1001,     269
 1.1201,     222
 1.1401,     190
 1.1601,     215
 1.1800,     206
 1.2000,     265
 1.2200,     321
 1.2400,     350
 1.2600,     321
 1.2800,     230
 1.3000,     211
 1.3200,     164
 1.3400,     154
 1.3599,     138
 1.3799,     173
 1.3999,     194
 1.4199,     274
 1.4399,     314
 1.4599,     410
 1.4799,     476
 1.4999,     553
 1.5198,     777
 1.5398,     934
 1.5598,    1015
 1.5798,     956
 1.5998,     725
 1.6198,     482
 1.6398,     345
 1.6598,     382
 1.6798,     577
 1.6997,     851
 1.7197,    1163
 1.7397,    1221
 1.7597,    1015
 1.7797,     822
 1.7997,     620
 1.8197,     500
 1.8397,     478
 1.8597,     490
 1.8796,     573
 1.8996,    1044
 1.9196,    1984
 1.9396,    3676
 1.9596,    6454
 1.9796,    9810
 1.9996,   11985
 2.0196,   11586
 2.0395,    9297
 2.0595,    6102
 2.0795,    3257
 2.0995,    1939
 2.1195,    1406
 2.1395,    1184
 2.1595,    1174
 2.1795,    1500
 2.1995,    2703
 2.2194,    6441
 2.2394,   13681
 2.2594,   24260
 2.2794,   35224
 2.2994,   41452
 2.3194,   38962
 2.3394,   30438
 2.3594,   19306
 2.3794,   10515
 2.3993,    6015
 2.4193,    4300
 2.4393,    4046
 2.4593,    4220
 2.4793,    3916
 2.4993,    3454
 2.5193,    3203
 2.5393,    4110
 2.5592,    6230
 2.5792,    9913
 2.5992,   13597
 2.6192,   16377
 2.6392,   17790
 2.6592,   17507
 2.6792,   16839
 2.6992,   14831
 2.7192,   12035
 2.7391,    9232
 2.7591,    7125
 2.7791,    6192
 2.7991,    6390
 2.8191,    6920
 2.8391,    7051
 2.8591,    6148
 2.8791,    5224
 2.8991,    4221
 2.9190,    3658
 2.9390,    3538
 2.9590,    3227
 2.9790,    3042
 2.9990,    2439
 3.0190,    1903
 3.0390,    1428
 3.0590,    1162
 3.0789,    1000
 3.0989,     935
 3.1189,    1101
 3.1389,    1178
 3.1589,    1425
 3.1789,    2350
 3.1989,    4659
 3.2189,   10009
 3.2389,   19527
 3.2588,   33863
 3.2788,   49931
 3.2988,   61357
 3.3188,   63565
 3.3388,   54424
 3.3588,   39204
 3.3788,   24146
 3.3988,   12496
 3.4188,    5803
 3.4387,    2720
 3.4587,    1737
 3.4787,    1707
 3.4987,    2600
 3.5187,    4075
 3.5387,    6302
 3.5587,    9228
 3.5787,   12384
 3.5986,   16483
 3.6186,   22379
 3.6386,   30367
 3.6586,   38576
 3.6786,   43542
 3.6986,   42713
 3.7186,   36345
 3.7386,   25997
 3.7586,   15837
 3.7785,    8792
 3.7985,    4118
 3.8185,    1897
 3.8385,    1095
 3.8585,     929
 3.8785,     940
 3.8985,    1295
 3.9185,    1849
 3.9384,    2816
 3.9584,    4165
 3.9784,    5514
 3.9984,    6656
 4.0184,    6725
 4.0384,    5997
 4.0584,    4712
 4.0784,    3264
 4.0984,    2189
 4.1183,    1310
 4.1383,     923
 4.1583,     775
 4.1783,     622
 4.1983,     586
 4.2183,     603
 4.2383,     552
 4.2583,     612
 4.2783,     592
 4.2982,     591
 4.3182,     574
 4.3382,     574
 4.3582,     621
 4.3782,     629
 4.3982,     612
 4.4182,     656
 4.4382,     627
 4.4581,     689
 4.4781,     725
 4.4981,     742
 4.5181,     734
 4.5381,     713
 4.5581,     744
 4.5781,     732
 4.5981,     711
 4.6181,     767
 4.6380,     709
 4.6580,     742
 4.6780,     712
 4.6980,     696
 4.7180,     662
 4.7380,     687
 4.7580,     711
 4.7780,     707
 4.7980,     730
 4.8179,     744
 4.8379,     784
 4.8579,     753
 4.8779,     757
 4.8979,     790
 4.9179,     760
 4.9379,     773
 4.9579,     786
 4.9778,     812
 4.9978,     830
 5.0178,     832
 5.0378,     802
 5.0578,     815
 5.0778,     805
 5.0978,     840
 5.1178,     829
 5.1378,     830
 5.1577,     847
 5.1777,     833
 5.1977,     800
 5.2177,     851
 5.2377,     873
 5.2577,     872
 5.2777,     862
 5.2977,     872
 5.3177,     918
 5.3376,     901
 5.3576,     902
 5.3776,     930
 5.3976,     939
 5.4176,     942
 5.4376,     893
 5.4576,     983
 5.4776,     947
 5.4975,     944
 5.5175,    1021
 5.5375,    1013
 5.5575,    1073
 5.5775,    1061
 5.5975,    1127
 5.6175,    1136
 5.6375,    1220
 5.6575,    1211
 5.6774,    1210
 5.6974,    1227
 5.7174,    1314
 5.7374,    1604
 5.7574,    2127
 5.7774,    3303
 5.7974,    5193
 5.8174,    8208
 5.8374,   11593
 5.8573,   15017
 5.8773,   17158
 5.8973,   17696
 5.9173,   16734
 5.9373,   13604
 5.9573,   10125
 5.9773,    7082
 5.9973,    4638
 6.0172,    3015
 6.0372,    2072
 6.0572,    1583
 6.0772,    1496
 6.0972,    1325
 6.1172,    1281
 6.1372,    1336
 6.1572,    1323
 6.1772,    1228
 6.1971,    1364
 6.2171,    1427
 6.2371,    1477
 6.2571,    1604
 6.2771,    1751
 6.2971,    2055
 6.3171,    2438
 6.3371,    2938
 6.3571,    3424
 6.3770,    3925
 6.3970,    4442
 6.4170,    4683
 6.4370,    5016
 6.4570,    4778
 6.4770,    4656
 6.4970,    4195
 6.5170,    3543
 6.5369,    3221
 6.5569,    2625
 6.5769,    2117
 6.5969,    1810
 6.6169,    1590
 6.6369,    1576
 6.6569,    1389
 6.6769,    1371
 6.6969,    1342
 6.7168,    1301
 6.7368,    1279
 6.7568,    1347
 6.7768,    1348
 6.7968,    1394
 6.8168,    1455
 6.8368,    1472
 6.8568,    1435
 6.8768,    1435
 6.8967,    1606
 6.9167,    1615
 6.9367,    1606
 6.9567,    1680
 6.9767,    1746
 6.9967,    1815
 7.0167,    1875
 7.0367,    1821
 7.0566,    1709
 7.0766,    1707
 7.0966,    1623
 7.1166,    1622
 7.1366,    1536
 7.1566,    1467
 7.1766,    1573
 7.1966,    1619
 7.2166,    1582
 7.2365,    1699
 7.2565,    1670
 7.2765,    1846
 7.2965,    1870
 7.3165,    1997
 7.3365,    1944
 7.3565,    2070
 7.3765,    2108
 7.3965,    2241
 7.4164,    2402
 7.4364,    2556
 7.4564,    2655
 7.4764,    2641
 7.4964,    2385
 7.5164,    2196
 7.5364,    2008
 7.5564,    1841
 7.5763,    1633
 7.5963,    1573
 7.6163,    1439
 7.6363,    1419
 7.6563,    1357
 7.6763,    1476
 7.6963,    1397
 7.7163,    1363
 7.7363,    1415
 7.7562,    1429
 7.7762,    1459
 7.7962,    1303
 7.8162,    1415
 7.8362,    1397
 7.8562,    1494
 7.8762,    1480
 7.8962,    1482
 7.9161,    1520
 7.9361,    1580
 7.9561,    1590
 7.9761,    1700
 7.9961,    1816
 8.0161,    1773
 8.0361,    1803
 8.0561,    1900
 8.0761,    1854
 8.0960,    1719
 8.1160,    1744
 8.1360,    1715
 8.1560,    1598
 8.1760,    1624
 8.1960,    1612
 8.2160,    1546
 8.2360,    1615
 8.2560,    1585
 8.2759,    1611
 8.2959,    1568
 8.3159,    1534
 8.3359,    1509
 8.3559,    1439
 8.3759,    1494
 8.3959,    1542
 8.4159,    1458
 8.4358,    1463
 8.4558,    1510
 8.4758,    1597
 8.4958,    1763
 8.5158,    2042
 8.5358,    2378
 8.5558,    2692
 8.5758,    3156
 8.5958,    3480
 8.6157,    3728
 8.6357,    3797
 8.6557,    3561
 8.6757,    3232
 8.6957,    2906
 8.7157,    2422
 8.7357,    2120
 8.7557,    1903
 8.7757,    1779
 8.7956,    1665
 8.8156,    1568
 8.8356,    1584
 8.8556,    1572
 8.8756,    1581
 8.8956,    1508
 8.9156,    1603
 8.9356,    1533
 8.9555,    1491
 8.9755,    1544
 8.9955,    1498
 9.0155,    1511
 9.0355,    1496
 9.0555,    1545
 9.0755,    1464
 9.0955,    1505
 9.1155,    1555
 9.1354,    1550
 9.1554,    1563
 9.1754,    1557
 9.1954,    1583
 9.2154,    1684
 9.2354,    1578
 9.2554,    1541
 9.2754,    1615
 9.2954,    1458
 9.3153,    1597
 9.3353,    1539
 9.3553,    1538
 9.3753,    1583
 9.3953,    1632
 9.4153,    1588
 9.4353,    1579
 9.4553,    1623
 9.4752,    1736
 9.4952,    1786
 9.5152,    1875
 9.5352,    1893
 9.5552,    1873
 9.5752,    1887
 9.5952,    1926
 9.6152,    1840
 9.6352,    1777
 9.6551,    1752
 9.6751,    1770
 9.6951,    1650
 9.7151,    1640
 9.7351,    1593
 9.7551,    1628
 9.7751,    1591
 9.7951,    1645
 9.8151,    1630
 9.8350,    1637
 9.8550,    1597
 9.8750,    1585
 9.8950,    1533
 9.9150,    1576
 9.9350,    1593
 9.9550,    1711
 9.9750,    1616
 9.9949,    1541
10.0149,    1660
10.0349,    1629
10.0549,    1656
10.0749,    1604
10.0949,    1586
10.1149,    1618
10.1349,    1603
10.1549,    1637
10.1748,    1659
10.1948,    1568
10.2148,    1635
10.2348,    1567
10.2548,    1620
10.2748,    1609
10.2948,    1605
10.3148,    1557
10.3348,    1602
10.3547,    1594
10.3747,    1591
10.3947,    1594
10.4147,    1643
10.4347,    1658
10.4547,    1664
10.4747,    1615
10.4947,    1657
10.5146,    1600
10.5346,    1638
10.5546,    1619
10.5746,    1534
10.5946,    1567
10.6146,    1599
10.6346,    1667
10.6546,    1712
10.6746,    1594
10.6945,    1743
10.7145,    1553
10.7345,    1584
10.7545,    1656
10.7745,    1634
10.7945,    1640
10.8145,    1648
10.8345,    1616
10.8545,    1556
10.8744,    1611
10.8944,    1584
10.9144,    1652
10.9344,    1604
10.9544,    1600
10.9744,    1590
10.9944,    1545
11.0144,    1535
11.0343,    1635
11.0543,    1542
11.0743,    1595
11.0943,    1594
11.1143,    1628
11.1343,    1529
11.1543,    1587
11.1743,    1609
11.1943,    1574
11.2142,    1595
11.2342,    1568
11.2542,    1570
11.2742,    1592
11.2942,    1605
11.3142,    1543
11.3342,    1586
11.3542,    1576
11.3742,    1552
11.3941,    1558
11.4141,    1539
11.4341,    1593
11.4541,    1643
11.4741,    1591
11.4941,    1525
11.5141,    1544
11.5341,    1572
11.5540,    1472
11.5740,    1501
11.5940,    1582
11.6140,    1502
11.6340,    1588
11.6540,    1556
11.6740,    1561
11.6940,    1586
11.7140,    1617
11.7339,    1555
11.7539,    1582
11.7739,    1634
11.7939,    1604
11.8139,    1775
11.8339,    1853
11.8539,    1998
11.8739,    1949
11.8938,    1904
11.9138,    1977
11.9338,    1959
11.9538,    1863
11.9738,    1846
11.9938,    1705
12.0138,    1667
12.0338,    1540
12.0538,    1558
12.0737,    1491
12.0937,    1542
12.1137,    1556
12.1337,    1506
12.1537,    1496
12.1737,    1427
12.1937,    1423
12.2137,    1448
12.2337,    1442
12.2536,    1478
12.2736,    1447
12.2936,    1467
12.3136,    1487
12.3336,    1429
12.3536,    1425
12.3736,    1514
12.3936,    1414
12.4135,    1474
12.4335,    1406
12.4535,    1471
12.4735,    1476
12.4935,    1475
12.5135,    1458
12.5335,    1449
12.5535,    1437
12.5735,    1424
12.5934,    1423
12.6134,    1402
12.6334,    1407
12.6534,    1453
12.6734,    1420
12.6934,    1412
12.7134,    1414
12.7334,    1357
12.7534,    1337
12.7733,    1407
12.7933,    1404
12.8133,    1412
12.8333,    1392
12.8533,    1330
12.8733,    1403
12.8933,    1371
12.9133,    1357
12.9332,    1422
12.9532,    1350
12.9732,    1309
12.9932,    1374
13.0132,    1386
13.0332,    1359
13.0532,    1403
13.0732,    1278
13.0932,    1407
13.1131,    1345
13.1331,    1355
13.1531,    1316
13.1731,    1408
13.1931,    1348
13.2131,    1403
13.2331,    1399
13.2531,    1465
13.2731,    1543
13.2930,    1528
13.3130,    1504
13.3330,    1515
13.3530,    1525
13.3730,    1593
13.3930,    1486
13.4130,    1451
13.4330,    1439
13.4529,    1490
13.4729,    1420
13.4929,    1312
13.5129,    1284
13.5329,    1266
13.5529,    1288
13.5729,    1277
13.5929,    1230
13.6129,    1202
13.6328,    1226
13.6528,    1206
13.6728,    1288
13.6928,    1192
13.7128,    1306
13.7328,    1244
13.7528,    1250
13.7728,    1267
13.7928,    1186
13.8127,    1142
13.8327,    1246
13.8527,    1157
13.8727,    1134
13.8927,    1187
13.9127,    1239
13.9327,    1199
13.9527,    1203
13.9726,    1232
13.9926,    1282
14.0126,    1244
14.0326,    1284
14.0526,    1366
14.0726,    1358
14.0926,    1401
14.1126,    1451
14.1326,    1454
14.1525,    1424
14.1725,    1369
14.1925,    1374
14.2125,    1271
14.2325,    1308
14.2525,    1323
14.2725,    1245
14.2925,    1184
14.3125,    1192
14.3324,    1115
14.3524,    1137
14.3724,    1116
14.3924,    1140
14.4124,    1148
14.4324,    1132
14.4524,    1102
14.4724,    1176
14.4923,    1106
14.5123,    1128
14.5323,    1076
14.5523,    1040
14.5723,    1095
14.5923,    1102
14.6123,    1068
14.6323,    1098
14.6523,    1089
14.6722,    1084
14.6922,    1035
14.7122,    1021
14.7322,    1058
14.7522,    1088
14.7722,    1017
14.7922,    1068
14.8122,    1039
14.8322,     984
14.8521,     990
14.8721,    1000
14.8921,    1037
14.9121,    1003
14.9321,    1083
14.9521,    1083
14.9721,    1078
14.9921,    1042
15.0120,    1044
15.0320,    1027
15.0520,    1020
15.0720,    1068
15.0920,     986
15.1120,     930
15.1320,     923
15.1520,     943
15.1720,    1000
15.1919,     958
15.2119,    1042
15.2319,     984
15.2519,     936
15.2719,     910
15.2919,     993
15.3119,     912
15.3319,     935
15.3518,     909
15.3718,     932
15.3918,     960
15.4118,     902
15.4318,     964
15.4518,     863
15.4718,     898
15.4918,     922
15.5118,     881
15.5317,     919
15.5517,     885
15.5717,     904
15.5917,     913
15.6117,     888
15.6317,     900
15.6517,     851
15.6717,     901
15.6917,     867
15.7116,     948
15.7316,     929
15.7516,     870
15.7716,     909
15.7916,     941
15.8116,     857
15.8316,     944
15.8516,     870
15.8715,     845
15.8915,     880
15.9115,     864
15.9315,     838
15.9515,     818
15.9715,     816
15.9915,     858
16.0115,     884
16.0315,     817
16.0514,     826
16.0714,     804
16.0914,     812
16.1114,     800
16.1314,     766
16.1514,     780
16.1714,     809
16.1914,     814
16.2114,     810
16.2313,     772
16.2513,     754
16.2713,     824
16.2913,     787
16.3113,     784
16.3313,     830
16.3513,     737
16.3713,     768
16.3912,     745
16.4112,     812
16.4312,     742
16.4512,     752
16.4712,     753
16.4912,     714
16.5112,     742
16.5312,     789
16.5512,     695
16.5711,     737
16.5911,     663
16.6111,     724
16.6311,     672
16.6511,     715
16.6711,     680
16.6911,     739
16.7111,     712
16.7311,     725
16.7510,     688
16.7710,     668
16.7910,     666
16.8110,     692
16.8310,     726
16.8510,     678
16.8710,     667
16.8910,     662
16.9109,     658
16.9309,     679
16.9509,     649
16.9709,     659
16.9909,     621
17.0109,     677
17.0309,     665
17.0509,     688
17.0709,     620
17.0908,     648
17.1108,     629
17.1308,     655
17.1508,     633
17.1708,     597
17.1908,     632
17.2108,     640
17.2308,     611
17.2508,     607
17.2707,     654
17.2907,     612
17.3107,     611
17.3307,     625
17.3507,     611
17.3707,     621
17.3907,     639
17.4107,     620
17.4306,     639
17.4506,     634
17.4706,     612
17.4906,     642
17.5106,     600
17.5306,     614
17.5506,     574
17.5706,     582
17.5906,     556
17.6105,     578
17.6305,     527
17.6505,     572
17.6705,     558
17.6905,     522
17.7105,     580
17.7305,     570
17.7505,     543
17.7705,     525
17.7904,     553
17.8104,     561
17.8304,     536
17.8504,     540
17.8704,     556
17.8904,     533
17.9104,     519
17.9304,     516
17.9503,     535
17.9703,     513
17.9903,     522
18.0103,     513
18.0303,     557
18.0503,     487
18.0703,     519
18.0903,     531
18.1103,     510
18.1302,     486
18.1502,     531
18.1702,     483
18.1902,     530
18.2102,     487
18.2302,     507
18.2502,     496
18.2702,     468
18.2902,     478
18.3101,     466
18.3301,     486
18.3501,     503
18.3701,     467
18.3901,     467
18.4101,     486
18.4301,     466
18.4501,     483
18.4700,     477
18.4900,     506
18.5100,     474
18.5300,     465
18.5500,     493
18.5700,     485
18.5900,     487
18.6100,     485
18.6300,     457
18.6499,     473
18.6699,     478
18.6899,     505
18.7099,     515
18.7299,     518
18.7499,     458
18.7699,     468
18.7899,     515
18.8099,     494
18.8298,     498
18.8498,     514
18.8698,     507
18.8898,     506
18.9098,     512
18.9298,     488
18.9498,     483
18.9698,     517
18.9897,     493
19.0097,     477
19.0297,     476
19.0497,     467
19.0697,     479
19.0897,     484
19.1097,     457
19.1297,     462
19.1497,     463
19.1696,     470
19.1896,     415
19.2096,     450
19.2296,     468
19.2496,     407
19.2696,     409
19.2896,     400
19.3096,     382
19.3295,     372
19.3495,     402
19.3695,     364
19.3895,     385
19.4095,     379
19.4295,     391
19.4495,     355
19.4695,     329
19.4895,     360
19.5094,     351
19.5294,     364
19.5494,     340
19.5694,     356
19.5894,     339
19.6094,     337
19.6294,     339
19.6494,     342
19.6694,     351
19.6893,     318
19.7093,     290
19.7293,     301
19.7493,     347
19.7693,     327
19.7893,     294
19.8093,     342
19.8293,     322
19.8492,     288
19.8692,     278
19.8892,     302
19.9092,     269
19.9292,     282
19.9492,     266
19.9692,     277
19.9892,     250
20.0092,     281
20.0291,     292
20.0491,     302
20.0691,     287
20.0891,     310
20.1091,     280
20.1291,     291
20.1491,     299
20.1691,     303
20.1891,     291
20.2090,     304
20.2290,     299
20.2490,     297
20.2690,     256
20.2890,     263
20.3090,     244
20.3290,     251
20.3490,     260
20.3689,     250
20.3889,     217
20.4089,     253
20.4289,     260
20.4489,     243
20.4689,     242
20.4889,     253
20.5089,     225
20.5289,     252
20.5488,     214
20.5688,     225
20.5888,     249
20.6088,     224
20.6288,     215
20.6488,     203
20.6688,     189
20.6888,     235
20.7088,     236
20.7287,     237
20.7487,     204
20.7687,     193
20.7887,     192
20.8087,     193
20.8287,     196
20.8487,     200
20.8687,     188
20.8886,     215
20.9086,     182
20.9286,     171
20.9486,     195
20.9686,     195
20.9886,     198
21.0086,     194
21.0286,     191
21.0486,     179
21.0685,     175
21.0885,     191
21.1085,     171
21.1285,     190
21.1485,     147
21.1685,     195
21.1885,     165
21.2085,     175
21.2285,     186
21.2484,     190
21.2684,     173
21.2884,     168
21.3084,     169
21.3284,     166
21.3484,     182
21.3684,     145
21.3884,     141
21.4083,     155
21.4283,     152
21.4483,     153
21.4683,     136
21.4883,     138
21.5083,     147
21.5283,     139
21.5483,     145
21.5683,     141
21.5882,     152
21.6082,     134
21.6282,     127
21.6482,     127
21.6682,     134
21.6882,     159
21.7082,     144
21.7282,     135
21.7482,     118
21.7681,     109
21.7881,     114
21.8081,     104
21.8281,     124
21.8481,     102
21.8681,     125
21.8881,     106
21.9081,      99
21.9280,     104
21.9480,     109
21.9680,     101
21.9880,     110
22.0080,     114
22.0280,      83
22.0480,      99
22.0680,      96
22.0880,      84
22.1079,      96
22.1279,     103
22.1479,      80
22.1679,      84
22.1879,      85
22.2079,      75
22.2279,      66
22.2479,      71
22.2679,      89
22.2878,      82
22.3078,      77
22.3278,      56
22.3478,      86
22.3678,      63
22.3878,      71
22.4078,      76
22.4278,      75
22.4477,      68
22.4677,      58
22.4877,      66
22.5077,      71
22.5277,      52
22.5477,      66
22.5677,      70
22.5877,      60
22.6077,      48
22.6276,      52
22.6476,      56
22.6676,      65
22.6876,      49
22.7076,      54
22.7276,      46
22.7476,      55
22.7676,      38
22.7876,      60
22.8075,      33
22.8275,      46
22.8475,      47
22.8675,      48
22.8875,      39
22.9075,      50
22.9275,      44
22.9475,      34
22.9674,      36
22.9874,      33
23.0074,      29
23.0274,      38
23.0474,      38
23.0674,      22
23.0874,      34
23.1074,      38
23.1274,      35
23.1473,      26
23.1673,      25
23.1873,      28
23.2073,      19
23.2273,      33
23.2473,      34
23.2673,      25
23.2873,      18
23.3072,      33
23.3272,      18
23.3472,      27
23.3672,      18
23.3872,      23
23.4072,      21
23.4272,      27
23.4472,      27
23.4672,      22
23.4871,      25
23.5071,      15
23.5271,      26
23.5471,      16
23.5671,      14
23.5871,      19
23.6071,      26
23.6271,      20
23.6471,      20
23.6670,      13
23.6870,      18
23.7070,      12
23.7270,      20
23.7470,      15
23.7670,      15
23.7870,      13
23.8070,      16
23.8269,      13
23.8469,      21
23.8669,      18
23.8869,      10
23.9069,      11
23.9269,      11
23.9469,      20
23.9669,      16
23.9869,       9
24.0068,      11
24.0268,       8
24.0468,      12
24.0668,       7
24.0868,      14
24.1068,      13
24.1268,      11
24.1468,      13
24.1668,      11
24.1867,       6
24.2067,       8
24.2267,      11
24.2467,      11
24.2667,      11
24.2867,       6
24.3067,      12
24.3267,      11
24.3466,       5
24.3666,      10
24.3866,       6
24.4066,      10
24.4266,      12
24.4466,      14
24.4666,       7
24.4866,       8
24.5066,       5
24.5265,       5
24.5465,       7
24.5665,       6
24.5865,       9
24.6065,      10
24.6265,      10
24.6465,      10
24.6665,       4
24.6865,      10
24.7064,      11
24.7264,       9
24.7464,      13
24.7664,       8
24.7864,       9
24.8064,      11
24.8264,       5
24.8464,       8
24.8663,       4
24.8863,       7
24.9063,       7
24.9263,       5
24.9463,       6
24.9663,       6
24.9863,       7
25.0063,       6
25.0263,       7
25.0462,       5
25.0662,       7
25.0862,       8
25.1062,      10
25.1262,       7
25.1462,       5
25.1662,      11
25.1862,       9
25.2062,       6
25.2261,       3
25.2461,       8
25.2661,      10
25.2861,       4
25.3061,       2
25.3261,       8
25.3461,       7
25.3661,       6
25.3860,       5
25.4060,       1
25.4260,       4
25.4460,      10
25.4660,       6
25.4860,       6
25.5060,       6
25.5260,       7
25.5460,       6
25.5659,       2
25.5859,       4
25.6059,       8
25.6259,       3
25.6459,       5
25.6659,       7
25.6859,       6
25.7059,       8
25.7259,       8
25.7458,       3
25.7658,      11
25.7858,      11
25.8058,       6
25.8258,       3
25.8458,       2
25.8658,       4
25.8858,       7
25.9057,       6
25.9257,       8
25.9457,       3
25.9657,       6
25.9857,       6
26.0057,       6
26.0257,       2
26.0457,       7
26.0657,       1
26.0856,       3
26.1056,       4
26.1256,       6
26.1456,       6
26.1656,       7
26.1856,       1
26.2056,       4
26.2256,       3
26.2456,       7
26.2655,       2
26.2855,       4
26.3055,       4
26.3255,       7
26.3455,       8
26.3655,       0
26.3855,       5
26.4055,       6
26.4254,       5
26.4454,       3
26.4654,       9
26.4854,       4
26.5054,       2
26.5254,       9
26.5454,       4
26.5654,       2
26.5854,       4
26.6053,       3
26.6253,       4
26.6453,       2
26.6653,       5
26.6853,       2
26.7053,      11
26.7253,       4
26.7453,       5
26.7653,       2
26.7852,       3
26.8052,       4
26.8252,       1
26.8452,       3
26.8652,       8
26.8852,       6
26.9052,       7
26.9252,       4
26.9451,       7
26.9651,       1
26.9851,       4
27.0051,       5
27.0251,       3
27.0451,       6
27.0651,       3
27.0851,       3
27.1051,       4
27.1250,       6
27.1450,       2
27.1650,       4
27.1850,       4
27.2050,       5
27.2250,       2
27.2450,       7
27.2650,       5
27.2849,       3
27.3049,       7
27.3249,       5
27.3449,       4
27.3649,       3
27.3849,       1
27.4049,       9
27.4249,      12
27.4449,       4
27.4648,       4
27.4848,       4
27.5048,       6
27.5248,       3
27.5448,       4
27.5648,       7
27.5848,       3
27.6048,       4
27.6248,       3
27.6447,       2
27.6647,       7
27.6847,       3
27.7047,       5
27.7247,       3
27.7447,       1
27.7647,       2
27.7847,       4
27.8046,       3
27.8246,       2
27.8446,       5
27.8646,       7
27.8846,       3
27.9046,       2
27.9246,       2
27.9446,       2
27.9646,       5
27.9845,       6
28.0045,       3
28.0245,       7
28.0445,       2
28.0645,       4
28.0845,       0
28.1045,       3
28.1245,       2
28.1445,       6
28.1644,       1
28.1844,       1
28.2044,       1
28.2244,       0
28.2444,       5
28.2644,       3
28.2844,       2
28.3044,       2
28.3243,       3
28.3443,       2
28.3643,       3
28.3843,       4
28.4043,       3
28.4243,       5
28.4443,       3
28.4643,       3
28.4843,       2
28.5042,       5
28.5242,       3
28.5442,       4
28.5642,       0
28.5842,       4
28.6042,       2
28.6242,       5
28.6442,       0
28.6642,       2
28.6841,       1
28.7041,       6
28.7241,       4
28.7441,       5
28.7641,       1
28.7841,       3
28.8041,       3
28.8241,       4
28.8440,       7
28.8640,       3
28.8840,       2
28.9040,       3
28.9240,       5
28.9440,       4
28.9640,       0
28.9840,       2
29.0040,       3
29.0239,       1
29.0439,       4
29.0639,       2
29.0839,       4
29.1039,       1
29.1239,       3
29.1439,       4
29.1639,       0
29.1839,       3
29.2038,       3
29.2238,       2
29.2438,       4
29.2638,       3
29.2838,       1
29.3038,       1
29.3238,       3
29.3438,       1
29.3637,       4
29.3837,       2
29.4037,       3
29.4237,       3
29.4437,       0
29.4637,       0
29.4837,       1
29.5037,       1
29.5237,       1
29.5436,       3
29.5636,       4
29.5836,       3
29.6036,       4
29.6236,       0
29.6436,       0
29.6636,       3
29.6836,       2
29.7036,       3
29.7235,       6
29.7435,       2
29.7635,       3
29.7835,       0
29.8035,       1
29.8235,       6
29.8435,       1
29.8635,       4
29.8834,       1
29.9034,       4
29.9234,       2
29.9434,       3
29.9634,       2
29.9834,       2
30.0034,       2
30.0234,       3
30.0434,       2
30.0633,       0
30.0833,       3
30.1033,       3
30.1233,       1
30.1433,       1
30.1633,       4
30.1833,       4
30.2033,       2
30.2233,       1
30.2432,       2
30.2632,       2
30.2832,       3
30.3032,       4
30.3232,       2
30.3432,       0
30.3632,       1
30.3832,       2
30.4031,       1
30.4231,       4
30.4431,       3
30.4631,       0
30.4831,       2
30.5031,       0
30.5231,       2
30.5431,       3
30.5631,       2
30.5830,       1
30.6030,       0
30.6230,       3
30.6430,       1
30.6630,       1
30.6830,       3
30.7030,       2
30.7230,       4
30.7429,       2
30.7629,       1
30.7829,       2
30.8029,       0
30.8229,       2
30.8429,       3
30.8629,       1
30.8829,       2
30.9029,       3
30.9228,       4
30.9428,       3
30.9628,       4
30.9828,       3
31.0028,       2
31.0228,       0
31.0428,       1
31.0628,       3
31.0828,       2
31.1027,       1
31.1227,       4
31.1427,       1
31.1627,       2
31.1827,       0
31.2027,       1
31.2227,       2
31.2427,       1
31.2626,       1
31.2826,       2
31.3026,       0
31.3226,       0
31.3426,       3
31.3626,       1
31.3826,       1
31.4026,       2
31.4226,       3
31.4425,       2
31.4625,       3
31.4825,       1
31.5025,       2
31.5225,       0
31.5425,       0
31.5625,       2
31.5825,       0
31.6025,       1
31.6224,       0
31.6424,       2
31.6624,       1
31.6824,       2
31.7024,       2
31.7224,       1
31.7424,       1
31.7624,       2
31.7823,       2
31.8023,       4
31.8223,       1
31.8423,       4
31.8623,       0
31.8823,       1
31.9023,       2
31.9223,       0
31.9423,       0
31.9622,       1
31.9822,       3
32.0022,       2
32.0222,       0
32.0422,       2
32.0622,       1
32.0822,       0
32.1022,       1
32.1222,       0
32.1421,       0
32.1621,       2
32.1821,       0
32.2021,       0
32.2221,       0
32.2421,       0
32.2621,       0
32.2821,       0
32.3020,       0
32.3220,       0
32.3420,       0
32.3620,       1
32.3820,       1
32.4020,       3
32.4220,       1
32.4420,       1
32.4620,       0
32.4819,       4
32.5019,       1
32.5219,       1
32.5419,       3
32.5619,       1
32.5819,       0
32.6019,       1
32.6219,       2
32.6419,       1
32.6618,       1
32.6818,       0
32.7018,       1
32.7218,       2
32.7418,       0
32.7618,       1
32.7818,       3
32.8018,       2
32.8217,       0
32.8417,       3
32.8617,       1
32.8817,       1
32.9017,       0
32.9217,       1
32.9417,       0
32.9617,       0
32.9817,       1
33.0016,       3
33.0216,       1
33.0416,       0
33.0616,       1
33.0816,       0
33.1016,       1
33.1216,       0
33.1416,       1
33.1616,       1
33.1815,       3
33.2015,       0
33.2215,       1
33.2415,       2
33.2615,       0
33.2815,       1
33.3015,       2
33.3215,       1
33.3414,       2
33.3614,       0
33.3814,       0
33.4014,       1
33.4214,       1
33.4414,       1
33.4614,       1
33.4814,       0
33.5014,       0
33.5213,       3
33.5413,       0
33.5613,       3
33.5813,       0
33.6013,       3
33.6213,       2
33.6413,       0
33.6613,       2
33.6813,       1
33.7012,       2
33.7212,       0
33.7412,       3
33.7612,       0
33.7812,       1
33.8012,       0
33.8212,       0
33.8412,       1
33.8611,       1
33.8811,       0
33.9011,       0
33.9211,       1
33.9411,       1
33.9611,       2
33.9811,       0
34.0011,       0
34.0211,       0
34.0410,       2
34.0610,       0
34.0810,       0
34.1010,       0
34.1210,       1
34.1410,       2
34.1610,       1
34.1810,       1
34.2010,       1
34.2209,       0
34.2409,       1
34.2609,       2
34.2809,       0
34.3009,       0
34.3209,       1
34.3409,       1
34.3609,       0
34.3808,       1
34.4008,       1
34.4208,       0
34.4408,       0
34.4608,       0
34.4808,       1
34.5008,       0
34.5208,       0
34.5408,       2
34.5607,       1
34.5807,       0
34.6007,       2
34.6207,       2
34.6407,       1
34.6607,       0
34.6807,       1
34.7007,       0
34.7206,       0
34.7406,       0
34.7606,       1
34.7806,       2
34.8006,       0
34.8206,       0
34.8406,       1
34.8606,       0
34.8806,       0
34.9005,       0
34.9205,       0
34.9405,       0
34.9605,       1
34.9805,       0
35.0005,       1
35.0205,       2
35.0405,       1
35.0605,       0
35.0804,       0
35.1004,       1
35.1204,       0
35.1404,       1
35.1604,       2
35.1804,       2
35.2004,       0
35.2204,       1
35.2403,       0
35.2603,       1
35.2803,       0
35.3003,       0
35.3203,       0
35.3403,       0
35.3603,       0
35.3803,       0
35.4003,       0
35.4202,       0
35.4402,       0
35.4602,       0
35.4802,       0
35.5002,       1
35.5202,       1
35.5402,       3
35.5602,       0
35.5802,       0
35.6001,       0
35.6201,       1
35.6401,       0
35.6601,       1
35.6801,       0
35.7001,       0
35.7201,       1
35.7401,       1
35.7600,       1
35.7800,       1
35.8000,       1
35.8200,       0
35.8400,       0
35.8600,       0
35.8800,       1
35.9000,       0
35.9200,       1
35.9399,       1
35.9599,       0
35.9799,       1
35.9999,       0
36.0199,       0
36.0399,       0
36.0599,       0
36.0799,       1
36.0999,       0
36.1198,       0
36.1398,       0
36.1598,       0
36.1798,       1
36.1998,       0
36.2198,       1
36.2398,       0
36.2598,       0
36.2797,       1
36.2997,       0
36.3197,       0
36.3397,       0
36.3597,       3
36.3797,       0
36.3997,       0
36.4197,       0
36.4397,       0
36.4596,       0
36.4796,       2
36.4996,       0
36.5196,       1
36.5396,       0
36.5596,       0
36.5796,       0
36.5996,       0
36.6196,       0
36.6395,       1
36.6595,       0
36.6795,       1
36.6995,       0
36.7195,       0
36.7395,       0
36.7595,       0
36.7795,       1
36.7994,       0
36.8194,       0
36.8394,       1
36.8594,       1
36.8794,       0
36.8994,       0
36.9194,       0
36.9394,       0
36.9594,       0
36.9793,       0
36.9993,       1
37.0193,       0
37.0393,       0
37.0593,       0
37.0793,       1
37.0993,       0
37.1193,       0
37.1393,       0
37.1592,       0
37.1792,       0
37.1992,       0
37.2192,       0
37.2392,       0
37.2592,       1
37.2792,       1
37.2992,       0
37.3191,       0
37.3391,       0
37.3591,       0
37.3791,       0
37.3991,       0
37.4191,       0
37.4391,       1
37.4591,       0
37.4791,       1
37.4990,       1
37.5190,       0
37.5390,       0
37.5590,       0
37.5790,       1
37.5990,       0
37.6190,       0
37.6390,       0
37.6590,       0
37.6789,       0
37.6989,       0
37.7189,       0
37.7389,       1
37.7589,       0
37.7789,       0
37.7989,       0
37.8189,       0
37.8388,       0
37.8588,       0
37.8788,       0
37.8988,       0
37.9188,       0
37.9388,       0
37.9588,       0
37.9788,       0
37.9988,       0
38.0187,       0
38.0387,       0
38.0587,       0
38.0787,       1
38.0987,       0
38.1187,       1
38.1387,       0
38.1587,       0
38.1787,       0
38.1986,       1
38.2186,       0
38.2386,       0
38.2586,       0
38.2786,       0
38.2986,       0
38.3186,       0
38.3386,       0
38.3585,       0
38.3785,       0
38.3985,       0
38.4185,       0
38.4385,       0
38.4585,       0
38.4785,       0
38.4985,       0
38.5185,       0
38.5384,       2
38.5584,       1
38.5784,       0
38.5984,       0
38.6184,       0
38.6384,       0
38.6584,       0
38.6784,       0
38.6983,       0
38.7183,       0
38.7383,       0
38.7583,       0
38.7783,       0
38.7983,       0
38.8183,       0
38.8383,       0
38.8583,       0
38.8782,       1
38.8982,       0
38.9182,       0
38.9382,       0
38.9582,       0
38.9782,       0
38.9982,       0
39.0182,       1
39.0382,       0
39.0581,       0
39.0781,       1
39.0981,       0
39.1181,       0
39.1381,       0
39.1581,       0
39.1781,       0
39.1981,       0
39.2180,       1
39.2380,       0
39.2580,       0
39.2780,       0
39.2980,       0
39.3180,       0
39.3380,       0
39.3580,       0
39.3780,       0
39.3979,       0
39.4179,       0
39.4379,       0
39.4579,       0
39.4779,       1
39.4979,       0
39.5179,       1
39.5379,       0
39.5579,       0
39.5778,       0
39.5978,       0
39.6178,       0
39.6378,       0
39.6578,       0
39.6778,       0
39.6978,       0
39.7178,       0
39.7377,       0
39.7577,       0
39.7777,       0
39.7977,       0
39.8177,       0
39.8377,       0
39.8577,       0
39.8777,       0
39.8977,       0
39.9176,       0
39.9376,       0
39.9576,       0
39.9776,       0
39.9976,       0
40.0176,       0
40.0376,       0
40.0576,       0
40.0776,       0
40.0975,       0
40.1175,       0
40.1375,       0
40.1575,       0
40.1775,       0
40.1975,       0
40.2175,       0
40.2375,       0
40.2574,       0
40.2774,       0
40.2974,       0
40.3174,       0
40.3374,       0
40.3574,       0
40.3774,       0
40.3974,       0
40.4174,       0
40.4373,       1
40.4573,       0
40.4773,       0
40.4973,       0
40.5173,       0
40.5373,       0
40.5573,       0
40.5773,       0
40.5973,       0
40.6172,       0
40.6372,       0
40.6572,       0
40.6772,       0
40.6972,       0
40.7172,       0
40.7372,       0
40.7572,       0
40.7771,       0
40.7971,       0
40.8171,       0
40.8371,       0
40.8571,       0
40.8771,       0
40.8971,       0
40.9171,       0
