 0.0007,       0
 0.0207,       0
 0.0407,       0
 0.0607,       0
 0.0807,       0
 0.1007,       0
 0.1207,       0
 0.1407,       0
 0.1607,       0
 0.1807,       0
 0.2007,       0
 0.2207,       0
 0.2407,       0
 0.2607,       1
 0.2807,       5
 0.3007,      41
 0.3207,     238
 0.3407,    1089
 0.3607,    3080
 0.3807,    5161
 0.4007,    4926
 0.4207,    2870
 0.4407,    1052
 0.4607,     207
 0.4807,      26
 0.5007,       7
 0.5207,       3
 0.5407,       1
 0.5607,       2
 0.5807,       2
 0.6007,       1
 0.6207,       1
 0.6407,       2
 0.6607,       3
 0.6807,     190
 0.7007,     191
 0.7207,     191
 0.7407,     199
 0.7607,     183
 0.7807,     155
 0.8007,     186
 0.8207,     183
 0.8407,     199
 0.8607,     206
 0.8807,     245
 0.9007,     264
 0.9207,     319
 0.9407,     391
 0.9607,     348
 0.9807,     286
 1.0007,     221
 1.0207,     179
 1.0407,     173
 1.0607,     234
 1.0807,     262
 1.1007,     220
 1.1207,     204
 1.1407,     205
 1.1607,     198
 1.1807,     223
 1.2007,     286
 1.2207,     367
 1.2407,     389
 1.2607,     397
 1.2807,     347
 1.3007,     245
 1.3207,     190
 1.3407,     163
 1.3607,     130
 1.3807,     158
 1.4007,     152
 1.4207,     206
 1.4407,     276
 1.4607,     329
 1.4807,     367
 1.5007,     416
 1.5207,     529
 1.5407,     654
 1.5607,     681
 1.5807,     684
 1.6007,     503
 1.6207,     401
 1.6407,     494
 1.6607,     919
 1.6807,    1799
 1.7007,    3086
 1.7207,    4181
 1.7407,    4452
 1.7607,    3664
 1.7807,    2579
 1.8007,    1447
 1.8207,     849
 1.8407,     632
 1.8607,     535
 1.8807,     651
 1.9007,    1176
 1.9207,    2667
 1.9407,    6102
 1.9607,   11728
 1.9807,   18358
 2.0007,   22685
 2.0207,   22458
 2.0407,   17506
 2.0607,   11286
 2.0807,    5927
 2.1007,    3303
 2.1207,    2191
 2.1407,    1857
 2.1607,    1492
 2.1807,    1290
 2.2007,    1551
 2.2207,    2676
 2.2407,    5320
 2.2607,    9117
 2.2807,   13203
 2.3007,   15401
 2.3207,   14869
 2.3407,   11480
 2.3607,    7759
 2.3807,    4711
 2.4007,    2893
 2.4207,    2341
 2.4407,    2282
 2.4607,    2272
 2.4807,    2139
 2.5007,    1951
 2.5207,    1688
 2.5407,    1518
 2.5607,    1627
 2.5807,    2151
 2.6007,    3168
 2.6207,    4998
 2.6407,    7580
 2.6607,   10860
 2.6807,   13098
 2.7007,   13376
 2.7207,   11835
 2.7407,    8999
 2.7607,    6755
 2.7807,    5763
 2.8007,    5866
 2.8207,    6537
 2.8407,    6637
 2.8607,    6194
 2.8807,    5165
 2.9007,    4479
 2.9207,    3868
 2.9407,    3562
 2.9607,    3532
 2.9807,    3129
 3.0007,    2678
 3.0207,    2054
 3.0407,    1624
 3.0607,    1284
 3.0807,    1094
 3.1007,    1061
 3.1207,    1065
 3.1407,    1163
 3.1607,    1313
 3.1807,    1915
 3.2007,    3378
 3.2207,    6662
 3.2407,   13031
 3.2607,   22252
 3.2807,   32726
 3.3007,   40409
 3.3207,   41609
 3.3407,   36142
 3.3607,   26235
 3.3807,   16217
 3.4007,    8578
 3.4207,    4031
 3.4407,    2013
 3.4607,    1291
 3.4807,    1339
 3.5007,    1856
 3.5207,    2744
 3.5407,    4046
 3.5606,    5407
 3.5806,    6652
 3.6006,    7355
 3.6206,    7575
 3.6406,    8100
 3.6606,    8344
 3.6806,    8666
 3.7006,    8039
 3.7206,    6783
 3.7406,    4999
 3.7606,    3226
 3.7806,    2028
 3.8006,    1222
 3.8206,     851
 3.8406,     707
 3.8606,     676
 3.8806,     717
 3.9006,     764
 3.9206,     917
 3.9406,    1121
 3.9606,    1303
 3.9806,    1509
 4.0006,    1652
 4.0206,    1761
 4.0406,    1645
 4.0606,    1425
 4.0806,    1174
 4.1006,     983
 4.1206,     847
 4.1406,     774
 4.1606,     751
 4.1806,     767
 4.2006,     769
 4.2206,     743
 4.2406,     735
 4.2606,     740
 4.2806,     808
 4.3006,     783
 4.3206,     857
 4.3406,     869
 4.3606,     819
 4.3806,     914
 4.4006,     895
 4.4206,     934
 4.4406,     930
 4.4606,     994
 4.4806,     979
 4.5006,    1028
 4.5206,    1009
 4.5406,     968
 4.5606,     981
 4.5806,     942
 4.6006,     960
 4.6206,     965
 4.6406,     907
 4.6606,     903
 4.6806,     973
 4.7006,     900
 4.7206,     982
 4.7406,     987
 4.7606,     965
 4.7806,     961
 4.8006,     986
 4.8206,    1030
 4.8406,     990
 4.8606,    1026
 4.8806,    1051
 4.9006,     989
 4.9206,    1069
 4.9406,     997
 4.9606,    1054
 4.9806,    1038
 5.0006,    1076
 5.0206,    1110
 5.0406,    1093
 5.0606,    1116
 5.0806,    1102
 5.1006,    1061
 5.1206,    1109
 5.1406,    1155
 5.1606,    1133
 5.1806,    1175
 5.2006,    1167
 5.2206,    1100
 5.2406,    1199
 5.2606,    1198
 5.2806,    1203
 5.3006,    1237
 5.3206,    1230
 5.3406,    1299
 5.3606,    1233
 5.3806,    1246
 5.4006,    1313
 5.4206,    1194
 5.4406,    1305
 5.4606,    1288
 5.4806,    1298
 5.5006,    1259
 5.5206,    1247
 5.5406,    1287
 5.5606,    1435
 5.5806,    1460
 5.6006,    1455
 5.6206,    1484
 5.6406,    1445
 5.6606,    1473
 5.6806,    1513
 5.7006,    1429
 5.7206,    1529
 5.7406,    1557
 5.7606,    1677
 5.7806,    1808
 5.8006,    2084
 5.8206,    2597
 5.8406,    3017
 5.8606,    3547
 5.8806,    3755
 5.9006,    4000
 5.9206,    3859
 5.9406,    3424
 5.9606,    2928
 5.9806,    2536
 6.0006,    2153
 6.0206,    1880
 6.0406,    1855
 6.0606,    1790
 6.0806,    1652
 6.1006,    1717
 6.1206,    1793
 6.1406,    1768
 6.1606,    1766
 6.1806,    1812
 6.2006,    1924
 6.2206,    1999
 6.2406,    2147
 6.2606,    2332
 6.2806,    2548
 6.3006,    3035
 6.3206,    3636
 6.3406,    4420
 6.3606,    5285
 6.3806,    5712
 6.4006,    6028
 6.4206,    6012
 6.4406,    5455
 6.4606,    4662
 6.4806,    3941
 6.5006,    3186
 6.5206,    2727
 6.5406,    2380
 6.5606,    2262
 6.5806,    1981
 6.6006,    1986
 6.6206,    2018
 6.6406,    1989
 6.6606,    1969
 6.6806,    2038
 6.7006,    2008
 6.7206,    2019
 6.7406,    1980
 6.7606,    2010
 6.7806,    1986
 6.8006,    2082
 6.8206,    2157
 6.8406,    2071
 6.8606,    2172
 6.8806,    2160
 6.9006,    2141
 6.9206,    2261
 6.9406,    2365
 6.9606,    2440
 6.9806,    2401
 7.0006,    2531
 7.0206,    2535
 7.0406,    2651
 7.0606,    2561
 7.0806,    2591
 7.1006,    2575
 7.1206,    2365
 7.1406,    2326
 7.1606,    2368
 7.1806,    2341
 7.2006,    2378
 7.2206,    2360
 7.2406,    2549
 7.2606,    2503
 7.2806,    2645
 7.3006,    2655
 7.3206,    2893
 7.3406,    2852
 7.3606,    2956
 7.3806,    3053
 7.4006,    3250
 7.4206,    3370
 7.4406,    3487
 7.4606,    3450
 7.4806,    3530
 7.5006,    3352
 7.5206,    3108
 7.5406,    2878
 7.5606,    2612
 7.5806,    2336
 7.6006,    2278
 7.6206,    2061
 7.6405,    2037
 7.6605,    2041
 7.6805,    1983
 7.7005,    2031
 7.7205,    1945
 7.7405,    2019
 7.7605,    2037
 7.7805,    2079
 7.8005,    2111
 7.8205,    2195
 7.8405,    2267
 7.8605,    2145
 7.8805,    2209
 7.9005,    2272
 7.9205,    2269
 7.9405,    2411
 7.9605,    2453
 7.9805,    2561
 8.0005,    2619
 8.0205,    2791
 8.0405,    2821
 8.0605,    2762
 8.0805,    2707
 8.1005,    2586
 8.1205,    2585
 8.1405,    2411
 8.1605,    2331
 8.1805,    2290
 8.2005,    2261
 8.2205,    2397
 8.2405,    2349
 8.2605,    2382
 8.2805,    2220
 8.3005,    2297
 8.3205,    2247
 8.3405,    2109
 8.3605,    2147
 8.3805,    2180
 8.4005,    2188
 8.4205,    2104
 8.4405,    2183
 8.4605,    2235
 8.4805,    2307
 8.5005,    2494
 8.5205,    2676
 8.5405,    2922
 8.5605,    3194
 8.5805,    3686
 8.6005,    3877
 8.6205,    4025
 8.6405,    4159
 8.6605,    4025
 8.6805,    3773
 8.7005,    3446
 8.7205,    3107
 8.7405,    2821
 8.7605,    2597
 8.7805,    2435
 8.8005,    2345
 8.8205,    2341
 8.8405,    2271
 8.8605,    2269
 8.8805,    2251
 8.9005,    2287
 8.9205,    2272
 8.9405,    2308
 8.9605,    2343
 8.9805,    2309
 9.0005,    2211
 9.0205,    2257
 9.0405,    2382
 9.0605,    2339
 9.0805,    2369
 9.1005,    2197
 9.1205,    2258
 9.1405,    2298
 9.1605,    2385
 9.1805,    2292
 9.2005,    2318
 9.2205,    2368
 9.2405,    2334
 9.2605,    2335
 9.2805,    2273
 9.3005,    2288
 9.3205,    2384
 9.3405,    2395
 9.3605,    2439
 9.3805,    2259
 9.4005,    2333
 9.4205,    2369
 9.4405,    2414
 9.4605,    2459
 9.4805,    2499
 9.5005,    2514
 9.5205,    2541
 9.5405,    2618
 9.5605,    2665
 9.5805,    2660
 9.6005,    2703
 9.6205,    2587
 9.6405,    2518
 9.6605,    2462
 9.6805,    2465
 9.7005,    2434
 9.7205,    2432
 9.7405,    2474
 9.7605,    2495
 9.7805,    2374
 9.8005,    2509
 9.8205,    2448
 9.8405,    2375
 9.8605,    2334
 9.8805,    2361
 9.9005,    2454
 9.9205,    2393
 9.9405,    2507
 9.9605,    2367
 9.9805,    2451
10.0005,    2433
10.0205,    2495
10.0405,    2458
10.0605,    2459
10.0805,    2471
10.1005,    2501
10.1205,    2422
10.1405,    2367
10.1605,    2482
10.1805,    2391
10.2005,    2478
10.2205,    2533
10.2405,    2389
10.2605,    2470
10.2805,    2360
10.3005,    2406
10.3205,    2461
10.3405,    2484
10.3605,    2468
10.3805,    2526
10.4005,    2418
10.4205,    2443
10.4405,    2435
10.4605,    2355
10.4805,    2449
10.5005,    2423
10.5205,    2441
10.5405,    2382
10.5605,    2469
10.5805,    2463
10.6005,    2454
10.6205,    2531
10.6405,    2337
10.6605,    2399
10.6805,    2406
10.7005,    2506
10.7205,    2413
10.7405,    2431
10.7605,    2486
10.7805,    2501
10.8005,    2432
10.8205,    2405
10.8405,    2508
10.8605,    2449
10.8805,    2535
10.9005,    2445
10.9205,    2410
10.9405,    2367
10.9605,    2370
10.9805,    2474
11.0005,    2380
11.0205,    2433
11.0405,    2344
11.0605,    2437
11.0805,    2434
11.1005,    2376
11.1205,    2314
11.1405,    2390
11.1605,    2428
11.1805,    2328
11.2005,    2361
11.2205,    2439
11.2405,    2434
11.2605,    2414
11.2805,    2324
11.3005,    2425
11.3205,    2420
11.3405,    2431
11.3605,    2453
11.3805,    2408
11.4005,    2404
11.4205,    2352
11.4405,    2374
11.4605,    2438
11.4805,    2335
11.5005,    2321
11.5205,    2429
11.5405,    2299
11.5605,    2414
11.5805,    2409
11.6005,    2271
11.6205,    2367
11.6405,    2287
11.6605,    2390
11.6805,    2246
11.7005,    2322
11.7204,    2275
11.7404,    2314
11.7604,    2233
11.7804,    2389
11.8004,    2337
11.8204,    2346
11.8404,    2267
11.8604,    2366
11.8804,    2384
11.9004,    2258
11.9204,    2274
11.9404,    2347
11.9604,    2331
11.9804,    2272
12.0004,    2187
12.0204,    2324
12.0404,    2268
12.0604,    2267
12.0804,    2241
12.1004,    2255
12.1204,    2245
12.1404,    2295
12.1604,    2248
12.1804,    2193
12.2004,    2165
12.2204,    2227
12.2404,    2222
12.2604,    2175
12.2804,    2281
12.3004,    2077
12.3204,    2259
12.3404,    2168
12.3604,    2253
12.3804,    2145
12.4004,    2277
12.4204,    2139
12.4404,    2170
12.4604,    2167
12.4804,    2181
12.5004,    2228
12.5204,    2177
12.5404,    2093
12.5604,    2075
12.5804,    2232
12.6004,    2151
12.6204,    2107
12.6404,    2196
12.6604,    2152
12.6804,    2084
12.7004,    2106
12.7204,    2131
12.7404,    2114
12.7604,    2099
12.7804,    2101
12.8004,    2092
12.8204,    2009
12.8404,    2077
12.8604,    2103
12.8804,    2065
12.9004,    2147
12.9204,    2038
12.9404,    1981
12.9604,    1929
12.9804,    2090
13.0004,    2039
13.0204,    2081
13.0404,    1974
13.0604,    1974
13.0804,    2027
13.1004,    1993
13.1204,    1966
13.1404,    1997
13.1604,    1921
13.1804,    2027
13.2004,    2120
13.2204,    2069
13.2404,    1959
13.2604,    1901
13.2804,    1944
13.3004,    1966
13.3204,    1997
13.3404,    2069
13.3604,    2000
13.3804,    1989
13.4004,    1956
13.4204,    1869
13.4404,    2009
13.4604,    1969
13.4804,    1921
13.5004,    1927
13.5204,    1946
13.5404,    1920
13.5604,    1845
13.5804,    1894
13.6004,    1849
13.6204,    1857
13.6404,    1872
13.6604,    1848
13.6804,    1873
13.7004,    1792
13.7204,    1874
13.7404,    1836
13.7604,    1863
13.7804,    1801
13.8004,    1791
13.8204,    1771
13.8404,    1814
13.8604,    1784
13.8804,    1877
13.9004,    1774
13.9204,    1738
13.9404,    1697
13.9604,    1808
13.9804,    1766
14.0004,    1675
14.0204,    1757
14.0404,    1763
14.0604,    1844
14.0804,    1836
14.1004,    1782
14.1204,    1835
14.1404,    1790
14.1604,    1773
14.1804,    1660
14.2004,    1690
14.2204,    1741
14.2404,    1759
14.2604,    1709
14.2804,    1760
14.3004,    1699
14.3204,    1679
14.3404,    1728
14.3604,    1667
14.3804,    1664
14.4004,    1673
14.4204,    1663
14.4404,    1615
14.4604,    1719
14.4804,    1674
14.5004,    1528
14.5204,    1592
14.5404,    1622
14.5604,    1619
14.5804,    1678
14.6004,    1617
14.6204,    1649
14.6404,    1633
14.6604,    1587
14.6804,    1588
14.7004,    1557
14.7204,    1578
14.7404,    1542
14.7604,    1607
14.7804,    1590
14.8004,    1562
14.8204,    1563
14.8404,    1526
14.8604,    1547
14.8804,    1550
14.9004,    1508
14.9204,    1511
14.9404,    1567
14.9604,    1486
14.9804,    1547
15.0004,    1479
15.0204,    1505
15.0404,    1424
15.0604,    1480
15.0804,    1421
15.1004,    1430
15.1204,    1503
15.1404,    1484
15.1604,    1458
15.1804,    1497
15.2004,    1390
15.2204,    1389
15.2404,    1412
15.2604,    1339
15.2804,    1443
15.3004,    1417
15.3204,    1358
15.3404,    1456
15.3604,    1368
15.3804,    1355
15.4004,    1347
15.4204,    1349
15.4404,    1391
15.4604,    1343
15.4804,    1340
15.5004,    1328
15.5204,    1334
15.5404,    1330
15.5604,    1330
15.5804,    1347
15.6004,    1328
15.6204,    1310
15.6404,    1307
15.6604,    1286
15.6804,    1295
15.7004,    1340
15.7204,    1274
15.7404,    1272
15.7604,    1242
15.7804,    1277
15.8003,    1271
15.8203,    1276
15.8403,    1314
15.8603,    1305
15.8803,    1235
15.9003,    1232
15.9203,    1223
15.9403,    1222
15.9603,    1251
15.9803,    1250
16.0003,    1243
16.0203,    1216
16.0403,    1205
16.0603,    1225
16.0803,    1179
16.1003,    1104
16.1203,    1171
16.1403,    1161
16.1603,    1191
16.1803,    1139
16.2003,    1213
16.2203,    1142
16.2403,    1131
16.2603,    1109
16.2803,    1114
16.3003,    1211
16.3203,    1147
16.3403,    1165
16.3603,    1140
16.3803,    1117
16.4003,    1119
16.4203,    1069
16.4403,    1092
16.4603,    1108
16.4803,    1067
16.5003,    1093
16.5203,    1100
16.5403,    1024
16.5603,    1057
16.5803,    1073
16.6003,    1056
16.6203,    1101
16.6403,    1033
16.6603,    1026
16.6803,    1094
16.7003,     966
16.7203,     993
16.7403,     986
16.7603,     964
16.7803,    1071
16.8003,     978
16.8203,     976
16.8403,    1045
16.8603,     962
16.8803,    1049
16.9003,    1032
16.9203,     971
16.9403,     927
16.9603,     998
16.9803,     962
17.0003,     975
17.0203,     937
17.0403,     959
17.0603,     900
17.0803,     882
17.1003,    1006
17.1203,     846
17.1403,     887
17.1603,     906
17.1803,     906
17.2003,     892
17.2203,     941
17.2403,     893
17.2603,     828
17.2803,     924
17.3003,     921
17.3203,     865
17.3403,     903
17.3603,     894
17.3803,     923
17.4003,     806
17.4203,     876
17.4403,     895
17.4603,     902
17.4803,     869
17.5003,     823
17.5203,     855
17.5403,     828
17.5603,     866
17.5803,     826
17.6003,     846
17.6203,     811
17.6403,     828
17.6603,     810
17.6803,     898
17.7003,     813
17.7203,     806
17.7403,     821
17.7603,     791
17.7803,     769
17.8003,     797
17.8203,     780
17.8403,     807
17.8603,     805
17.8803,     794
17.9003,     807
17.9203,     802
17.9403,     764
17.9603,     734
17.9803,     797
18.0003,     752
18.0203,     733
18.0403,     767
18.0603,     719
18.0803,     683
18.1003,     754
18.1203,     740
18.1403,     738
18.1603,     720
18.1803,     702
18.2003,     677
18.2203,     715
18.2403,     727
18.2603,     733
18.2803,     742
18.3003,     695
18.3203,     687
18.3403,     691
18.3603,     723
18.3803,     714
18.4003,     658
18.4203,     690
18.4403,     694
18.4603,     701
18.4803,     737
18.5003,     644
18.5203,     683
18.5403,     691
18.5603,     720
18.5803,     700
18.6003,     692
18.6203,     671
18.6403,     707
18.6603,     745
18.6803,     695
18.7003,     712
18.7203,     708
18.7403,     726
18.7603,     737
18.7803,     719
18.8003,     712
18.8203,     698
18.8403,     723
18.8603,     755
18.8803,     728
18.9003,     751
18.9203,     741
18.9403,     761
18.9603,     728
18.9803,     747
19.0003,     718
19.0203,     674
19.0403,     722
19.0603,     753
19.0803,     739
19.1003,     682
19.1203,     682
19.1403,     660
19.1603,     667
19.1803,     670
19.2003,     632
19.2203,     664
19.2403,     613
19.2603,     623
19.2803,     603
19.3003,     616
19.3203,     593
19.3403,     575
19.3603,     576
19.3803,     555
19.4003,     543
19.4203,     545
19.4403,     536
19.4603,     497
19.4803,     480
19.5003,     508
19.5203,     495
19.5403,     490
19.5603,     472
19.5803,     496
19.6003,     472
19.6203,     493
19.6403,     484
19.6603,     447
19.6803,     444
19.7003,     457
19.7203,     414
19.7403,     457
19.7603,     436
19.7803,     447
19.8003,     449
19.8203,     422
19.8403,     434
19.8603,     423
19.8802,     409
19.9002,     442
19.9202,     422
19.9402,     412
19.9602,     435
19.9802,     408
20.0002,     408
20.0202,     404
20.0402,     423
20.0602,     441
20.0802,     431
20.1002,     448
20.1202,     411
20.1402,     413
20.1602,     397
20.1802,     416
20.2002,     442
20.2202,     393
20.2402,     409
20.2602,     375
20.2802,     390
20.3002,     431
20.3202,     365
20.3402,     382
20.3602,     347
20.3802,     356
20.4002,     339
20.4202,     387
20.4402,     363
20.4602,     327
20.4802,     335
20.5002,     342
20.5202,     347
20.5402,     297
20.5602,     319
20.5802,     342
20.6002,     313
20.6202,     315
20.6402,     287
20.6602,     308
20.6802,     307
20.7002,     286
20.7202,     304
20.7402,     267
20.7602,     282
20.7802,     310
20.8002,     289
20.8202,     298
20.8402,     276
20.8602,     273
20.8802,     280
20.9002,     283
20.9202,     276
20.9402,     281
20.9602,     267
20.9802,     247
21.0002,     271
21.0202,     275
21.0402,     243
21.0602,     262
21.0802,     253
21.1002,     249
21.1202,     236
21.1402,     275
21.1602,     242
21.1802,     279
21.2002,     235
21.2202,     242
21.2402,     271
21.2602,     255
21.2802,     241
21.3002,     218
21.3202,     229
21.3402,     246
21.3602,     255
21.3802,     236
21.4002,     214
21.4202,     221
21.4402,     238
21.4602,     214
21.4802,     216
21.5002,     226
21.5202,     205
21.5402,     217
21.5602,     211
21.5802,     205
21.6002,     200
21.6202,     209
21.6402,     202
21.6602,     176
21.6802,     184
21.7002,     181
21.7202,     175
21.7402,     163
21.7602,     170
21.7802,     146
21.8002,     153
21.8202,     156
21.8402,     197
21.8602,     147
21.8802,     142
21.9002,     160
21.9202,     162
21.9402,     152
21.9602,     180
21.9802,     178
22.0002,     148
22.0202,     133
22.0402,     149
22.0602,     118
22.0802,     137
22.1002,     123
22.1202,     118
22.1402,     119
22.1602,     107
22.1802,     104
22.2002,     110
22.2202,     107
22.2402,     121
22.2602,      99
22.2802,      89
22.3002,     128
22.3202,      98
22.3402,      97
22.3602,     109
22.3802,     113
22.4002,      93
22.4202,      98
22.4402,      83
22.4602,      83
22.4802,      90
22.5002,      90
22.5202,      76
22.5402,      76
22.5602,      84
22.5802,      87
22.6002,      84
22.6202,      98
22.6402,      78
22.6602,      82
22.6802,      69
22.7002,      73
22.7202,      77
22.7402,      74
22.7602,      57
22.7802,      62
22.8002,      79
22.8202,      70
22.8402,      57
22.8602,      65
22.8802,      63
22.9002,      51
22.9202,      53
22.9402,      50
22.9602,      45
22.9802,      48
23.0002,      51
23.0202,      49
23.0402,      42
23.0602,      55
23.0802,      50
23.1002,      50
23.1202,      48
23.1402,      56
23.1602,      47
23.1802,      42
23.2002,      38
23.2202,      38
23.2402,      25
23.2602,      38
23.2802,      34
23.3002,      32
23.3202,      36
23.3402,      34
23.3602,      21
23.3802,      35
23.4002,      26
23.4202,      26
23.4402,      28
23.4602,      26
23.4802,      29
23.5002,      24
23.5202,      24
23.5402,      32
23.5602,      20
23.5802,      24
23.6002,      29
23.6202,      28
23.6402,      21
23.6602,      21
23.6802,      22
23.7002,      27
23.7202,      15
23.7402,      18
23.7602,      21
23.7802,      15
23.8002,      26
23.8202,      23
23.8402,      25
23.8602,      16
23.8802,      16
23.9002,      25
23.9202,      12
23.9402,       9
23.9601,       7
23.9801,      21
24.0001,      13
24.0201,      25
24.0401,      13
24.0601,      18
24.0801,      13
24.1001,      13
24.1201,      15
24.1401,      20
24.1601,      16
24.1801,      11
24.2001,       7
24.2201,      19
24.2401,      15
24.2601,      18
24.2801,      12
24.3001,       7
24.3201,      17
24.3401,      15
24.3601,       8
24.3801,      12
24.4001,      19
24.4201,      14
24.4401,      15
24.4601,      16
24.4801,      14
24.5001,      18
24.5201,      15
24.5401,      12
24.5601,      14
24.5801,       9
24.6001,      12
24.6201,      11
24.6401,      13
24.6601,      17
24.6801,      12
24.7001,       8
24.7201,      12
24.7401,       8
24.7601,      20
24.7801,      15
24.8001,       9
24.8201,      11
24.8401,      15
24.8601,       8
24.8801,      11
24.9001,      10
24.9201,      15
24.9401,       8
24.9601,       9
24.9801,      12
25.0001,       6
25.0201,       8
25.0401,       8
25.0601,      16
25.0801,      14
25.1001,       8
25.1201,       8
25.1401,      13
25.1601,      13
25.1801,       6
25.2001,      11
25.2201,       9
25.2401,       7
25.2601,      12
25.2801,      11
25.3001,       8
25.3201,      12
25.3401,      11
25.3601,      12
25.3801,       9
25.4001,       9
25.4201,      15
25.4401,       8
25.4601,      14
25.4801,      10
25.5001,       4
25.5201,       4
25.5401,       5
25.5601,       7
25.5801,      14
25.6001,      11
25.6201,       7
25.6401,      11
25.6601,       9
25.6801,      12
25.7001,      10
25.7201,      10
25.7401,       9
25.7601,       7
25.7801,      12
25.8001,       5
25.8201,       5
25.8401,      11
25.8601,      13
25.8801,      11
25.9001,      10
25.9201,      10
25.9401,      10
25.9601,      10
25.9801,      15
26.0001,      14
26.0201,       2
26.0401,       6
26.0601,       3
26.0801,      10
26.1001,       6
26.1201,       9
26.1401,      10
26.1601,      10
26.1801,      12
26.2001,       9
26.2201,       7
26.2401,      10
26.2601,      12
26.2801,       8
26.3001,      10
26.3201,       3
26.3401,       9
26.3601,       7
26.3801,       8
26.4001,       7
26.4201,      11
26.4401,      14
26.4601,       8
26.4801,       4
26.5001,       4
26.5201,      13
26.5401,       5
26.5601,      12
26.5801,       6
26.6001,       9
26.6201,       2
26.6401,       6
26.6601,       3
26.6801,       6
26.7001,       6
26.7201,       7
26.7401,       3
26.7601,      10
26.7801,       5
26.8001,       3
26.8201,       9
26.8401,       7
26.8601,       8
26.8801,       5
26.9001,       9
26.9201,       6
26.9401,       9
26.9601,       7
26.9801,       9
27.0001,       7
27.0201,       7
27.0401,       9
27.0601,       3
27.0801,       5
27.1001,       7
27.1201,       5
27.1401,       8
27.1601,      11
27.1801,      10
27.2001,      10
27.2201,       5
27.2401,       8
27.2601,       6
27.2801,       3
27.3001,       8
27.3201,       7
27.3401,       9
27.3601,       8
27.3801,       7
27.4001,      13
27.4201,       1
27.4401,       4
27.4601,       7
27.4801,       9
27.5001,       7
27.5201,       7
27.5401,       5
27.5601,       5
27.5801,       8
27.6001,       5
27.6201,       6
27.6401,       5
27.6601,       7
27.6801,       4
27.7001,       6
27.7201,       6
27.7401,      10
27.7601,       6
27.7801,       6
27.8001,       9
27.8201,       8
27.8401,       6
27.8601,       6
27.8801,       5
27.9001,       8
27.9201,       8
27.9401,       8
27.9601,       9
27.9801,       5
28.0001,       1
28.0201,       8
28.0400,       5
28.0600,       7
28.0800,       8
28.1000,       5
28.1200,       4
28.1400,       8
28.1600,       5
28.1800,       4
28.2000,       8
28.2200,       9
28.2400,       7
28.2600,       4
28.2800,       2
28.3000,       7
28.3200,      10
28.3400,       8
28.3600,       6
28.3800,       5
28.4000,       3
28.4200,       6
28.4400,       9
28.4600,       6
28.4800,       2
28.5000,       3
28.5200,       2
28.5400,       3
28.5600,       2
28.5800,       3
28.6000,       7
28.6200,      11
28.6400,       4
28.6600,       4
28.6800,       3
28.7000,       3
28.7200,       3
28.7400,       0
28.7600,       3
28.7800,      10
28.8000,       4
28.8200,       7
28.8400,       7
28.8600,      11
28.8800,       1
28.9000,       2
28.9200,      10
28.9400,      10
28.9600,       3
28.9800,       4
29.0000,       7
29.0200,       4
29.0400,       2
29.0600,       6
29.0800,       4
29.1000,       8
29.1200,       4
29.1400,       5
29.1600,       4
29.1800,       5
29.2000,       6
29.2200,       3
29.2400,       9
29.2600,       6
29.2800,       2
29.3000,       3
29.3200,       7
29.3400,       1
29.3600,       0
29.3800,       3
29.4000,       4
29.4200,       2
29.4400,       5
29.4600,       5
29.4800,       4
29.5000,       3
29.5200,       8
29.5400,       4
29.5600,       8
29.5800,       5
29.6000,       7
29.6200,       4
29.6400,       7
29.6600,       7
29.6800,       6
29.7000,       7
29.7200,       2
29.7400,       7
29.7600,       7
29.7800,       2
29.8000,       4
29.8200,       1
29.8400,       4
29.8600,       4
29.8800,       0
29.9000,       5
29.9200,       6
29.9400,       2
29.9600,       6
29.9800,       5
30.0000,       5
30.0200,       6
30.0400,       3
30.0600,       3
30.0800,       4
30.1000,       1
30.1200,       4
30.1400,       5
30.1600,       3
30.1800,       4
30.2000,       6
30.2200,       6
30.2400,       6
30.2600,       2
30.2800,       6
30.3000,       3
30.3200,       3
30.3400,       3
30.3600,       5
30.3800,       3
30.4000,       8
30.4200,       7
30.4400,       3
30.4600,       2
30.4800,       1
30.5000,       4
30.5200,       4
30.5400,       4
30.5600,       3
30.5800,       2
30.6000,       4
30.6200,       5
30.6400,       4
30.6600,       2
30.6800,       2
30.7000,       1
30.7200,       4
30.7400,       3
30.7600,       2
30.7800,       3
30.8000,       3
30.8200,       2
30.8400,       5
30.8600,       1
30.8800,       2
30.9000,       2
30.9200,       1
30.9400,       4
30.9600,       5
30.9800,       4
31.0000,       2
31.0200,       1
31.0400,       3
31.0600,       3
31.0800,       4
31.1000,       2
31.1200,       3
31.1400,       4
31.1600,       2
31.1800,       5
31.2000,       1
31.2200,       2
31.2400,       2
31.2600,       2
31.2800,       6
31.3000,       3
31.3200,       2
31.3400,       6
31.3600,       2
31.3800,       2
31.4000,       2
31.4200,       6
31.4400,       4
31.4600,       1
31.4800,       0
31.5000,       2
31.5200,       2
31.5400,       4
31.5600,       2
31.5800,       0
31.6000,       0
31.6200,       1
31.6400,       1
31.6600,       6
31.6800,       6
31.7000,       4
31.7200,       1
31.7400,       2
31.7600,       4
31.7800,       4
31.8000,       5
31.8200,       1
31.8400,       1
31.8600,       4
31.8800,       1
31.9000,       3
31.9200,       2
31.9400,       3
31.9600,       2
31.9800,       0
32.0000,       4
32.0200,       3
32.0400,       2
32.0600,       0
32.0800,       4
32.1000,       2
32.1199,       8
32.1399,       5
32.1599,       3
32.1799,       3
32.1999,       5
32.2199,       1
32.2399,       2
32.2599,       3
32.2799,       3
32.2999,       1
32.3199,       1
32.3399,       1
32.3599,       3
32.3799,       4
32.3999,       2
32.4199,       1
32.4399,       2
32.4599,       4
32.4799,       1
32.4999,       2
32.5199,       2
32.5399,       5
32.5599,       0
32.5799,       3
32.5999,       1
32.6199,       2
32.6399,       6
32.6599,       1
32.6799,       3
32.6999,       0
32.7199,       0
32.7399,       1
32.7599,       1
32.7799,       2
32.7999,       2
32.8199,       1
32.8399,       4
32.8599,       5
32.8799,       2
32.8999,       1
32.9199,       0
32.9399,       2
32.9599,       1
32.9799,       1
32.9999,       2
33.0199,       0
33.0399,       1
33.0599,       3
33.0799,       0
33.0999,       3
33.1199,       0
33.1399,       5
33.1599,       4
33.1799,       4
33.1999,       1
33.2199,       1
33.2399,       4
33.2599,       2
33.2799,       2
33.2999,       1
33.3199,       0
33.3399,       1
33.3599,       2
33.3799,       3
33.3999,       2
33.4199,       1
33.4399,       0
33.4599,       2
33.4799,       0
33.4999,       1
33.5199,       2
33.5399,       1
33.5599,       1
33.5799,       1
33.5999,       0
33.6199,       1
33.6399,       0
33.6599,       0
33.6799,       0
33.6999,       1
33.7199,       4
33.7399,       2
33.7599,       3
33.7799,       2
33.7999,       0
33.8199,       1
33.8399,       3
33.8599,       1
33.8799,       1
33.8999,       1
33.9199,       3
33.9399,       2
33.9599,       1
33.9799,       2
33.9999,       0
34.0199,       1
34.0399,       1
34.0599,       1
34.0799,       2
34.0999,       2
34.1199,       0
34.1399,       1
34.1599,       1
34.1799,       2
34.1999,       0
34.2199,       1
34.2399,       0
34.2599,       1
34.2799,       1
34.2999,       2
34.3199,       1
34.3399,       1
34.3599,       0
34.3799,       0
34.3999,       1
34.4199,       0
34.4399,       0
34.4599,       2
34.4799,       3
34.4999,       1
34.5199,       1
34.5399,       1
34.5599,       1
34.5799,       1
34.5999,       2
34.6199,       0
34.6399,       1
34.6599,       0
34.6799,       1
34.6999,       0
34.7199,       0
34.7399,       0
34.7599,       3
34.7799,       0
34.7999,       0
34.8199,       0
34.8399,       2
34.8599,       4
34.8799,       0
34.8999,       1
34.9199,       4
34.9399,       1
34.9599,       0
34.9799,       0
34.9999,       1
35.0199,       2
35.0399,       1
35.0599,       1
35.0799,       3
35.0999,       0
35.1199,       0
35.1399,       0
35.1599,       0
35.1799,       1
35.1999,       1
35.2199,       1
35.2399,       2
35.2599,       0
35.2799,       0
35.2999,       1
35.3199,       0
35.3399,       1
35.3599,       1
35.3799,       1
35.3999,       1
35.4199,       2
35.4399,       1
35.4599,       1
35.4799,       0
35.4999,       3
35.5199,       2
35.5399,       0
35.5599,       0
35.5799,       0
35.5999,       2
35.6199,       1
35.6399,       0
35.6599,       1
35.6799,       1
35.6999,       2
35.7199,       1
35.7399,       1
35.7599,       1
35.7799,       1
35.7999,       1
35.8199,       1
35.8399,       0
35.8599,       1
35.8799,       0
35.8999,       0
35.9199,       0
35.9399,       1
35.9599,       0
35.9799,       0
35.9999,       1
36.0199,       1
36.0399,       2
36.0599,       1
36.0799,       0
36.0999,       1
36.1199,       1
36.1399,       1
36.1599,       2
36.1799,       0
36.1998,       0
36.2198,       2
36.2398,       1
36.2598,       0
36.2798,       1
36.2998,       1
36.3198,       0
36.3398,       0
36.3598,       1
36.3798,       2
36.3998,       2
36.4198,       0
36.4398,       1
36.4598,       0
36.4798,       1
36.4998,       1
36.5198,       0
36.5398,       0
36.5598,       0
36.5798,       0
36.5998,       0
36.6198,       0
36.6398,       2
36.6598,       1
36.6798,       0
36.6998,       1
36.7198,       1
36.7398,       0
36.7598,       0
36.7798,       1
36.7998,       0
36.8198,       1
36.8398,       0
36.8598,       0
36.8798,       2
36.8998,       1
36.9198,       0
36.9398,       1
36.9598,       1
36.9798,       1
36.9998,       0
37.0198,       0
37.0398,       3
37.0598,       1
37.0798,       0
37.0998,       0
37.1198,       1
37.1398,       1
37.1598,       1
37.1798,       1
37.1998,       0
37.2198,       0
37.2398,       1
37.2598,       0
37.2798,       1
37.2998,       0
37.3198,       0
37.3398,       0
37.3598,       2
37.3798,       0
37.3998,       1
37.4198,       1
37.4398,       0
37.4598,       0
37.4798,       1
37.4998,       1
37.5198,       0
37.5398,       0
37.5598,       1
37.5798,       0
37.5998,       0
37.6198,       0
37.6398,       0
37.6598,       0
37.6798,       0
37.6998,       0
37.7198,       0
37.7398,       0
37.7598,       0
37.7798,       0
37.7998,       0
37.8198,       0
37.8398,       0
37.8598,       0
37.8798,       0
37.8998,       0
37.9198,       0
37.9398,       0
37.9598,       1
37.9798,       0
37.9998,       0
38.0198,       0
38.0398,       0
38.0598,       0
38.0798,       1
38.0998,       0
38.1198,       0
38.1398,       0
38.1598,       0
38.1798,       0
38.1998,       0
38.2198,       0
38.2398,       1
38.2598,       0
38.2798,       0
38.2998,       0
38.3198,       1
38.3398,       0
38.3598,       1
38.3798,       0
38.3998,       0
38.4198,       0
38.4398,       0
38.4598,       0
38.4798,       0
38.4998,       1
38.5198,       0
38.5398,       0
38.5598,       1
38.5798,       1
38.5998,       0
38.6198,       2
38.6398,       0
38.6598,       1
38.6798,       0
38.6998,       0
38.7198,       0
38.7398,       1
38.7598,       0
38.7798,       1
38.7998,       1
38.8198,       0
38.8398,       1
38.8598,       0
38.8798,       0
38.8998,       1
38.9198,       0
38.9398,       0
38.9598,       0
38.9798,       0
38.9998,       4
39.0198,       0
39.0398,       0
39.0598,       0
39.0798,       0
39.0998,       0
39.1198,       0
39.1398,       0
39.1598,       0
39.1798,       0
39.1998,       0
39.2198,       0
39.2398,       1
39.2598,       0
39.2798,       1
39.2998,       1
39.3198,       0
39.3398,       0
39.3598,       0
39.3798,       0
39.3998,       0
39.4198,       1
39.4398,       0
39.4598,       0
39.4798,       1
39.4998,       0
39.5198,       0
39.5398,       0
39.5598,       0
39.5798,       0
39.5998,       0
39.6198,       0
39.6398,       0
39.6598,       0
39.6798,       0
39.6998,       0
39.7198,       0
39.7398,       0
39.7598,       0
39.7798,       0
39.7998,       0
39.8198,       0
39.8398,       0
39.8598,       0
39.8798,       0
39.8998,       0
39.9198,       0
39.9398,       0
39.9598,       0
39.9798,       0
39.9998,       0
40.0198,       0
40.0398,       0
40.0598,       0
40.0798,       0
40.0998,       1
40.1198,       0
40.1398,       0
40.1598,       0
40.1798,       0
40.1998,       0
40.2198,       0
40.2398,       0
40.2598,       1
40.2797,       0
40.2997,       0
40.3197,       0
40.3397,       0
40.3597,       0
40.3797,       1
40.3997,       0
40.4197,       1
40.4397,       1
40.4597,       0
40.4797,       0
40.4997,       0
40.5197,       0
40.5397,       1
40.5597,       0
40.5797,       0
40.5997,       0
40.6197,       0
40.6397,       0
40.6597,       0
40.6797,       0
40.6997,       0
40.7197,       0
40.7397,       0
40.7597,       0
40.7797,       0
40.7997,       0
40.8197,       1
40.8397,       0
40.8597,       0
40.8797,       0
40.8997,       0
40.9197,       0
40.9397,       0
