 0.0008,       0
 0.0208,       0
 0.0408,       0
 0.0608,       0
 0.0808,       0
 0.1008,       0
 0.1208,       0
 0.1409,       0
 0.1609,       0
 0.1809,       0
 0.2009,       0
 0.2209,       0
 0.2409,       0
 0.2609,       0
 0.2809,       2
 0.3010,      42
 0.3210,     248
 0.3410,    1084
 0.3610,    2942
 0.3810,    4961
 0.4010,    4795
 0.4210,    2774
 0.4410,     984
 0.4611,     198
 0.4811,      25
 0.5011,       3
 0.5211,       1
 0.5411,       1
 0.5611,       0
 0.5811,       1
 0.6011,       0
 0.6212,       3
 0.6412,       0
 0.6612,       0
 0.6812,     127
 0.7012,     164
 0.7212,     142
 0.7412,     164
 0.7612,     177
 0.7813,     166
 0.8013,     231
 0.8213,     327
 0.8413,     457
 0.8613,     623
 0.8813,     688
 0.9013,     581
 0.9213,     463
 0.9414,     440
 0.9614,     371
 0.9814,     281
 1.0014,     226
 1.0214,     259
 1.0414,     243
 1.0614,     300
 1.0814,     300
 1.1015,     248
 1.1215,     217
 1.1415,     172
 1.1615,     155
 1.1815,     204
 1.2015,     248
 1.2215,     283
 1.2415,     334
 1.2616,     325
 1.2816,     276
 1.3016,     211
 1.3216,     167
 1.3416,     142
 1.3616,     126
 1.3816,     162
 1.4016,     201
 1.4217,     304
 1.4417,     386
 1.4617,     524
 1.4817,     607
 1.5017,     671
 1.5217,     756
 1.5417,     911
 1.5617,     966
 1.5817,     875
 1.6018,     661
 1.6218,     459
 1.6418,     644
 1.6618,    1241
 1.6818,    2634
 1.7018,    4540
 1.7218,    6298
 1.7418,    6633
 1.7619,    5526
 1.7819,    3675
 1.8019,    2178
 1.8219,    1263
 1.8419,     855
 1.8619,     799
 1.8819,     866
 1.9019,    1159
 1.9220,    1892
 1.9420,    3293
 1.9620,    5136
 1.9820,    7227
 2.0020,    8515
 2.0220,    8252
 2.0420,    6477
 2.0620,    4190
 2.0821,    2377
 2.1021,    1426
 2.1221,     965
 2.1421,     900
 2.1621,     783
 2.1821,     797
 2.2021,    1195
 2.2221,    2039
 2.2422,    3744
 2.2622,    6722
 2.2822,    9546
 2.3022,   11197
 2.3222,   10603
 2.3422,    8497
 2.3622,    5908
 2.3822,    3795
 2.4023,    2627
 2.4223,    2162
 2.4423,    1951
 2.4623,    2048
 2.4823,    2213
 2.5023,    2496
 2.5223,    3690
 2.5423,    6651
 2.5624,   11953
 2.5824,   19164
 2.6024,   26583
 2.6224,   30932
 2.6424,   31269
 2.6624,   28687
 2.6824,   24759
 2.7024,   20035
 2.7225,   15669
 2.7425,   11625
 2.7625,    9062
 2.7825,    8383
 2.8025,    8915
 2.8225,    9592
 2.8425,    9332
 2.8625,    8047
 2.8826,    6365
 2.9026,    5098
 2.9226,    4215
 2.9426,    3871
 2.9626,    3611
 2.9826,    3160
 3.0026,    2737
 3.0226,    2185
 3.0427,    1718
 3.0627,    1376
 3.0827,    1186
 3.1027,    1139
 3.1227,    1196
 3.1427,    1413
 3.1627,    1620
 3.1827,    2353
 3.2028,    4422
 3.2228,    9010
 3.2428,   17739
 3.2628,   30654
 3.2828,   44715
 3.3028,   54664
 3.3228,   56867
 3.3428,   48577
 3.3629,   35706
 3.3829,   21781
 3.4029,   11296
 3.4229,    5355
 3.4429,    2602
 3.4629,    1763
 3.4829,    1825
 3.5029,    2535
 3.5229,    3953
 3.5430,    6448
 3.5630,    9635
 3.5830,   14078
 3.6030,   22299
 3.6230,   34804
 3.6430,   51544
 3.6630,   69507
 3.6830,   80633
 3.7031,   80108
 3.7231,   67862
 3.7431,   48761
 3.7631,   30111
 3.7831,   15756
 3.8031,    7409
 3.8231,    3529
 3.8431,    1749
 3.8632,    1352
 3.8832,    1566
 3.9032,    2021
 3.9232,    3252
 3.9432,    4949
 3.9632,    7529
 3.9832,   10293
 4.0032,   11913
 4.0233,   12207
 4.0433,   10732
 4.0633,    8189
 4.0833,    5633
 4.1033,    3456
 4.1233,    2057
 4.1433,    1190
 4.1633,     921
 4.1834,     724
 4.2034,     727
 4.2234,     645
 4.2434,     639
 4.2634,     660
 4.2834,     644
 4.3034,     681
 4.3234,     681
 4.3435,     654
 4.3635,     709
 4.3835,     749
 4.4035,     723
 4.4235,     839
 4.4435,     918
 4.4635,     950
 4.4835,    1029
 4.5036,    1007
 4.5236,     984
 4.5436,    1043
 4.5636,     969
 4.5836,     892
 4.6036,     844
 4.6236,     753
 4.6436,     770
 4.6637,     826
 4.6837,     799
 4.7037,     817
 4.7237,     771
 4.7437,     817
 4.7637,     797
 4.7837,     838
 4.8037,     836
 4.8238,     838
 4.8438,     864
 4.8638,     841
 4.8838,     900
 4.9038,     969
 4.9238,     907
 4.9438,     911
 4.9638,     944
 4.9839,     904
 5.0039,     883
 5.0239,     899
 5.0439,     862
 5.0639,     867
 5.0839,     875
 5.1039,     890
 5.1239,     840
 5.1440,     860
 5.1640,     889
 5.1840,     914
 5.2040,     957
 5.2240,     966
 5.2440,     922
 5.2640,     993
 5.2840,    1001
 5.3041,     978
 5.3241,    1039
 5.3441,     995
 5.3641,    1006
 5.3841,    1006
 5.4041,    1050
 5.4241,    1033
 5.4441,    1031
 5.4642,    1063
 5.4842,    1055
 5.5042,    1019
 5.5242,    1062
 5.5442,    1059
 5.5642,    1080
 5.5842,    1124
 5.6042,    1153
 5.6242,    1100
 5.6443,    1113
 5.6643,    1217
 5.6843,    1156
 5.7043,    1196
 5.7243,    1255
 5.7443,    1592
 5.7643,    1927
 5.7843,    2668
 5.8044,    4077
 5.8244,    5993
 5.8444,    8347
 5.8644,   10572
 5.8844,   12109
 5.9044,   12611
 5.9244,   11674
 5.9444,    9714
 5.9645,    7512
 5.9845,    5206
 6.0045,    3524
 6.0245,    2507
 6.0445,    1818
 6.0645,    1504
 6.0845,    1403
 6.1045,    1402
 6.1246,    1419
 6.1446,    1400
 6.1646,    1408
 6.1846,    1512
 6.2046,    1530
 6.2246,    1613
 6.2446,    1823
 6.2646,    2292
 6.2847,    2872
 6.3047,    4056
 6.3247,    5497
 6.3447,    7415
 6.3647,    9404
 6.3847,   10940
 6.4047,   11369
 6.4247,   11256
 6.4448,   10321
 6.4648,    8557
 6.4848,    6987
 6.5048,    5333
 6.5248,    4120
 6.5448,    3171
 6.5648,    2523
 6.5848,    2109
 6.6049,    1938
 6.6249,    1700
 6.6449,    1585
 6.6649,    1528
 6.6849,    1500
 6.7049,    1511
 6.7249,    1436
 6.7449,    1455
 6.7650,    1419
 6.7850,    1460
 6.8050,    1423
 6.8250,    1482
 6.8450,    1513
 6.8650,    1545
 6.8850,    1596
 6.9050,    1734
 6.9251,    1875
 6.9451,    2013
 6.9651,    2195
 6.9851,    2429
 7.0051,    2819
 7.0251,    2948
 7.0451,    2975
 7.0651,    3047
 7.0852,    2845
 7.1052,    2612
 7.1252,    2344
 7.1452,    2071
 7.1652,    1843
 7.1852,    1754
 7.2052,    1696
 7.2252,    1746
 7.2453,    1764
 7.2653,    1841
 7.2853,    1882
 7.3053,    1963
 7.3253,    1950
 7.3453,    2146
 7.3653,    2210
 7.3853,    2329
 7.4054,    2548
 7.4254,    2531
 7.4454,    2624
 7.4654,    2569
 7.4854,    2514
 7.5054,    2393
 7.5254,    2227
 7.5454,    1915
 7.5655,    1758
 7.5855,    1572
 7.6055,    1541
 7.6255,    1413
 7.6455,    1477
 7.6655,    1393
 7.6855,    1469
 7.7055,    1415
 7.7255,    1467
 7.7456,    1472
 7.7656,    1439
 7.7856,    1413
 7.8056,    1424
 7.8256,    1454
 7.8456,    1396
 7.8656,    1425
 7.8856,    1452
 7.9057,    1447
 7.9257,    1483
 7.9457,    1444
 7.9657,    1475
 7.9857,    1548
 8.0057,    1541
 8.0257,    1530
 8.0457,    1593
 8.0658,    1560
 8.0858,    1566
 8.1058,    1471
 8.1258,    1465
 8.1458,    1469
 8.1658,    1528
 8.1858,    1513
 8.2058,    1518
 8.2259,    1524
 8.2459,    1554
 8.2659,    1588
 8.2859,    1567
 8.3059,    1484
 8.3259,    1437
 8.3459,    1372
 8.3659,    1412
 8.3860,    1338
 8.4060,    1439
 8.4260,    1414
 8.4460,    1421
 8.4660,    1465
 8.4860,    1381
 8.5060,    1480
 8.5260,    1483
 8.5461,    1502
 8.5661,    1559
 8.5861,    1499
 8.6061,    1645
 8.6261,    1646
 8.6461,    1660
 8.6661,    1695
 8.6861,    1623
 8.7062,    1502
 8.7262,    1492
 8.7462,    1500
 8.7662,    1454
 8.7862,    1518
 8.8062,    1410
 8.8262,    1515
 8.8462,    1408
 8.8663,    1436
 8.8863,    1483
 8.9063,    1442
 8.9263,    1452
 8.9463,    1582
 8.9663,    1466
 8.9863,    1489
 9.0063,    1466
 9.0264,    1476
 9.0464,    1427
 9.0664,    1502
 9.0864,    1479
 9.1064,    1563
 9.1264,    1499
 9.1464,    1449
 9.1664,    1483
 9.1865,    1495
 9.2065,    1529
 9.2265,    1518
 9.2465,    1540
 9.2665,    1512
 9.2865,    1469
 9.3065,    1510
 9.3265,    1431
 9.3466,    1564
 9.3666,    1535
 9.3866,    1474
 9.4066,    1504
 9.4266,    1510
 9.4466,    1470
 9.4666,    1462
 9.4866,    1510
 9.5067,    1502
 9.5267,    1579
 9.5467,    1514
 9.5667,    1606
 9.5867,    1644
 9.6067,    1581
 9.6267,    1537
 9.6467,    1548
 9.6667,    1557
 9.6868,    1550
 9.7068,    1597
 9.7268,    1520
 9.7468,    1554
 9.7668,    1590
 9.7868,    1494
 9.8068,    1575
 9.8268,    1584
 9.8469,    1559
 9.8669,    1490
 9.8869,    1533
 9.9069,    1496
 9.9269,    1551
 9.9469,    1515
 9.9669,    1481
 9.9869,    1511
10.0070,    1527
10.0270,    1555
10.0470,    1605
10.0670,    1530
10.0870,    1544
10.1070,    1556
10.1270,    1538
10.1470,    1513
10.1671,    1546
10.1871,    1524
10.2071,    1514
10.2271,    1564
10.2471,    1601
10.2671,    1453
10.2871,    1580
10.3071,    1569
10.3272,    1538
10.3472,    1526
10.3672,    1486
10.3872,    1434
10.4072,    1496
10.4272,    1471
10.4472,    1486
10.4672,    1557
10.4873,    1539
10.5073,    1539
10.5273,    1501
10.5473,    1504
10.5673,    1478
10.5873,    1560
10.6073,    1462
10.6273,    1475
10.6474,    1484
10.6674,    1586
10.6874,    1446
10.7074,    1465
10.7274,    1493
10.7474,    1460
10.7674,    1551
10.7874,    1531
10.8075,    1533
10.8275,    1462
10.8475,    1466
10.8675,    1431
10.8875,    1421
10.9075,    1432
10.9275,    1508
10.9475,    1507
10.9676,    1495
10.9876,    1444
11.0076,    1397
11.0276,    1502
11.0476,    1525
11.0676,    1502
11.0876,    1452
11.1076,    1443
11.1277,    1396
11.1477,    1481
11.1677,    1384
11.1877,    1460
11.2077,    1369
11.2277,    1409
11.2477,    1516
11.2677,    1418
11.2878,    1410
11.3078,    1455
11.3278,    1381
11.3478,    1400
11.3678,    1391
11.3878,    1414
11.4078,    1460
11.4278,    1400
11.4479,    1463
11.4679,    1462
11.4879,    1464
11.5079,    1417
11.5279,    1353
11.5479,    1366
11.5679,    1366
11.5879,    1327
11.6080,    1385
11.6280,    1373
11.6480,    1380
11.6680,    1452
11.6880,    1441
11.7080,    1377
11.7280,    1377
11.7480,    1432
11.7680,    1430
11.7881,    1373
11.8081,    1407
11.8281,    1430
11.8481,    1519
11.8681,    1540
11.8881,    1465
11.9081,    1551
11.9281,    1533
11.9482,    1511
11.9682,    1467
11.9882,    1434
12.0082,    1446
12.0282,    1293
12.0482,    1385
12.0682,    1380
12.0882,    1382
12.1083,    1263
12.1283,    1336
12.1483,    1312
12.1683,    1289
12.1883,    1323
12.2083,    1333
12.2283,    1220
12.2483,    1268
12.2684,    1275
12.2884,    1290
12.3084,    1296
12.3284,    1288
12.3484,    1266
12.3684,    1230
12.3884,    1272
12.4084,    1257
12.4285,    1234
12.4485,    1281
12.4685,    1245
12.4885,    1249
12.5085,    1234
12.5285,    1216
12.5485,    1271
12.5685,    1226
12.5886,    1182
12.6086,    1245
12.6286,    1235
12.6486,    1241
12.6686,    1274
12.6886,    1185
12.7086,    1202
12.7286,    1270
12.7487,    1283
12.7687,    1187
12.7887,    1203
12.8087,    1191
12.8287,    1247
12.8487,    1135
12.8687,    1236
12.8887,    1126
12.9088,    1160
12.9288,    1198
12.9488,    1117
12.9688,    1202
12.9888,    1154
13.0088,    1153
13.0288,    1139
13.0488,    1157
13.0689,    1132
13.0889,    1094
13.1089,    1134
13.1289,    1135
13.1489,    1123
13.1689,    1114
13.1889,    1127
13.2089,    1090
13.2290,    1221
13.2490,    1188
13.2690,    1150
13.2890,    1154
13.3090,    1145
13.3290,    1150
13.3490,    1141
13.3690,    1135
13.3891,    1124
13.4091,    1160
13.4291,    1112
13.4491,    1115
13.4691,    1104
13.4891,    1116
13.5091,    1082
13.5291,    1101
13.5492,    1112
13.5692,    1094
13.5892,    1092
13.6092,    1077
13.6292,    1022
13.6492,    1036
13.6692,    1067
13.6892,    1065
13.7092,    1070
13.7293,    1036
13.7493,    1073
13.7693,     992
13.7893,    1060
13.8093,    1068
13.8293,    1029
13.8493,     992
13.8693,    1073
13.8894,    1028
13.9094,    1002
13.9294,    1029
13.9494,    1014
13.9694,    1048
13.9894,    1087
14.0094,    1071
14.0294,    1205
14.0495,    1248
14.0695,    1192
14.0895,    1353
14.1095,    1490
14.1295,    1351
14.1495,    1423
14.1695,    1355
14.1895,    1433
14.2096,    1332
14.2296,    1285
14.2496,    1209
14.2696,    1107
14.2896,    1115
14.3096,    1091
14.3296,    1005
14.3496,     980
14.3697,     916
14.3897,     942
14.4097,     896
14.4297,     910
14.4497,     905
14.4697,     838
14.4897,     926
14.5097,     856
14.5298,     916
14.5498,     866
14.5698,     867
14.5898,     875
14.6098,     910
14.6298,     871
14.6498,     903
14.6698,     879
14.6899,     885
14.7099,     870
14.7299,     849
14.7499,     827
14.7699,     858
14.7899,     916
14.8099,     829
14.8299,     830
14.8500,     827
14.8700,     865
14.8900,     778
14.9100,     817
14.9300,     847
14.9500,     868
14.9700,     863
14.9900,     777
15.0101,     810
15.0301,     826
15.0501,     812
15.0701,     779
15.0901,     836
15.1101,     777
15.1301,     798
15.1501,     799
15.1702,     777
15.1902,     814
15.2102,     774
15.2302,     757
15.2502,     788
15.2702,     711
15.2902,     792
15.3102,     799
15.3303,     803
15.3503,     785
15.3703,     742
15.3903,     747
15.4103,     802
15.4303,     761
15.4503,     758
15.4703,     773
15.4904,     728
15.5104,     766
15.5304,     740
15.5504,     729
15.5704,     698
15.5904,     738
15.6104,     724
15.6304,     726
15.6505,     767
15.6705,     765
15.6905,     734
15.7105,     750
15.7305,     771
15.7505,     763
15.7705,     786
15.7905,     737
15.8105,     729
15.8306,     762
15.8506,     726
15.8706,     812
15.8906,     679
15.9106,     700
15.9306,     690
15.9506,     723
15.9706,     670
15.9907,     686
16.0107,     673
16.0307,     657
16.0507,     671
16.0707,     672
16.0907,     646
16.1107,     691
16.1307,     698
16.1508,     614
16.1708,     671
16.1908,     653
16.2108,     654
16.2308,     594
16.2508,     579
16.2708,     651
16.2908,     662
16.3109,     667
16.3309,     618
16.3509,     598
16.3709,     575
16.3909,     589
16.4109,     612
16.4309,     584
16.4509,     578
16.4710,     590
16.4910,     601
16.5110,     546
16.5310,     608
16.5510,     585
16.5710,     613
16.5910,     582
16.6110,     539
16.6311,     557
16.6511,     563
16.6711,     547
16.6911,     562
16.7111,     597
16.7311,     529
16.7511,     555
16.7711,     583
16.7912,     539
16.8112,     533
16.8312,     548
16.8512,     553
16.8712,     557
16.8912,     539
16.9112,     541
16.9312,     528
16.9513,     561
16.9713,     519
16.9913,     568
17.0113,     544
17.0313,     537
17.0513,     502
17.0713,     521
17.0913,     525
17.1114,     525
17.1314,     519
17.1514,     484
17.1714,     472
17.1914,     454
17.2114,     502
17.2314,     493
17.2514,     450
17.2715,     493
17.2915,     504
17.3115,     512
17.3315,     512
17.3515,     456
17.3715,     461
17.3915,     518
17.4115,     442
17.4316,     469
17.4516,     441
17.4716,     433
17.4916,     450
17.5116,     463
17.5316,     432
17.5516,     468
17.5716,     465
17.5917,     426
17.6117,     437
17.6317,     436
17.6517,     439
17.6717,     448
17.6917,     431
17.7117,     443
17.7317,     420
17.7517,     400
17.7718,     452
17.7918,     430
17.8118,     401
17.8318,     418
17.8518,     446
17.8718,     422
17.8918,     423
17.9118,     427
17.9319,     408
17.9519,     386
17.9719,     429
17.9919,     379
18.0119,     419
18.0319,     366
18.0519,     392
18.0719,     410
18.0920,     387
18.1120,     427
18.1320,     391
18.1520,     421
18.1720,     392
18.1920,     419
18.2120,     410
18.2320,     381
18.2521,     380
18.2721,     356
18.2921,     366
18.3121,     390
18.3321,     355
18.3521,     336
18.3721,     386
18.3921,     377
18.4122,     374
18.4322,     375
18.4522,     363
18.4722,     362
18.4922,     349
18.5122,     356
18.5322,     357
18.5522,     344
18.5723,     370
18.5923,     385
18.6123,     355
18.6323,     391
18.6523,     383
18.6723,     376
18.6923,     350
18.7123,     391
18.7324,     388
18.7524,     371
18.7724,     378
18.7924,     378
18.8124,     378
18.8324,     365
18.8524,     382
18.8724,     361
18.8925,     349
18.9125,     399
18.9325,     368
18.9525,     371
18.9725,     360
18.9925,     401
19.0125,     345
19.0325,     406
19.0526,     354
19.0726,     371
19.0926,     381
19.1126,     365
19.1326,     375
19.1526,     324
19.1726,     320
19.1926,     351
19.2127,     334
19.2327,     331
19.2527,     330
19.2727,     306
19.2927,     332
19.3127,     305
19.3327,     315
19.3527,     306
19.3728,     293
19.3928,     322
19.4128,     255
19.4328,     287
19.4528,     288
19.4728,     250
19.4928,     275
19.5128,     284
19.5329,     274
19.5529,     275
19.5729,     262
19.5929,     236
19.6129,     245
19.6329,     275
19.6529,     230
19.6729,     256
19.6930,     255
19.7130,     246
19.7330,     226
19.7530,     269
19.7730,     243
19.7930,     231
19.8130,     216
19.8330,     242
19.8530,     224
19.8731,     201
19.8931,     208
19.9131,     206
19.9331,     222
19.9531,     235
19.9731,     220
19.9931,     228
20.0131,     233
20.0332,     223
20.0532,     228
20.0732,     236
20.0932,     226
20.1132,     237
20.1332,     250
20.1532,     221
20.1732,     232
20.1933,     212
20.2133,     247
20.2333,     210
20.2533,     213
20.2733,     204
20.2933,     203
20.3133,     192
20.3333,     194
20.3534,     220
20.3734,     187
20.3934,     203
20.4134,     172
20.4334,     187
20.4534,     161
20.4734,     172
20.4934,     180
20.5135,     158
20.5335,     159
20.5535,     174
20.5735,     161
20.5935,     161
20.6135,     148
20.6335,     181
20.6535,     147
20.6736,     181
20.6936,     147
20.7136,     152
20.7336,     158
20.7536,     155
20.7736,     146
20.7936,     154
20.8136,     153
20.8337,     138
20.8537,     173
20.8737,     138
20.8937,     131
20.9137,     155
20.9337,     142
20.9537,     159
20.9737,     151
20.9938,     141
21.0138,     144
21.0338,     136
21.0538,     143
21.0738,     150
21.0938,     133
21.1138,     130
21.1338,     131
21.1539,     147
21.1739,     129
21.1939,     135
21.2139,     131
21.2339,     141
21.2539,     107
21.2739,     126
21.2939,     116
21.3140,     101
21.3340,     149
21.3540,     125
21.3740,     122
21.3940,     112
21.4140,     121
21.4340,     123
21.4540,     114
21.4741,     108
21.4941,     122
21.5141,     114
21.5341,     102
21.5541,      83
21.5741,      99
21.5941,      84
21.6141,     113
21.6342,     106
21.6542,      88
21.6742,      79
21.6942,      98
21.7142,     105
21.7342,      83
21.7542,      89
21.7742,      93
21.7942,     100
21.8143,      92
21.8343,      92
21.8543,      84
21.8743,      71
21.8943,      82
21.9143,      67
21.9343,      90
21.9543,      72
21.9744,      69
21.9944,      91
22.0144,      75
22.0344,      74
22.0544,      73
22.0744,      71
22.0944,      68
22.1144,      75
22.1345,      86
22.1545,      88
22.1745,      69
22.1945,      67
22.2145,      64
22.2345,      62
22.2545,      65
22.2745,      63
22.2946,      67
22.3146,      59
22.3346,      54
22.3546,      55
22.3746,      51
22.3946,      52
22.4146,      56
22.4346,      56
22.4547,      42
22.4747,      50
22.4947,      41
22.5147,      42
22.5347,      55
22.5547,      49
22.5747,      50
22.5947,      46
22.6148,      41
22.6348,      36
22.6548,      43
22.6748,      40
22.6948,      44
22.7148,      44
22.7348,      45
22.7548,      51
22.7749,      35
22.7949,      37
22.8149,      32
22.8349,      36
22.8549,      34
22.8749,      34
22.8949,      38
22.9149,      19
22.9350,      29
22.9550,      28
22.9750,      24
22.9950,      27
23.0150,      34
23.0350,      33
23.0550,      24
23.0750,      20
23.0951,      29
23.1151,      14
23.1351,      17
23.1551,      23
23.1751,      23
23.1951,      26
23.2151,      16
23.2351,      23
23.2552,      13
23.2752,      17
23.2952,      20
23.3152,      17
23.3352,      14
23.3552,      24
23.3752,      18
23.3952,      13
23.4153,      10
23.4353,      14
23.4553,      20
23.4753,      12
23.4953,      14
23.5153,      13
23.5353,      12
23.5553,      20
23.5754,      18
23.5954,      11
23.6154,      12
23.6354,      16
23.6554,      15
23.6754,      15
23.6954,      13
23.7154,       7
23.7355,      10
23.7555,       9
23.7755,       8
23.7955,       7
23.8155,      10
23.8355,      17
23.8555,      10
23.8755,      16
23.8955,      14
23.9156,      10
23.9356,       9
23.9556,      12
23.9756,      14
23.9956,      18
24.0156,       8
24.0356,      13
24.0556,       4
24.0757,      11
24.0957,      11
24.1157,      13
24.1357,      11
24.1557,      14
24.1757,      12
24.1957,      12
24.2157,       5
24.2358,      10
24.2558,      10
24.2758,       9
24.2958,       7
24.3158,      11
24.3358,       9
24.3558,       4
24.3758,       8
24.3959,       4
24.4159,       9
24.4359,      11
24.4559,      10
24.4759,       6
24.4959,       4
24.5159,       5
24.5359,       6
24.5560,       9
24.5760,       6
24.5960,       6
24.6160,       7
24.6360,       8
24.6560,       5
24.6760,       3
24.6960,       5
24.7161,       6
24.7361,       7
24.7561,       8
24.7761,       4
24.7961,       5
24.8161,       9
24.8361,       7
24.8561,       3
24.8762,       8
24.8962,       5
24.9162,       8
24.9362,       5
24.9562,       6
24.9762,       4
24.9962,       5
25.0162,       2
25.0363,       3
25.0563,       7
25.0763,       3
25.0963,      11
25.1163,       2
25.1363,       8
25.1563,       7
25.1763,       3
25.1964,       4
25.2164,       4
25.2364,       3
25.2564,       8
25.2764,       3
25.2964,       5
25.3164,       5
25.3364,       2
25.3565,       7
25.3765,       2
25.3965,       6
25.4165,       4
25.4365,       3
25.4565,       7
25.4765,       4
25.4965,       0
25.5166,       6
25.5366,       7
25.5566,       6
25.5766,       3
25.5966,       3
25.6166,       5
25.6366,       4
25.6566,       3
25.6767,       3
25.6967,       2
25.7167,       7
25.7367,       3
25.7567,       1
25.7767,       4
25.7967,       6
25.8167,       6
25.8368,       6
25.8568,       3
25.8768,       7
25.8968,       3
25.9168,       0
25.9368,       3
25.9568,       2
25.9768,       3
25.9968,       4
26.0169,       3
26.0369,       0
26.0569,       2
26.0769,       4
26.0969,       1
26.1169,       3
26.1369,       2
26.1569,       7
26.1770,       3
26.1970,       5
26.2170,       3
26.2370,       4
26.2570,       1
26.2770,       1
26.2970,       4
26.3170,       1
26.3371,       3
26.3571,       5
26.3771,       5
26.3971,       1
26.4171,       7
26.4371,       1
26.4571,       4
26.4771,       1
26.4972,       4
26.5172,       4
26.5372,       3
26.5572,       2
26.5772,       2
26.5972,       1
26.6172,       5
26.6372,       2
26.6573,       3
26.6773,       1
26.6973,       2
26.7173,       4
26.7373,       2
26.7573,       7
26.7773,       4
26.7973,       1
26.8174,       4
26.8374,       3
26.8574,       6
26.8774,       5
26.8974,       3
26.9174,       7
26.9374,       3
26.9574,       2
26.9775,       2
26.9975,       4
27.0175,       3
27.0375,       3
27.0575,       5
27.0775,       4
27.0975,       2
27.1175,       7
27.1376,       1
27.1576,       2
27.1776,       4
27.1976,       1
27.2176,       2
27.2376,       1
27.2576,       2
27.2776,       2
27.2977,       0
27.3177,       3
27.3377,       3
27.3577,       3
27.3777,       1
27.3977,       3
27.4177,       4
27.4377,       0
27.4578,       3
27.4778,       6
27.4978,       3
27.5178,       1
27.5378,       2
27.5578,       2
27.5778,       5
27.5978,       0
27.6179,       1
27.6379,       1
27.6579,       5
27.6779,       2
27.6979,       0
27.7179,       1
27.7379,       1
27.7579,       2
27.7780,       0
27.7980,       5
27.8180,       4
27.8380,       1
27.8580,       2
27.8780,       3
27.8980,       3
27.9180,       5
27.9380,       3
27.9581,       0
27.9781,       1
27.9981,       0
28.0181,       2
28.0381,       2
28.0581,       2
28.0781,       1
28.0981,       1
28.1182,       2
28.1382,       3
28.1582,       2
28.1782,       3
28.1982,       1
28.2182,       2
28.2382,       0
28.2582,       4
28.2783,       2
28.2983,       3
28.3183,       0
28.3383,       1
28.3583,       2
28.3783,       2
28.3983,       2
28.4183,       2
28.4384,       2
28.4584,       3
28.4784,       2
28.4984,       0
28.5184,       2
28.5384,       1
28.5584,       2
28.5784,       3
28.5985,       2
28.6185,       3
28.6385,       2
28.6585,       0
28.6785,       1
28.6985,       2
28.7185,       1
28.7385,       3
28.7586,       2
28.7786,       2
28.7986,       1
28.8186,       0
28.8386,       4
28.8586,       2
28.8786,       2
28.8986,       1
28.9187,       4
28.9387,       2
28.9587,       1
28.9787,       3
28.9987,       0
29.0187,       2
29.0387,       1
29.0587,       1
29.0788,       4
29.0988,       1
29.1188,       1
29.1388,       1
29.1588,       4
29.1788,       4
29.1988,       3
29.2188,       2
29.2389,       3
29.2589,       2
29.2789,       3
29.2989,       3
29.3189,       1
29.3389,       2
29.3589,       1
29.3789,       0
29.3990,       2
29.4190,       0
29.4390,       2
29.4590,       1
29.4790,       3
29.4990,       1
29.5190,       1
29.5390,       1
29.5591,       1
29.5791,       1
29.5991,       3
29.6191,       0
29.6391,       1
29.6591,       0
29.6791,       0
29.6991,       0
29.7192,       2
29.7392,       3
29.7592,       3
29.7792,       1
29.7992,       2
29.8192,       2
29.8392,       0
29.8592,       1
29.8793,       1
29.8993,       0
29.9193,       1
29.9393,       4
29.9593,       1
29.9793,       0
29.9993,       1
30.0193,       1
30.0393,       1
30.0594,       1
30.0794,       0
30.0994,       3
30.1194,       0
30.1394,       2
30.1594,       2
30.1794,       0
30.1994,       1
30.2195,       1
30.2395,       1
30.2595,       1
30.2795,       1
30.2995,       2
30.3195,       1
30.3395,       2
30.3595,       3
30.3796,       2
30.3996,       0
30.4196,       1
30.4396,       3
30.4596,       1
30.4796,       0
30.4996,       0
30.5196,       0
30.5397,       1
30.5597,       3
30.5797,       0
30.5997,       0
30.6197,       2
30.6397,       2
30.6597,       0
30.6797,       0
30.6998,       0
30.7198,       2
30.7398,       1
30.7598,       1
30.7798,       2
30.7998,       1
30.8198,       0
30.8398,       2
30.8599,       0
30.8799,       0
30.8999,       0
30.9199,       3
30.9399,       2
30.9599,       0
30.9799,       0
30.9999,       2
31.0200,       1
31.0400,       0
31.0600,       3
31.0800,       0
31.1000,       2
31.1200,       0
31.1400,       0
31.1600,       0
31.1801,       3
31.2001,       0
31.2201,       1
31.2401,       1
31.2601,       0
31.2801,       1
31.3001,       1
31.3201,       0
31.3402,       1
31.3602,       1
31.3802,       2
31.4002,       0
31.4202,       0
31.4402,       0
31.4602,       0
31.4802,       2
31.5003,       2
31.5203,       1
31.5403,       2
31.5603,       4
31.5803,       2
31.6003,       2
31.6203,       1
31.6403,       2
31.6604,       1
31.6804,       1
31.7004,       1
31.7204,       1
31.7404,       0
31.7604,       0
31.7804,       1
31.8004,       2
31.8205,       0
31.8405,       0
31.8605,       1
31.8805,       1
31.9005,       0
31.9205,       0
31.9405,       0
31.9605,       1
31.9805,       1
32.0006,       0
32.0206,       1
32.0406,       3
32.0606,       0
32.0806,       2
32.1006,       0
32.1206,       0
32.1406,       1
32.1607,       0
32.1807,       0
32.2007,       2
32.2207,       1
32.2407,       0
32.2607,       0
32.2807,       0
32.3007,       0
32.3208,       0
32.3408,       1
32.3608,       1
32.3808,       2
32.4008,       1
32.4208,       0
32.4408,       1
32.4608,       1
32.4809,       0
32.5009,       1
32.5209,       0
32.5409,       0
32.5609,       1
32.5809,       1
32.6009,       0
32.6209,       2
32.6410,       0
32.6610,       1
32.6810,       0
32.7010,       2
32.7210,       0
32.7410,       1
32.7610,       1
32.7810,       1
32.8011,       1
32.8211,       1
32.8411,       0
32.8611,       1
32.8811,       0
32.9011,       0
32.9211,       1
32.9411,       0
32.9612,       2
32.9812,       1
33.0012,       1
33.0212,       0
33.0412,       3
33.0612,       0
33.0812,       0
33.1012,       1
33.1213,       1
33.1413,       0
33.1613,       0
33.1813,       0
33.2013,       0
33.2213,       0
33.2413,       0
33.2613,       1
33.2814,       0
33.3014,       2
33.3214,       1
33.3414,       0
33.3614,       0
33.3814,       1
33.4014,       1
33.4214,       2
33.4415,       0
33.4615,       1
33.4815,       0
33.5015,       0
33.5215,       0
33.5415,       2
33.5615,       0
33.5815,       1
33.6016,       0
33.6216,       0
33.6416,       0
33.6616,       0
33.6816,       0
33.7016,       0
33.7216,       0
33.7416,       0
33.7617,       0
33.7817,       1
33.8017,       0
33.8217,       1
33.8417,       0
33.8617,       1
33.8817,       0
33.9017,       0
33.9218,       0
33.9418,       2
33.9618,       1
33.9818,       0
34.0018,       0
34.0218,       1
34.0418,       0
34.0618,       0
34.0818,       0
34.1019,       0
34.1219,       0
34.1419,       1
34.1619,       0
34.1819,       0
34.2019,       0
34.2219,       1
34.2419,       1
34.2620,       0
34.2820,       0
34.3020,       0
34.3220,       0
34.3420,       0
34.3620,       0
34.3820,       2
34.4020,       0
34.4221,       0
34.4421,       0
34.4621,       1
34.4821,       1
34.5021,       0
34.5221,       0
34.5421,       0
34.5621,       0
34.5822,       0
34.6022,       1
34.6222,       0
34.6422,       1
34.6622,       1
34.6822,       1
34.7022,       1
34.7222,       0
34.7423,       0
34.7623,       2
34.7823,       0
34.8023,       0
34.8223,       0
34.8423,       0
34.8623,       0
34.8823,       0
34.9024,       1
34.9224,       1
34.9424,       0
34.9624,       0
34.9824,       0
35.0024,       0
35.0224,       0
35.0424,       0
35.0625,       0
35.0825,       0
35.1025,       0
35.1225,       1
35.1425,       0
35.1625,       0
35.1825,       0
35.2025,       0
35.2226,       0
35.2426,       0
35.2626,       0
35.2826,       0
35.3026,       0
35.3226,       0
35.3426,       0
35.3626,       0
35.3827,       0
35.4027,       1
35.4227,       0
35.4427,       0
35.4627,       1
35.4827,       1
35.5027,       0
35.5227,       0
35.5428,       0
35.5628,       0
35.5828,       0
35.6028,       0
35.6228,       0
35.6428,       0
35.6628,       1
35.6828,       0
35.7029,       0
35.7229,       0
35.7429,       0
35.7629,       0
35.7829,       0
35.8029,       1
35.8229,       1
35.8429,       0
35.8630,       0
35.8830,       0
35.9030,       0
35.9230,       0
35.9430,       1
35.9630,       1
35.9830,       0
36.0030,       0
36.0230,       1
36.0431,       2
36.0631,       0
36.0831,       0
36.1031,       0
36.1231,       0
36.1431,       1
36.1631,       0
36.1831,       0
36.2032,       0
36.2232,       0
36.2432,       0
36.2632,       2
36.2832,       0
36.3032,       0
36.3232,       1
36.3432,       1
36.3633,       0
36.3833,       0
36.4033,       0
36.4233,       0
36.4433,       1
36.4633,       2
36.4833,       0
36.5033,       0
36.5234,       1
36.5434,       0
36.5634,       0
36.5834,       0
36.6034,       0
36.6234,       0
36.6434,       1
36.6634,       0
36.6835,       1
36.7035,       0
36.7235,       0
36.7435,       0
36.7635,       0
36.7835,       0
36.8035,       0
36.8235,       0
36.8436,       0
36.8636,       0
36.8836,       1
36.9036,       0
36.9236,       0
36.9436,       0
36.9636,       1
36.9836,       0
37.0037,       0
37.0237,       1
37.0437,       0
37.0637,       0
37.0837,       0
37.1037,       0
37.1237,       0
37.1437,       0
37.1638,       0
37.1838,       0
37.2038,       1
37.2238,       0
37.2438,       0
37.2638,       0
37.2838,       0
37.3038,       0
37.3239,       0
37.3439,       0
37.3639,       1
37.3839,       0
37.4039,       0
37.4239,       0
37.4439,       0
37.4639,       0
37.4840,       0
37.5040,       0
37.5240,       0
37.5440,       0
37.5640,       0
37.5840,       1
37.6040,       0
37.6240,       0
37.6441,       0
37.6641,       0
37.6841,       0
37.7041,       0
37.7241,       0
37.7441,       0
37.7641,       0
37.7841,       1
37.8042,       0
37.8242,       0
37.8442,       0
37.8642,       0
37.8842,       0
37.9042,       0
37.9242,       0
37.9442,       0
37.9643,       0
37.9843,       0
38.0043,       1
38.0243,       0
38.0443,       0
38.0643,       0
38.0843,       0
38.1043,       0
38.1243,       0
38.1444,       0
38.1644,       0
38.1844,       0
38.2044,       0
38.2244,       0
38.2444,       0
38.2644,       1
38.2844,       1
38.3045,       0
38.3245,       0
38.3445,       0
38.3645,       0
38.3845,       1
38.4045,       0
38.4245,       0
38.4445,       0
38.4646,       0
38.4846,       0
38.5046,       0
38.5246,       0
38.5446,       0
38.5646,       0
38.5846,       0
38.6046,       0
38.6247,       0
38.6447,       0
38.6647,       0
38.6847,       0
38.7047,       1
38.7247,       0
38.7447,       0
38.7647,       0
38.7848,       0
38.8048,       0
38.8248,       0
38.8448,       0
38.8648,       0
38.8848,       0
38.9048,       0
38.9248,       0
38.9449,       0
38.9649,       0
38.9849,       0
39.0049,       0
39.0249,       0
39.0449,       0
39.0649,       0
39.0849,       0
39.1050,       0
39.1250,       0
39.1450,       0
39.1650,       0
39.1850,       0
39.2050,       0
39.2250,       0
39.2450,       0
39.2651,       0
39.2851,       0
39.3051,       0
39.3251,       0
39.3451,       0
39.3651,       0
39.3851,       0
39.4051,       1
39.4252,       0
39.4452,       0
39.4652,       0
39.4852,       0
39.5052,       0
39.5252,       0
39.5452,       0
39.5652,       0
39.5853,       0
39.6053,       0
39.6253,       0
39.6453,       0
39.6653,       0
39.6853,       0
39.7053,       0
39.7253,       0
39.7454,       0
39.7654,       0
39.7854,       0
39.8054,       0
39.8254,       1
39.8454,       0
39.8654,       0
39.8854,       0
39.9055,       0
39.9255,       0
39.9455,       0
39.9655,       0
39.9855,       0
40.0055,       0
40.0255,       0
40.0455,       0
40.0655,       0
40.0856,       0
40.1056,       1
40.1256,       0
40.1456,       0
40.1656,       0
40.1856,       0
40.2056,       0
40.2256,       0
40.2457,       0
40.2657,       0
40.2857,       0
40.3057,       0
40.3257,       0
40.3457,       0
40.3657,       0
40.3857,       0
40.4058,       0
40.4258,       0
40.4458,       0
40.4658,       0
40.4858,       0
40.5058,       0
40.5258,       0
40.5458,       0
40.5659,       0
40.5859,       0
40.6059,       1
40.6259,       1
40.6459,       0
40.6659,       0
40.6859,       0
40.7059,       0
40.7260,       0
40.7460,       0
40.7660,       0
40.7860,       0
40.8060,       0
40.8260,       0
40.8460,       0
40.8660,       0
40.8861,       0
40.9061,       0
40.9261,       0
40.9461,       0
40.9661,       0
