 0.0009,       0
 0.0209,       0
 0.0408,       0
 0.0608,       0
 0.0808,       0
 0.1008,       0
 0.1208,       0
 0.1408,       0
 0.1608,       0
 0.1807,       0
 0.2007,       0
 0.2207,       0
 0.2407,       0
 0.2607,       0
 0.2807,       3
 0.3007,      27
 0.3206,     254
 0.3406,    1071
 0.3606,    3009
 0.3806,    5182
 0.4006,    4866
 0.4206,    2849
 0.4406,     960
 0.4605,     206
 0.4805,      30
 0.5005,       5
 0.5205,       4
 0.5405,       0
 0.5605,       1
 0.5804,       1
 0.6004,       2
 0.6204,       2
 0.6404,       0
 0.6604,       0
 0.6804,     200
 0.7004,     177
 0.7203,     204
 0.7403,     198
 0.7603,     188
 0.7803,     229
 0.8003,     161
 0.8203,     192
 0.8403,     195
 0.8602,     240
 0.8802,     264
 0.9002,     300
 0.9202,     353
 0.9402,     452
 0.9602,     408
 0.9802,     313
 1.0001,     293
 1.0201,     253
 1.0401,     268
 1.0601,     264
 1.0801,     269
 1.1001,     272
 1.1201,     225
 1.1400,     198
 1.1600,     147
 1.1800,     180
 1.2000,     183
 1.2200,     186
 1.2400,     183
 1.2600,     178
 1.2799,     156
 1.2999,     131
 1.3199,     133
 1.3399,     129
 1.3599,     129
 1.3799,     140
 1.3999,     161
 1.4198,     171
 1.4398,     204
 1.4598,     222
 1.4798,     293
 1.4998,     282
 1.5198,     243
 1.5398,     186
 1.5597,     168
 1.5797,     172
 1.5997,     172
 1.6197,     155
 1.6397,     196
 1.6597,     313
 1.6797,     565
 1.6996,     876
 1.7196,    1218
 1.7396,    1208
 1.7596,    1059
 1.7796,     741
 1.7996,     528
 1.8196,     392
 1.8395,     312
 1.8595,     327
 1.8795,     442
 1.8995,     916
 1.9195,    2195
 1.9395,    5034
 1.9595,    9713
 1.9794,   15300
 1.9994,   18981
 2.0194,   18712
 2.0394,   14593
 2.0594,    9276
 2.0794,    5064
 2.0994,    2927
 2.1193,    1956
 2.1393,    1626
 2.1593,    1432
 2.1793,    1238
 2.1993,    1614
 2.2193,    2851
 2.2393,    5547
 2.2592,    9748
 2.2792,   13850
 2.2992,   16303
 2.3192,   15496
 2.3392,   12194
 2.3592,    8259
 2.3792,    5074
 2.3991,    3477
 2.4191,    2784
 2.4391,    2588
 2.4591,    2506
 2.4791,    2445
 2.4991,    2130
 2.5191,    1989
 2.5390,    1988
 2.5590,    2404
 2.5790,    3517
 2.5990,    5069
 2.6190,    7304
 2.6390,   10499
 2.6590,   13823
 2.6789,   16724
 2.6989,   16907
 2.7189,   14872
 2.7389,   11173
 2.7589,    8393
 2.7789,    7238
 2.7989,    7396
 2.8188,    7985
 2.8388,    8139
 2.8588,    7360
 2.8788,    6182
 2.8988,    4980
 2.9188,    4228
 2.9388,    3768
 2.9587,    3470
 2.9787,    3075
 2.9987,    2734
 3.0187,    2273
 3.0387,    1814
 3.0587,    1356
 3.0787,    1245
 3.0986,    1087
 3.1186,    1100
 3.1386,    1065
 3.1586,    1058
 3.1786,    1085
 3.1986,     973
 3.2186,    1083
 3.2385,    1296
 3.2585,    1676
 3.2785,    2175
 3.2985,    2525
 3.3185,    2582
 3.3385,    2411
 3.3585,    1977
 3.3784,    1556
 3.3984,    1148
 3.4184,     958
 3.4384,     787
 3.4584,     710
 3.4784,     675
 3.4984,     725
 3.5183,     724
 3.5383,     851
 3.5583,    1042
 3.5783,    1307
 3.5983,    1810
 3.6183,    2613
 3.6383,    3742
 3.6582,    4771
 3.6782,    5615
 3.6982,    5695
 3.7182,    4881
 3.7382,    3744
 3.7582,    2625
 3.7782,    1792
 3.7981,    1205
 3.8181,    1010
 3.8381,     909
 3.8581,     936
 3.8781,     899
 3.8981,     951
 3.9181,    1013
 3.9380,    1151
 3.9580,    1297
 3.9780,    1510
 3.9980,    1584
 4.0180,    1573
 4.0380,    1561
 4.0580,    1435
 4.0779,    1260
 4.0979,    1122
 4.1179,    1070
 4.1379,     953
 4.1579,     958
 4.1779,     927
 4.1979,     940
 4.2178,     941
 4.2378,     964
 4.2578,    1034
 4.2778,    1018
 4.2978,     987
 4.3178,    1013
 4.3378,    1071
 4.3577,    1069
 4.3777,    1142
 4.3977,    1143
 4.4177,    1130
 4.4377,    1161
 4.4577,    1284
 4.4777,    1267
 4.4976,    1282
 4.5176,    1320
 4.5376,    1267
 4.5576,    1193
 4.5776,    1204
 4.5976,    1165
 4.6176,    1147
 4.6375,    1193
 4.6575,    1270
 4.6775,    1292
 4.6975,    1253
 4.7175,    1221
 4.7375,    1205
 4.7575,    1280
 4.7774,    1264
 4.7974,    1303
 4.8174,    1302
 4.8374,    1340
 4.8574,    1276
 4.8774,    1253
 4.8974,    1322
 4.9173,    1326
 4.9373,    1374
 4.9573,    1328
 4.9773,    1292
 4.9973,    1321
 5.0173,    1368
 5.0373,    1366
 5.0572,    1411
 5.0772,    1380
 5.0972,    1413
 5.1172,    1379
 5.1372,    1426
 5.1572,    1508
 5.1772,    1507
 5.1971,    1543
 5.2171,    1372
 5.2371,    1457
 5.2571,    1495
 5.2771,    1499
 5.2971,    1537
 5.3171,    1606
 5.3370,    1517
 5.3570,    1596
 5.3770,    1587
 5.3970,    1577
 5.4170,    1711
 5.4370,    1701
 5.4570,    1702
 5.4769,    1646
 5.4969,    1694
 5.5169,    1689
 5.5369,    1731
 5.5569,    1727
 5.5769,    1715
 5.5969,    1694
 5.6168,    1676
 5.6368,    1857
 5.6568,    1775
 5.6768,    1903
 5.6968,    1825
 5.7168,    1894
 5.7368,    1801
 5.7567,    1858
 5.7767,    1946
 5.7967,    1960
 5.8167,    2028
 5.8367,    2196
 5.8567,    2304
 5.8767,    2296
 5.8966,    2392
 5.9166,    2378
 5.9366,    2289
 5.9566,    2335
 5.9766,    2140
 5.9966,    2140
 6.0166,    2198
 6.0365,    2017
 6.0565,    2129
 6.0765,    2125
 6.0965,    2133
 6.1165,    2322
 6.1365,    2254
 6.1565,    2353
 6.1764,    2367
 6.1964,    2597
 6.2164,    2493
 6.2364,    2743
 6.2564,    2969
 6.2764,    3390
 6.2964,    4000
 6.3163,    4940
 6.3363,    5929
 6.3563,    6892
 6.3763,    7689
 6.3963,    7992
 6.4163,    7487
 6.4363,    6648
 6.4562,    5837
 6.4762,    4731
 6.4962,    3814
 6.5162,    3220
 6.5362,    2725
 6.5562,    2500
 6.5762,    2460
 6.5961,    2432
 6.6161,    2352
 6.6361,    2417
 6.6561,    2475
 6.6761,    2503
 6.6961,    2484
 6.7161,    2547
 6.7360,    2480
 6.7560,    2555
 6.7760,    2719
 6.7960,    2650
 6.8160,    2728
 6.8360,    2755
 6.8560,    2794
 6.8759,    2808
 6.8959,    2880
 6.9159,    3048
 6.9359,    3022
 6.9559,    3105
 6.9759,    3128
 6.9959,    3160
 7.0158,    3275
 7.0358,    3312
 7.0558,    3525
 7.0758,    3383
 7.0958,    3347
 7.1158,    3250
 7.1358,    3076
 7.1557,    2945
 7.1757,    2998
 7.1957,    3153
 7.2157,    3212
 7.2357,    3240
 7.2557,    3484
 7.2757,    3605
 7.2956,    3696
 7.3156,    3819
 7.3356,    3725
 7.3556,    3957
 7.3756,    3943
 7.3956,    4242
 7.4156,    4241
 7.4355,    4474
 7.4555,    4578
 7.4755,    4351
 7.4955,    4173
 7.5155,    3981
 7.5355,    3569
 7.5555,    3262
 7.5754,    2942
 7.5954,    2924
 7.6154,    2769
 7.6354,    2698
 7.6554,    2669
 7.6754,    2679
 7.6954,    2649
 7.7153,    2658
 7.7353,    2650
 7.7553,    2610
 7.7753,    2714
 7.7953,    2796
 7.8153,    2678
 7.8353,    2731
 7.8552,    2799
 7.8752,    2851
 7.8952,    2882
 7.9152,    2858
 7.9352,    2974
 7.9552,    3047
 7.9752,    3213
 7.9951,    3220
 8.0151,    3346
 8.0351,    3316
 8.0551,    3236
 8.0751,    3205
 8.0951,    3118
 8.1151,    3123
 8.1350,    2922
 8.1550,    2948
 8.1750,    2934
 8.1950,    2952
 8.2150,    3041
 8.2350,    3020
 8.2550,    2975
 8.2749,    2997
 8.2949,    2930
 8.3149,    2765
 8.3349,    2943
 8.3549,    2739
 8.3749,    2717
 8.3949,    2747
 8.4148,    2768
 8.4348,    2842
 8.4548,    2777
 8.4748,    2819
 8.4948,    2910
 8.5148,    2932
 8.5348,    3138
 8.5547,    3257
 8.5747,    3337
 8.5947,    3532
 8.6147,    3614
 8.6347,    3637
 8.6547,    3469
 8.6747,    3387
 8.6946,    3320
 8.7146,    3128
 8.7346,    2941
 8.7546,    3013
 8.7746,    2878
 8.7946,    2895
 8.8146,    2869
 8.8345,    2878
 8.8545,    2837
 8.8745,    2869
 8.8945,    2776
 8.9145,    2860
 8.9345,    2889
 8.9545,    2943
 8.9744,    2922
 8.9944,    2926
 9.0144,    2870
 9.0344,    2850
 9.0544,    2848
 9.0744,    2881
 9.0944,    2918
 9.1143,    2856
 9.1343,    2857
 9.1543,    2863
 9.1743,    2902
 9.1943,    2856
 9.2143,    2864
 9.2343,    2911
 9.2542,    2827
 9.2742,    2877
 9.2942,    3046
 9.3142,    2986
 9.3342,    2946
 9.3542,    2944
 9.3742,    2948
 9.3941,    2976
 9.4141,    2953
 9.4341,    3016
 9.4541,    2910
 9.4741,    3009
 9.4941,    3103
 9.5141,    2987
 9.5340,    3088
 9.5540,    3080
 9.5740,    3137
 9.5940,    3018
 9.6140,    3042
 9.6340,    3054
 9.6540,    3044
 9.6739,    3112
 9.6939,    3032
 9.7139,    2950
 9.7339,    2954
 9.7539,    2977
 9.7739,    3057
 9.7939,    2973
 9.8138,    2928
 9.8338,    2965
 9.8538,    2930
 9.8738,    3021
 9.8938,    2997
 9.9138,    2999
 9.9338,    2984
 9.9537,    2959
 9.9737,    3073
 9.9937,    2966
10.0137,    2988
10.0337,    2926
10.0537,    2966
10.0737,    2939
10.0936,    3095
10.1136,    3048
10.1336,    3077
10.1536,    3008
10.1736,    2960
10.1936,    2925
10.2136,    3074
10.2335,    2945
10.2535,    3031
10.2735,    2994
10.2935,    3079
10.3135,    2991
10.3335,    3081
10.3535,    2969
10.3734,    2925
10.3934,    2989
10.4134,    2941
10.4334,    3014
10.4534,    2995
10.4734,    3044
10.4934,    3067
10.5133,    2942
10.5333,    2890
10.5533,    2971
10.5733,    2900
10.5933,    2892
10.6133,    2938
10.6333,    2868
10.6532,    2932
10.6732,    2978
10.6932,    2862
10.7132,    2925
10.7332,    2917
10.7532,    2985
10.7732,    2971
10.7931,    2914
10.8131,    2937
10.8331,    2928
10.8531,    2893
10.8731,    2948
10.8931,    2952
10.9131,    2850
10.9330,    2962
10.9530,    2825
10.9730,    2904
10.9930,    2955
11.0130,    2924
11.0330,    2899
11.0530,    2937
11.0729,    2836
11.0929,    2806
11.1129,    2917
11.1329,    2933
11.1529,    2884
11.1729,    2792
11.1929,    2981
11.2128,    2924
11.2328,    2873
11.2528,    2852
11.2728,    2874
11.2928,    2846
11.3128,    2836
11.3328,    2752
11.3527,    2887
11.3727,    2798
11.3927,    2861
11.4127,    2850
11.4327,    2762
11.4527,    2874
11.4727,    2774
11.4926,    2769
11.5126,    2741
11.5326,    2820
11.5526,    2753
11.5726,    2784
11.5926,    2746
11.6126,    2766
11.6325,    2781
11.6525,    2756
11.6725,    2748
11.6925,    2715
11.7125,    2790
11.7325,    2641
11.7525,    2729
11.7724,    2780
11.7924,    2634
11.8124,    2798
11.8324,    2759
11.8524,    2781
11.8724,    2720
11.8923,    2812
11.9123,    2776
11.9323,    2663
11.9523,    2663
11.9723,    2723
11.9923,    2645
12.0123,    2627
12.0322,    2676
12.0522,    2646
12.0722,    2618
12.0922,    2656
12.1122,    2618
12.1322,    2578
12.1522,    2628
12.1721,    2604
12.1921,    2540
12.2121,    2638
12.2321,    2700
12.2521,    2616
12.2721,    2677
12.2921,    2586
12.3120,    2577
12.3320,    2567
12.3520,    2575
12.3720,    2489
12.3920,    2582
12.4120,    2516
12.4320,    2525
12.4519,    2521
12.4719,    2422
12.4919,    2569
12.5119,    2540
12.5319,    2424
12.5519,    2467
12.5719,    2503
12.5918,    2403
12.6118,    2494
12.6318,    2395
12.6518,    2337
12.6718,    2433
12.6918,    2355
12.7118,    2401
12.7317,    2379
12.7517,    2466
12.7717,    2412
12.7917,    2420
12.8117,    2343
12.8317,    2390
12.8517,    2371
12.8716,    2339
12.8916,    2321
12.9116,    2385
12.9316,    2384
12.9516,    2351
12.9716,    2358
12.9916,    2347
13.0115,    2407
13.0315,    2227
13.0515,    2285
13.0715,    2312
13.0915,    2275
13.1115,    2303
13.1315,    2178
13.1514,    2171
13.1714,    2280
13.1914,    2271
13.2114,    2275
13.2314,    2250
13.2514,    2288
13.2714,    2216
13.2913,    2179
13.3113,    2146
13.3313,    2242
13.3513,    2151
13.3713,    2173
13.3913,    2154
13.4113,    2225
13.4312,    2183
13.4512,    2130
13.4712,    2130
13.4912,    2164
13.5112,    2172
13.5312,    2097
13.5512,    2123
13.5711,    2095
13.5911,    2080
13.6111,    2140
13.6311,    2185
13.6511,    2108
13.6711,    2134
13.6911,    2023
13.7110,    2090
13.7310,    2126
13.7510,    2076
13.7710,    2140
13.7910,    2167
13.8110,    2041
13.8310,    2001
13.8509,    2091
13.8709,    1926
13.8909,    2035
13.9109,    2005
13.9309,    1946
13.9509,    2038
13.9709,    2073
13.9908,    2022
14.0108,    1974
14.0308,    1934
14.0508,    2036
14.0708,    2002
14.0908,    2078
14.1108,    2010
14.1307,    2058
14.1507,    2027
14.1707,    2064
14.1907,    1878
14.2107,    2009
14.2307,    2012
14.2507,    1951
14.2706,    1924
14.2906,    1887
14.3106,    1939
14.3306,    1897
14.3506,    1881
14.3706,    1839
14.3906,    1782
14.4105,    1845
14.4305,    1851
14.4505,    1842
14.4705,    1842
14.4905,    1874
14.5105,    1786
14.5305,    1785
14.5504,    1829
14.5704,    1822
14.5904,    1778
14.6104,    1757
14.6304,    1692
14.6504,    1698
14.6704,    1718
14.6903,    1722
14.7103,    1739
14.7303,    1719
14.7503,    1639
14.7703,    1720
14.7903,    1660
14.8103,    1673
14.8302,    1648
14.8502,    1622
14.8702,    1703
14.8902,    1643
14.9102,    1613
14.9302,    1659
14.9502,    1703
14.9701,    1655
14.9901,    1689
15.0101,    1622
15.0301,    1648
15.0501,    1679
15.0701,    1646
15.0901,    1511
15.1100,    1585
15.1300,    1588
15.1500,    1602
15.1700,    1555
15.1900,    1620
15.2100,    1576
15.2300,    1525
15.2499,    1563
15.2699,    1455
15.2899,    1570
15.3099,    1585
15.3299,    1505
15.3499,    1484
15.3699,    1519
15.3898,    1486
15.4098,    1565
15.4298,    1523
15.4498,    1443
15.4698,    1470
15.4898,    1520
15.5098,    1402
15.5297,    1490
15.5497,    1475
15.5697,    1438
15.5897,    1470
15.6097,    1424
15.6297,    1347
15.6497,    1399
15.6696,    1439
15.6896,    1452
15.7096,    1417
15.7296,    1359
15.7496,    1344
15.7696,    1402
15.7896,    1385
15.8095,    1395
15.8295,    1397
15.8495,    1381
15.8695,    1276
15.8895,    1382
15.9095,    1326
15.9295,    1343
15.9494,    1329
15.9694,    1338
15.9894,    1319
16.0094,    1267
16.0294,    1328
16.0494,    1322
16.0694,    1250
16.0893,    1289
16.1093,    1336
16.1293,    1254
16.1493,    1247
16.1693,    1210
16.1893,    1290
16.2093,    1241
16.2292,    1262
16.2492,    1218
16.2692,    1165
16.2892,    1215
16.3092,    1219
16.3292,    1190
16.3492,    1194
16.3691,    1191
16.3891,    1247
16.4091,    1207
16.4291,    1199
16.4491,    1185
16.4691,    1142
16.4891,    1159
16.5090,    1123
16.5290,    1133
16.5490,    1085
16.5690,    1174
16.5890,    1111
16.6090,    1134
16.6290,    1111
16.6489,    1127
16.6689,    1098
16.6889,    1082
16.7089,    1138
16.7289,    1080
16.7489,    1075
16.7689,    1102
16.7888,    1037
16.8088,    1062
16.8288,    1079
16.8488,    1109
16.8688,    1084
16.8888,    1047
16.9088,    1064
16.9287,    1019
16.9487,    1056
16.9687,    1059
16.9887,    1020
17.0087,     965
17.0287,    1079
17.0487,    1076
17.0686,     994
17.0886,    1023
17.1086,     988
17.1286,    1051
17.1486,     967
17.1686,     980
17.1886,     980
17.2085,    1023
17.2285,     985
17.2485,     911
17.2685,     967
17.2885,     916
17.3085,     939
17.3285,     994
17.3484,     964
17.3684,     894
17.3884,     941
17.4084,     899
17.4284,     880
17.4484,     936
17.4684,     919
17.4883,     877
17.5083,     951
17.5283,     900
17.5483,     897
17.5683,     880
17.5883,     935
17.6083,     866
17.6282,     855
17.6482,     906
17.6682,     809
17.6882,     869
17.7082,     902
17.7282,     801
17.7482,     823
17.7681,     826
17.7881,     832
17.8081,     855
17.8281,     795
17.8481,     849
17.8681,     816
17.8881,     877
17.9080,     843
17.9280,     841
17.9480,     833
17.9680,     825
17.9880,     844
18.0080,     814
18.0280,     779
18.0479,     795
18.0679,     755
18.0879,     773
18.1079,     742
18.1279,     782
18.1479,     743
18.1679,     735
18.1878,     712
18.2078,     762
18.2278,     789
18.2478,     770
18.2678,     771
18.2878,     753
18.3078,     749
18.3277,     741
18.3477,     717
18.3677,     717
18.3877,     728
18.4077,     684
18.4277,     743
18.4477,     680
18.4676,     680
18.4876,     683
18.5076,     696
18.5276,     748
18.5476,     718
18.5676,     757
18.5876,     764
18.6075,     717
18.6275,     727
18.6475,     710
18.6675,     738
18.6875,     746
18.7075,     728
18.7275,     727
18.7474,     738
18.7674,     741
18.7874,     718
18.8074,     737
18.8274,     733
18.8474,     778
18.8674,     727
18.8873,     750
18.9073,     731
18.9273,     720
18.9473,     811
18.9673,     762
18.9873,     749
19.0073,     738
19.0272,     729
19.0472,     723
19.0672,     732
19.0872,     719
19.1072,     697
19.1272,     712
19.1472,     667
19.1671,     701
19.1871,     679
19.2071,     660
19.2271,     656
19.2471,     648
19.2671,     603
19.2871,     617
19.3070,     586
19.3270,     614
19.3470,     641
19.3670,     586
19.3870,     592
19.4070,     541
19.4270,     587
19.4469,     535
19.4669,     500
19.4869,     507
19.5069,     569
19.5269,     559
19.5469,     520
19.5669,     510
19.5868,     499
19.6068,     492
19.6268,     514
19.6468,     464
19.6668,     460
19.6868,     481
19.7068,     449
19.7267,     486
19.7467,     494
19.7667,     427
19.7867,     459
19.8067,     412
19.8267,     433
19.8467,     416
19.8666,     427
19.8866,     414
19.9066,     436
19.9266,     423
19.9466,     429
19.9666,     444
19.9866,     417
20.0065,     449
20.0265,     431
20.0465,     395
20.0665,     411
20.0865,     426
20.1065,     413
20.1265,     408
20.1464,     408
20.1664,     456
20.1864,     409
20.2064,     382
20.2264,     442
20.2464,     404
20.2664,     402
20.2863,     369
20.3063,     366
20.3263,     360
20.3463,     381
20.3663,     376
20.3863,     364
20.4063,     320
20.4262,     352
20.4462,     315
20.4662,     337
20.4862,     330
20.5062,     345
20.5262,     338
20.5462,     305
20.5661,     330
20.5861,     329
20.6061,     321
20.6261,     314
20.6461,     308
20.6661,     324
20.6861,     311
20.7060,     346
20.7260,     264
20.7460,     314
20.7660,     297
20.7860,     268
20.8060,     305
20.8260,     280
20.8459,     283
20.8659,     286
20.8859,     278
20.9059,     291
20.9259,     271
20.9459,     288
20.9659,     256
20.9858,     260
21.0058,     283
21.0258,     245
21.0458,     301
21.0658,     268
21.0858,     243
21.1058,     272
21.1257,     270
21.1457,     238
21.1657,     261
21.1857,     273
21.2057,     249
21.2257,     259
21.2457,     238
21.2656,     261
21.2856,     260
21.3056,     243
21.3256,     215
21.3456,     241
21.3656,     243
21.3856,     227
21.4055,     257
21.4255,     213
21.4455,     208
21.4655,     214
21.4855,     230
21.5055,     194
21.5255,     179
21.5454,     168
21.5654,     188
21.5854,     203
21.6054,     172
21.6254,     194
21.6454,     180
21.6654,     175
21.6853,     177
21.7053,     175
21.7253,     162
21.7453,     177
21.7653,     175
21.7853,     154
21.8053,     134
21.8252,     172
21.8452,     165
21.8652,     151
21.8852,     165
21.9052,     129
21.9252,     159
21.9452,     133
21.9651,     141
21.9851,     140
22.0051,     133
22.0251,     126
22.0451,     128
22.0651,     125
22.0851,     145
22.1050,     123
22.1250,     128
22.1450,     107
22.1650,     115
22.1850,     105
22.2050,     127
22.2250,     125
22.2449,     116
22.2649,      92
22.2849,     107
22.3049,     110
22.3249,      90
22.3449,     112
22.3649,     103
22.3848,      97
22.4048,      97
22.4248,     104
22.4448,      82
22.4648,      81
22.4848,      81
22.5048,      80
22.5247,      88
22.5447,      90
22.5647,     102
22.5847,      78
22.6047,      84
22.6247,      98
22.6447,      89
22.6646,      68
22.6846,      74
22.7046,      77
22.7246,      81
22.7446,      68
22.7646,      61
22.7846,      70
22.8045,      68
22.8245,      73
22.8445,      66
22.8645,      64
22.8845,      55
22.9045,      54
22.9245,      58
22.9444,      44
22.9644,      62
22.9844,      53
23.0044,      49
23.0244,      57
23.0444,      51
23.0644,      53
23.0843,      44
23.1043,      44
23.1243,      48
23.1443,      39
23.1643,      51
23.1843,      44
23.2043,      44
23.2242,      29
23.2442,      43
23.2642,      35
23.2842,      43
23.3042,      32
23.3242,      37
23.3441,      33
23.3641,      37
23.3841,      30
23.4041,      34
23.4241,      26
23.4441,      27
23.4641,      28
23.4840,      19
23.5040,      27
23.5240,      34
23.5440,      28
23.5640,      27
23.5840,      29
23.6040,      35
23.6239,      32
23.6439,      27
23.6639,      27
23.6839,      27
23.7039,      24
23.7239,      33
23.7439,      28
23.7638,      25
23.7838,      26
23.8038,      15
23.8238,      17
23.8438,      23
23.8638,      22
23.8838,      26
23.9037,      23
23.9237,      19
23.9437,      21
23.9637,      15
23.9837,      19
24.0037,      23
24.0237,      16
24.0436,      18
24.0636,      31
24.0836,      17
24.1036,      17
24.1236,      15
24.1436,      13
24.1636,      12
24.1835,      29
24.2035,      17
24.2235,      12
24.2435,      20
24.2635,       9
24.2835,      22
24.3035,      19
24.3234,      22
24.3434,      18
24.3634,      14
24.3834,      18
24.4034,      17
24.4234,      10
24.4434,      15
24.4633,      14
24.4833,      12
24.5033,      25
24.5233,      10
24.5433,      14
24.5633,      13
24.5833,      22
24.6032,      17
24.6232,      14
24.6432,      13
24.6632,      13
24.6832,      13
24.7032,      18
24.7232,      13
24.7431,      12
24.7631,      17
24.7831,      14
24.8031,      11
24.8231,      14
24.8431,      14
24.8631,      12
24.8830,      15
24.9030,       8
24.9230,       8
24.9430,      18
24.9630,      17
24.9830,      19
25.0030,      14
25.0229,      19
25.0429,      11
25.0629,      14
25.0829,      16
25.1029,       9
25.1229,      10
25.1429,       8
25.1628,      11
25.1828,      12
25.2028,      18
25.2228,       9
25.2428,      12
25.2628,      13
25.2828,       5
25.3027,      18
25.3227,       7
25.3427,       9
25.3627,      11
25.3827,      12
25.4027,      12
25.4227,      16
25.4426,       8
25.4626,       8
25.4826,      10
25.5026,      13
25.5226,       5
25.5426,      16
25.5626,      12
25.5825,      16
25.6025,      13
25.6225,      11
25.6425,      11
25.6625,      16
25.6825,       8
25.7025,      11
25.7224,       8
25.7424,      10
25.7624,      19
25.7824,       9
25.8024,       9
25.8224,      19
25.8424,       8
25.8623,       8
25.8823,      10
25.9023,       8
25.9223,      10
25.9423,       8
25.9623,      13
25.9823,      11
26.0022,       8
26.0222,      15
26.0422,      10
26.0622,      14
26.0822,       7
26.1022,      12
26.1222,      11
26.1421,       9
26.1621,      11
26.1821,      12
26.2021,       5
26.2221,      12
26.2421,       7
26.2621,      11
26.2820,      10
26.3020,      17
26.3220,      11
26.3420,       6
26.3620,       7
26.3820,       9
26.4020,       9
26.4219,       5
26.4419,      13
26.4619,      11
26.4819,      11
26.5019,       7
26.5219,       8
26.5419,       5
26.5618,       7
26.5818,       9
26.6018,       9
26.6218,       6
26.6418,      10
26.6618,       7
26.6818,       4
26.7017,      12
26.7217,       4
26.7417,      11
26.7617,      12
26.7817,       6
26.8017,      10
26.8217,      12
26.8416,      13
26.8616,       5
26.8816,      12
26.9016,      16
26.9216,       7
26.9416,      17
26.9616,       9
26.9815,       8
27.0015,       6
27.0215,      13
27.0415,       8
27.0615,       6
27.0815,       7
27.1015,       8
27.1214,       8
27.1414,       9
27.1614,      13
27.1814,      12
27.2014,      10
27.2214,       9
27.2414,      11
27.2613,       7
27.2813,      10
27.3013,       7
27.3213,       9
27.3413,       7
27.3613,       8
27.3813,       4
27.4012,       4
27.4212,       6
27.4412,       9
27.4612,      10
27.4812,      14
27.5012,      12
27.5212,      10
27.5411,       9
27.5611,       7
27.5811,       7
27.6011,       6
27.6211,       8
27.6411,       9
27.6611,       6
27.6810,       9
27.7010,      10
27.7210,       9
27.7410,       5
27.7610,      10
27.7810,      10
27.8010,      10
27.8209,       9
27.8409,       9
27.8609,       9
27.8809,       8
27.9009,       9
27.9209,      10
27.9409,       9
27.9608,       5
27.9808,       5
28.0008,       7
28.0208,       6
28.0408,       4
28.0608,       6
28.0808,       7
28.1007,       8
28.1207,       3
28.1407,       9
28.1607,      12
28.1807,      10
28.2007,       6
28.2207,       8
28.2406,       7
28.2606,       8
28.2806,       8
28.3006,      10
28.3206,       6
28.3406,       6
28.3606,       5
28.3805,       9
28.4005,       9
28.4205,       7
28.4405,       4
28.4605,       8
28.4805,       5
28.5005,      10
28.5204,       5
28.5404,       8
28.5604,       5
28.5804,      10
28.6004,       9
28.6204,       5
28.6404,       4
28.6603,      10
28.6803,       5
28.7003,       9
28.7203,      10
28.7403,      10
28.7603,       8
28.7803,       1
28.8002,       4
28.8202,       6
28.8402,       2
28.8602,       8
28.8802,       9
28.9002,       6
28.9202,       9
28.9401,       4
28.9601,      14
28.9801,      11
29.0001,       6
29.0201,       4
29.0401,       8
29.0601,      13
29.0800,       7
29.1000,       1
29.1200,       4
29.1400,      11
29.1600,      10
29.1800,       8
29.2000,       7
29.2199,       2
29.2399,       6
29.2599,       7
29.2799,      10
29.2999,       6
29.3199,       3
29.3399,       9
29.3598,       8
29.3798,       8
29.3998,       7
29.4198,       6
29.4398,       5
29.4598,       7
29.4798,       4
29.4997,       8
29.5197,       1
29.5397,       4
29.5597,       5
29.5797,       6
29.5997,       2
29.6197,       3
29.6396,       4
29.6596,       5
29.6796,       2
29.6996,       1
29.7196,       4
29.7396,       5
29.7596,       5
29.7795,       4
29.7995,       4
29.8195,       5
29.8395,       8
29.8595,       8
29.8795,       6
29.8995,       8
29.9194,       6
29.9394,       4
29.9594,       4
29.9794,       8
29.9994,       3
30.0194,       4
30.0394,       7
30.0593,       9
30.0793,       7
30.0993,       6
30.1193,       6
30.1393,       3
30.1593,       5
30.1793,       6
30.1992,       4
30.2192,       6
30.2392,      14
30.2592,       7
30.2792,       3
30.2992,       4
30.3192,       4
30.3391,       6
30.3591,       3
30.3791,       4
30.3991,       5
30.4191,       2
30.4391,       3
30.4591,       4
30.4790,       3
30.4990,       4
30.5190,       5
30.5390,       5
30.5590,       5
30.5790,       5
30.5990,       5
30.6189,       3
30.6389,       2
30.6589,       3
30.6789,       6
30.6989,       5
30.7189,       4
30.7389,       5
30.7588,       3
30.7788,       2
30.7988,       7
30.8188,       2
30.8388,       4
30.8588,       2
30.8788,       2
30.8987,       7
30.9187,       4
30.9387,       0
30.9587,       5
30.9787,       8
30.9987,       6
31.0187,       4
31.0386,       2
31.0586,       2
31.0786,       3
31.0986,       4
31.1186,       5
31.1386,       3
31.1586,       2
31.1785,       4
31.1985,       2
31.2185,       5
31.2385,       7
31.2585,       6
31.2785,       3
31.2985,       6
31.3184,       6
31.3384,       0
31.3584,       7
31.3784,       2
31.3984,      10
31.4184,       5
31.4384,       3
31.4583,       1
31.4783,       2
31.4983,       5
31.5183,       1
31.5383,       4
31.5583,       1
31.5783,       7
31.5982,       4
31.6182,       3
31.6382,       6
31.6582,       3
31.6782,       5
31.6982,       5
31.7182,       3
31.7381,       3
31.7581,       2
31.7781,       3
31.7981,       3
31.8181,       1
31.8381,       4
31.8581,       2
31.8780,       3
31.8980,       2
31.9180,       5
31.9380,       5
31.9580,       2
31.9780,       3
31.9980,       3
32.0179,       5
32.0379,       4
32.0579,       4
32.0779,       1
32.0979,       1
32.1179,       3
32.1379,       2
32.1578,       6
32.1778,       4
32.1978,       4
32.2178,       2
32.2378,       3
32.2578,       4
32.2778,       4
32.2977,       5
32.3177,       3
32.3377,       3
32.3577,       1
32.3777,       4
32.3977,       5
32.4177,       4
32.4376,       4
32.4576,       3
32.4776,       3
32.4976,       1
32.5176,       2
32.5376,       2
32.5576,       3
32.5775,       4
32.5975,       3
32.6175,       2
32.6375,       2
32.6575,       3
32.6775,       1
32.6975,       3
32.7174,       2
32.7374,       3
32.7574,       4
32.7774,       4
32.7974,       2
32.8174,       2
32.8374,       0
32.8573,       4
32.8773,       2
32.8973,       4
32.9173,       3
32.9373,       3
32.9573,       3
32.9773,       2
32.9972,       2
33.0172,       3
33.0372,       0
33.0572,       1
33.0772,       6
33.0972,       1
33.1172,       2
33.1371,       3
33.1571,       0
33.1771,       3
33.1971,       3
33.2171,       3
33.2371,       0
33.2571,       3
33.2770,       4
33.2970,       3
33.3170,       4
33.3370,       3
33.3570,       6
33.3770,       1
33.3970,       2
33.4169,       3
33.4369,       2
33.4569,       2
33.4769,       1
33.4969,       1
33.5169,       0
33.5369,       1
33.5568,       2
33.5768,       1
33.5968,       1
33.6168,       0
33.6368,       1
33.6568,       2
33.6768,       3
33.6967,       1
33.7167,       7
33.7367,       1
33.7567,       1
33.7767,       4
33.7967,       3
33.8167,       2
33.8366,       2
33.8566,       0
33.8766,       2
33.8966,       1
33.9166,       2
33.9366,       2
33.9566,       2
33.9765,       0
33.9965,       0
34.0165,       2
34.0365,       1
34.0565,       2
34.0765,       2
34.0965,       1
34.1164,       3
34.1364,       3
34.1564,       0
34.1764,       1
34.1964,       0
34.2164,       3
34.2364,       0
34.2563,       2
34.2763,       2
34.2963,       3
34.3163,       1
34.3363,       0
34.3563,       1
34.3763,       2
34.3962,       0
34.4162,       0
34.4362,       2
34.4562,       0
34.4762,       2
34.4962,       0
34.5162,       2
34.5361,       2
34.5561,       5
34.5761,       1
34.5961,       1
34.6161,       0
34.6361,       3
34.6560,       1
34.6760,       0
34.6960,       2
34.7160,       3
34.7360,       1
34.7560,       1
34.7760,       7
34.7959,       1
34.8159,       0
34.8359,       1
34.8559,       1
34.8759,       1
34.8959,       0
34.9159,       0
34.9358,       0
34.9558,       2
34.9758,       1
34.9958,       0
35.0158,       1
35.0358,       2
35.0558,       0
35.0757,       0
35.0957,       1
35.1157,       1
35.1357,       0
35.1557,       0
35.1757,       0
35.1957,       3
35.2156,       0
35.2356,       1
35.2556,       1
35.2756,       3
35.2956,       1
35.3156,       1
35.3356,       1
35.3555,       0
35.3755,       0
35.3955,       0
35.4155,       4
35.4355,       0
35.4555,       3
35.4755,       2
35.4954,       0
35.5154,       2
35.5354,       2
35.5554,       0
35.5754,       0
35.5954,       1
35.6154,       0
35.6353,       2
35.6553,       0
35.6753,       1
35.6953,       0
35.7153,       4
35.7353,       0
35.7553,       1
35.7752,       1
35.7952,       0
35.8152,       1
35.8352,       0
35.8552,       2
35.8752,       1
35.8952,       2
35.9151,       2
35.9351,       4
35.9551,       0
35.9751,       0
35.9951,       1
36.0151,       1
36.0351,       1
36.0550,       0
36.0750,       2
36.0950,       0
36.1150,       0
36.1350,       0
36.1550,       0
36.1750,       0
36.1949,       1
36.2149,       3
36.2349,       1
36.2549,       1
36.2749,       1
36.2949,       1
36.3149,       0
36.3348,       0
36.3548,       1
36.3748,       1
36.3948,       0
36.4148,       0
36.4348,       3
36.4548,       0
36.4747,       1
36.4947,       2
36.5147,       0
36.5347,       1
36.5547,       1
36.5747,       0
36.5947,       0
36.6146,       0
36.6346,       1
36.6546,       0
36.6746,       1
36.6946,       0
36.7146,       1
36.7346,       0
36.7545,       0
36.7745,       1
36.7945,       1
36.8145,       0
36.8345,       0
36.8545,       0
36.8745,       0
36.8944,       1
36.9144,       0
36.9344,       1
36.9544,       0
36.9744,       0
36.9944,       3
37.0144,       0
37.0343,       2
37.0543,       1
37.0743,       0
37.0943,       2
37.1143,       0
37.1343,       1
37.1543,       0
37.1742,       1
37.1942,       1
37.2142,       0
37.2342,       0
37.2542,       1
37.2742,       1
37.2942,       0
37.3141,       0
37.3341,       0
37.3541,       0
37.3741,       0
37.3941,       1
37.4141,       0
37.4341,       2
37.4540,       1
37.4740,       0
37.4940,       0
37.5140,       0
37.5340,       0
37.5540,       1
37.5740,       2
37.5939,       0
37.6139,       0
37.6339,       2
37.6539,       0
37.6739,       3
37.6939,       0
37.7139,       1
37.7338,       0
37.7538,       1
37.7738,       1
37.7938,       0
37.8138,       0
37.8338,       0
37.8538,       1
37.8737,       0
37.8937,       0
37.9137,       0
37.9337,       0
37.9537,       0
37.9737,       1
37.9937,       0
38.0136,       0
38.0336,       0
38.0536,       0
38.0736,       1
38.0936,       1
38.1136,       1
38.1336,       0
38.1535,       0
38.1735,       0
38.1935,       0
38.2135,       1
38.2335,       0
38.2535,       0
38.2735,       1
38.2934,       1
38.3134,       0
38.3334,       1
38.3534,       0
38.3734,       0
38.3934,       0
38.4134,       0
38.4333,       0
38.4533,       0
38.4733,       0
38.4933,       0
38.5133,       0
38.5333,       1
38.5533,       0
38.5732,       0
38.5932,       0
38.6132,       0
38.6332,       0
38.6532,       0
38.6732,       0
38.6932,       0
38.7131,       0
38.7331,       0
38.7531,       1
38.7731,       0
38.7931,       0
38.8131,       1
38.8331,       0
38.8530,       0
38.8730,       1
38.8930,       1
38.9130,       0
38.9330,       0
38.9530,       0
38.9730,       1
38.9929,       0
39.0129,       1
39.0329,       0
39.0529,       0
39.0729,       0
39.0929,       0
39.1129,       1
39.1328,       0
39.1528,       0
39.1728,       1
39.1928,       0
39.2128,       0
39.2328,       0
39.2528,       0
39.2727,       0
39.2927,       0
39.3127,       1
39.3327,       0
39.3527,       0
39.3727,       1
39.3927,       0
39.4126,       0
39.4326,       0
39.4526,       0
39.4726,       0
39.4926,       0
39.5126,       0
39.5326,       0
39.5525,       0
39.5725,       0
39.5925,       0
39.6125,       0
39.6325,       0
39.6525,       1
39.6725,       0
39.6924,       0
39.7124,       0
39.7324,       0
39.7524,       0
39.7724,       0
39.7924,       0
39.8124,       0
39.8323,       0
39.8523,       0
39.8723,       0
39.8923,       0
39.9123,       0
39.9323,       0
39.9523,       0
39.9722,       0
39.9922,       0
40.0122,       0
40.0322,       0
40.0522,       0
40.0722,       0
40.0922,       0
40.1121,       0
40.1321,       1
40.1521,       0
40.1721,       0
40.1921,       0
40.2121,       0
40.2321,       0
40.2520,       0
40.2720,       0
40.2920,       0
40.3120,       0
40.3320,       0
40.3520,       0
40.3720,       0
40.3919,       0
40.4119,       0
40.4319,       0
40.4519,       1
40.4719,       0
40.4919,       1
40.5119,       0
40.5318,       0
40.5518,       0
40.5718,       0
40.5918,       0
40.6118,       0
40.6318,       1
40.6518,       0
40.6717,       0
40.6917,       0
40.7117,       0
40.7317,       0
40.7517,       0
40.7717,       0
40.7917,       1
40.8116,       0
40.8316,       0
40.8516,       0
40.8716,       0
40.8916,       0
40.9116,       0
