material,wavelength,standardDeviation,mean,relativeDev,interval
dark_card,365,168.36050271979423,1206.6008870967742,0.13953288491680932,"(869.88,1543.32)"
dark_card,385,70.39324490031481,847.059935483871,0.0831030272493099,"(706.27,987.85)"
dark_card,450,50.066110193085,678.5978709677419,0.07377876108229783,"(578.47,778.73)"
dark_card,500,30.910581223963206,625.7393548387097,0.04939849313446284,"(563.92,687.56)"
dark_card,530,33.090058337498164,631.284564516129,0.052417024266799936,"(565.1,697.46)"
dark_card,587,83.03253529457692,627.6353870967743,0.13229422209390854,"(461.57,793.7)"
dark_card,632,41.377598030357305,631.6261129032258,0.06550963803597042,"(548.87,714.38)"
dark_card,850,57.6610942434278,694.5061290322581,0.08302460098339835,"(579.18,809.83)"
dark_card,880,119.46683848931126,778.3332580645161,0.15349059962616762,"(539.4,1017.27)"
dark_card,940,54.1360470157491,731.8694838709678,0.07396953720411378,"(623.6,840.14)"
dark_cuvette,365,183.65530351516477,1365.9517741935483,0.13445226031028368,"(998.64,1733.26)"
dark_cuvette,385,97.50491073493663,1032.899193548387,0.09439925148936514,"(837.89,1227.91)"
dark_cuvette,450,79.09749969401791,879.8883870967742,0.08989492400849064,"(721.69,1038.08)"
dark_cuvette,500,54.82762922386066,730.2773225806452,0.07507781979332379,"(620.62,839.93)"
dark_cuvette,530,62.1898505128164,734.6896612903225,0.08464778230796587,"(610.31,859.07)"
dark_cuvette,587,79.9573038177184,724.0519677419355,0.11043033840109187,"(564.14,883.97)"
dark_cuvette,632,51.403016000836544,726.0394677419355,0.07079920346576435,"(623.23,828.85)"
dark_cuvette,850,540.3524719372124,4441.046451612903,0.12167233056996436,"(3360.34,5521.75)"
dark_cuvette,880,252.51155133494518,2540.9032258064517,0.09937865746728748,"(2035.88,3045.93)"
dark_cuvette,940,847.1140297727948,5349.98935483871,0.1583393860413267,"(3655.76,7044.22)"
light_card,365,3033.5785015691936,30139.45806451613,0.10065139509395143,"(24072.3,36206.62)"
light_card,385,1044.9719421864825,17266.956451612903,0.06051859487309194,"(15177.01,19356.9)"
light_card,450,375.32185129909595,9510.543225806452,0.039463765884652745,"(8759.9,10261.19)"
light_card,500,330.05061228007395,10270.657580645162,0.03213529510535405,"(9610.56,10930.76)"
light_card,530,267.4997250059887,10039.053709677419,0.026645910335963745,"(9504.05,10574.05)"
light_card,587,299.05986574795156,9999.978870967741,0.029906049763384172,"(9401.86,10598.1)"
light_card,632,328.6373151739335,10103.552741935484,0.03252690648210326,"(9446.28,10760.83)"
light_card,850,574.9298933847201,10509.050967741936,0.05470806975334847,"(9359.19,11658.91)"
light_card,880,522.5986287045964,10806.590483870968,0.048359251651534714,"(9761.39,11851.79)"
light_card,940,515.2796338622609,9421.564677419356,0.0546915137245972,"(8391.01,10452.12)"
light_cuvette,365,194.91957568429663,2109.8112903225806,0.09238720855195268,"(1719.97,2499.65)"
light_cuvette,385,167.7747802787435,2342.9032258064517,0.07160977817211962,"(2007.35,2678.45)"
light_cuvette,450,272.9747728690387,3871.87064516129,0.0705020383907137,"(3325.92,4417.82)"
light_cuvette,500,69.12230786489911,1866.5243548387098,0.03703263109624525,"(1728.28,2004.77)"
light_cuvette,530,89.1041052250512,2021.3070967741935,0.04408241843471116,"(1843.1,2199.52)"
light_cuvette,587,173.41742493124772,2480.9025806451614,0.06990094100597466,"(2134.07,2827.74)"
light_cuvette,632,91.09549238343597,1438.2032258064517,0.06333979144870537,"(1256.01,1620.39)"
light_cuvette,850,551.8456067502667,5068.10064516129,0.10888607890554321,"(3964.41,6171.79)"
light_cuvette,880,295.1543263243096,2778.0279032258063,0.10624599053939689,"(2187.72,3368.34)"
light_cuvette,940,881.196150886085,5945.557580645162,0.1482108513682017,"(4183.17,7707.95)"
medium_card,365,1138.672414218956,12509.890322580644,0.09102177436069328,"(10232.55,14787.24)"
medium_card,385,383.2364134900691,7265.8422580645165,0.052744939936551286,"(6499.37,8032.32)"
medium_card,450,157.5192156859682,4157.423548387097,0.03788866201690683,"(3842.39,4472.46)"
medium_card,500,171.7436612256266,4957.843870967742,0.034640796623574034,"(4614.36,5301.33)"
medium_card,530,114.14423648428617,4806.456774193548,0.023748104237021433,"(4578.17,5034.75)"
medium_card,587,154.51073112400036,4855.445161290322,0.03182215553700941,"(4546.42,5164.47)"
medium_card,632,170.54586419488012,4938.691612903226,0.03453260044609754,"(4597.6,5279.78)"
medium_card,850,299.71213419417285,5107.619677419355,0.05867941489833158,"(4508.2,5707.04)"
medium_card,880,292.70517330400014,5332.044516129033,0.05489548566569335,"(4746.63,5917.45)"
medium_card,940,235.52090440014524,4188.188064516129,0.056234557945371424,"(3717.15,4659.23)"
medium_cuvette,365,175.906341304788,1419.3343548387097,0.12393580181096767,"(1067.52,1771.15)"
medium_cuvette,385,93.3756852686461,1068.0664516129032,0.08742497728267569,"(881.32,1254.82)"
medium_cuvette,450,74.41328868093271,904.1256129032258,0.08230414847112359,"(755.3,1052.95)"
medium_cuvette,500,55.26529655680703,755.6183870967742,0.07313916323442914,"(645.09,866.15)"
medium_cuvette,530,56.25659770752055,743.9023225806452,0.07562363498525287,"(631.39,856.42)"
medium_cuvette,587,78.77124394535689,729.9639677419354,0.10791114003753803,"(572.42,887.51)"
medium_cuvette,632,52.417887875997494,743.2382258064516,0.07052636161053395,"(638.4,848.07)"
medium_cuvette,850,544.2247424289235,5080.6758064516125,0.10711660479061637,"(3992.23,6169.13)"
medium_cuvette,880,291.97476055118995,2803.0245161290322,0.10416418367771044,"(2219.07,3386.97)"
medium_cuvette,940,882.3058818707126,5995.906451612904,0.1471513755244416,"(4231.29,7760.52)"
oats,365,151.88210678281362,2419.205238095238,0.06278181957906062,"(2115.44,2722.97)"
oats,385,136.9895294909297,2043.1732142857143,0.06704743804054847,"(1769.19,2317.15)"
oats,450,190.06263322836188,2773.1925,0.06853567980887078,"(2393.07,3153.32)"
oats,500,172.57223674909687,2390.9083333333333,0.07217852493261497,"(2045.76,2736.05)"
oats,530,148.7662584469652,2639.025833333333,0.05637165675603095,"(2341.49,2936.56)"
oats,587,209.63955148390104,3030.204880952381,0.06918329278712408,"(2610.93,3449.48)"
oats,632,229.42067097178588,3261.368154761905,0.07034491663776446,"(2802.53,3720.21)"
oats,850,401.5202636904945,5504.5606547619045,0.07294319908041089,"(4701.52,6307.6)"
oats,880,359.8228604658701,5126.854880952381,0.07018393709615363,"(4407.21,5846.5)"
oats,940,543.6367752444444,7136.663452380953,0.07617520132087423,"(6049.39,8223.94)"
soil,365,163.39554465649468,2762.5656473214285,0.05914630293579531,"(2435.77,3089.36)"
soil,385,155.913671124598,2255.468816964286,0.06912694600426693,"(1943.64,2567.3)"
soil,450,262.99774037583023,2476.3746205357143,0.10620272805046593,"(1950.38,3002.37)"
soil,500,297.8445783156019,2251.2117857142857,0.13230411292516353,"(1655.52,2846.9)"
soil,530,350.6670495424926,2452.2809598214285,0.14299627786859612,"(1750.95,3153.62)"
soil,587,499.02512034578245,2764.9883035714283,0.18048001132634486,"(1766.94,3763.04)"
soil,632,533.4553141233386,2901.9935267857145,0.18382374364363263,"(1835.08,3968.9)"
soil,850,604.7308028816087,3977.2205580357145,0.15204859626398884,"(2767.76,5186.68)"
soil,880,505.44366816881166,4007.0714508928572,0.126137922511012,"(2996.18,5017.96)"
soil,940,529.3853741150253,4512.992522321429,0.11730251523721026,"(3454.22,5571.76)"
standard,365,159.87346832410466,10120.633387096774,0.01579678486604743,"(9800.89,10440.38)"
standard,385,112.81820568164413,9992.020322580645,0.011290830286512718,"(9766.38,10217.66)"
standard,450,124.70059409603171,9982.23564516129,0.012492251087708801,"(9732.83,10231.64)"
standard,500,100.03434174945761,10031.948225806453,0.009971576756359905,"(9831.88,10232.02)"
standard,530,118.77421897860863,10045.376612903226,0.011823769636077541,"(9807.83,10282.93)"
standard,587,122.33208060285608,10047.132903225807,0.012175819886246277,"(9802.47,10291.8)"
standard,632,97.25150914714811,10054.012741935483,0.00967290490308513,"(9859.51,10248.52)"
standard,850,199.55413028328508,10040.77741935484,0.01987437047440369,"(9641.67,10439.89)"
standard,880,177.4157824944509,10039.987580645162,0.017670916529465498,"(9685.16,10394.82)"
standard,940,156.60805003478896,10012.239032258065,0.015641661123972295,"(9699.02,10325.46)"
wheat,365,155.2561416756466,2591.930773809524,0.059899802589039396,"(2281.42,2902.44)"
wheat,385,126.94795550746977,2122.7974404761903,0.059802199252224714,"(1868.9,2376.69)"
wheat,450,147.5210638868364,2644.919761904762,0.055775251110301294,"(2349.88,2939.96)"
wheat,500,115.80100594818192,2431.931726190476,0.04761688196303914,"(2200.33,2663.53)"
wheat,530,101.75562034192701,2730.9607142857144,0.03726000883485477,"(2527.45,2934.47)"
wheat,587,168.87592031531852,3389.5474404761903,0.049822556928600915,"(3051.8,3727.3)"
wheat,632,234.44660354814494,3851.838333333333,0.060866158768729466,"(3382.95,4320.73)"
wheat,850,500.92420155269485,6706.17,0.07469601897248278,"(5704.32,7708.02)"
wheat,880,426.9720165645549,6237.909047619048,0.06844793877325386,"(5383.97,7091.85)"
wheat,940,542.6032938275745,8114.665595238095,0.0668669937731,"(7029.46,9199.87)"
