strain	species	species_match	contig_count	N50	largest_contig	total_size	ambiguous_bases	QC_warnings	ST	virulence_score	resistance_score	num_resistance_classes	num_resistance_genes	Yersiniabactin	YbST	Colibactin	CbST	Aerobactin	AbST	Salmochelin	SmST	RmpADC	RmST	rmpA2	wzi	K_locus	K_type	K_locus_problems	K_locus_confidence	K_locus_identity	K_locus_missing_genes	O_locus	O_type	O_locus_problems	O_locus_confidence	O_locus_identity	O_locus_missing_genes	AGly_acquired	Col_acquired	Fcyn_acquired	Flq_acquired	Gly_acquired	MLS_acquired	Phe_acquired	Rif_acquired	Sul_acquired	Tet_acquired	Tgc_acquired	Tmt_acquired	Bla_acquired	Bla_inhR_acquired	Bla_ESBL_acquired	Bla_ESBL_inhR_acquired	Bla_Carb_acquired	Bla_chr	SHV_mutations	Omp_mutations	Col_mutations	Flq_mutations	truncated_resistance_hits	spurious_resistance_hits	Chr_ST	gapA	infB	mdh	pgi	phoE	rpoB	tonB	ybtS	ybtX	ybtQ	ybtP	ybtA	irp2	irp1	ybtU	ybtT	ybtE	fyuA	clbA	clbB	clbC	clbD	clbE	clbF	clbG	clbH	clbI	clbL	clbM	clbN	clbO	clbP	clbQ	iucA	iucB	iucC	iucD	iutA	iroB	iroC	iroD	iroN	rmpA	rmpD	rmpC	spurious_virulence_hits
14EN-22795.assembly	Klebsiella oxytoca	strong	167	228356	448140	5890791	no	-	NA	1	1	1	1	ybt unknown	0	-	0	-	0	-	0	-	0	-	-	KL74	K74	?-+	Good	99.51%	KL74_17_manC,KL74_18_manB	O5	O5	?-*	Good	81.76%	O5_01_manC,O5_02_manB	-	-	-	-	-	-	-	-	-	-	-	-	-	-	OXY-2-6	-	-	-	-	-	-	-	-	-	NA	-	-	-	-	-	-	-	2*	25*	178*	148*	42*	161*	533*	39*	57*-0%	130*	262*	-	-	-	-	-	-	-	-	-	-	-	-	-	-	-	-	-	-	-	-	-	-	-	-	-	-	-	-
22EN-A12-S3.assembly	Klebsiella variicola subsp. variicola	strong	158	156729	419185	5480802	no	-	ST1339	0	0	0	0	-	0	-	0	-	0	-	0	-	0	-	-	KL34	K34	?-*	Good	96.18%	KL34_16	O1/O2v1	O2a	*	High	93.91%		-	-	-	-	-	-	-	-	-	-	-	-	-	-	-	-	-	LEN-13	-	-	-	-	-	-	ST1339	16	24	21	49	47	22	67	-	-	-	-	-	-	-	-	-	-	-	-	-	-	-	-	-	-	-	-	-	-	-	-	-	-	-	-	-	-	-	-	-	-	-	-	-	-	-
22EN-A14-D6.assembly	Klebsiella variicola subsp. variicola	strong	97	486512	1328594	5856277	no	-	ST3105	0	0	0	0	-	0	-	0	-	0	-	0	-	0	-	wzi49	unknown (KL49)	unknown (K49)	?-+	Low	99.60%	KL49_17_manC,KL49_18_manB	O5	O5	?-	Good	99.66%	O5_01_manC,O5_02_manB	-	-	-	-	-	-	-	-	-	-	-	-	-	-	-	-	-	LEN-2^	-	-	-	-	-	-	ST3105	16	24	21	38	47	22	74	-	-	-	-	-	-	-	-	-	-	-	-	-	-	-	-	-	-	-	-	-	-	-	-	-	-	-	-	-	-	-	-	-	-	-	-	-	-	-
22EN-A17-E1.assembly	Klebsiella quasipneumoniae subsp. similipneumoniae	strong	174	293525	627113	5369751	no	-	ST841	0	0	0	0	-	0	-	0	-	0	-	0	-	0	-	wzi454	KL66	K66	?-+*	Good	93.41%	KL66_02_cpsACP	O12	O12	none	Very high	98.81%		-	-	-	-	-	-	-	-	-	-	-	-	-	-	-	-	-	OKP-B-6*?	-	-	-	-	-	-	ST841	18	15	64	59	11	13	51	-	-	-	-	-	-	-	-	-	-	-	-	-	-	-	-	-	-	-	-	-	-	-	-	-	-	-	-	-	-	-	-	-	-	-	-	-	-	-
22EN-C15-C4.assembly	Klebsiella aerogenes	strong	66	359555	984629	5331048	no	-	NA	0	0	0	0	-	0	-	0	-	0	iro unknown	0	-	0	-	-	unknown (KL65)	unknown (K65)	?-+*	None	72.78%	KL65_02_cpsACP,KL65_07_wzy,KL65_08_wcuC,KL65_09_wcuE,KL65_10_wcuO,KL65_11_wbaZ,KL65_13_wzx,KL65_14_wcuN,KL65_15_wcuS,KL65_16_rmlA,KL65_17_rmlC,KL65_18_rmlD	unknown (OL102)	unknown (OL102)	-*	None	82.05%	OL102_05_wbbL,OL102_06_rhamnan,OL102_07_wzm,OL102_08_wzt	-	-	-	-	-	-	-	-	-	-	-	-	-	-	-	-	-	-	-	-	-	-	-	-	NA	-	-	-	-	-	-	-	-	-	-	-	-	-	-	-	-	-	-	-	-	-	-	-	-	-	-	-	-	-	-	-	-	-	-	-	-	-	-	25*	33*-0%	-	15*	-	-	-	-
22EN-C15-C8.assembly	Klebsiella variicola subsp. variicola	strong	154	363662	733976	5712543	no	-	ST4600	0	0	0	0	-	0	-	0	-	0	-	0	-	0	-	wzi198	unknown (KL127)	unknown (KL127)	?-*	None	94.55%	KL127_15_rmlB,KL127_16_rmlA,KL127_17_rmlD,KL127_18_rmlC	OL103	unknown (OL103)	-	High	96.64%	OL103_01_rmlC	-	-	-	-	-	-	-	-	-	-	-	-	-	-	-	-	-	LEN-24*	-	-	-	-	-	-	ST4600	16	24	21	27	65	22	85	-	-	-	-	-	-	-	-	-	-	-	-	-	-	-	-	-	-	-	-	-	-	-	-	-	-	-	-	-	-	-	-	-	-	-	-	-	-	-
22EN-C21-A3.assembly	Klebsiella variicola subsp. variicola	strong	151	308738	638516	5690144	no	-	ST2412	0	0	0	0	-	0	-	0	-	0	-	0	-	0	-	wzi32	KL31	K31	?-+*	Good	90.47%	KL31_18_manC,KL31_19_manB	O5	O5	?-	Good	99.57%	O5_01_manC,O5_02_manB	-	-	-	-	-	-	-	-	-	-	-	-	-	-	-	-	-	LEN-13	-	-	-	-	-	-	ST2412	30	18	21	31	47	22	67	-	-	-	-	-	-	-	-	-	-	-	-	-	-	-	-	-	-	-	-	-	-	-	-	-	-	-	-	-	-	-	-	-	-	-	-	-	-	-
34EN-B2001-B7.assembly	Klebsiella aerogenes	strong	97	325561	930674	5323421	no	-	NA	0	0	3	4	-	0	-	0	-	0	iro unknown	0	-	0	-	-	unknown (KL65)	unknown (K65)	?-+*	None	72.71%	KL65_02_cpsACP,KL65_07_wzy,KL65_08_wcuC,KL65_09_wcuE,KL65_10_wcuO,KL65_11_wbaZ,KL65_13_wzx,KL65_14_wcuN,KL65_15_wcuS,KL65_16_rmlA,KL65_17_rmlC,KL65_18_rmlD	unknown (O12)	unknown (O12)	?-*	None	77.05%	O12_05_wbbL,O12_06_wzm,O12_07_wzt,O12_08_wbbB	strA.v1*;strB.v1*	-	-	qnrS1	-	-	-	-	sul2	-	-	-	-	-	-	-	-	-	-	-	-	-	-	-	NA	-	-	-	-	-	-	-	-	-	-	-	-	-	-	-	-	-	-	-	-	-	-	-	-	-	-	-	-	-	-	-	-	-	-	-	-	-	-	25*	33*-0%	-	15*	-	-	-	-
34EN-B5001-A9.assembly	Klebsiella quasipneumoniae subsp. similipneumoniae	strong	142	528961	912697	5376670	no	-	ST5052-2LV	0	0	1	1	-	0	-	0	-	0	-	0	-	0	-	-	KL125	unknown (KL125)	*	High	90.44%		O5	O5	*	High	94.09%		-	mcr-8.1*	-	-	-	-	-	-	-	-	-	-	-	-	-	-	-	OKP-B-2^	-	-	-	-	-	-	ST5052-2LV	18	22	26	110	142	105	99	-	-	-	-	-	-	-	-	-	-	-	-	-	-	-	-	-	-	-	-	-	-	-	-	-	-	-	-	-	-	-	-	-	-	-	-	-	-	-
