sample_ID	HTD_department	MEM	IPM	CRO	CTX	CT	CIP	E	CN
190721-489228	PICU	R	I	R	R	I	R		S
230721-489585	PICU	R	R	R	R	I	R		S
250721-198666	Infections A	R	R	R	R	I	R		R
280721-490181	PICU	R	I	R	R	I	R		S
290721-490280	PICU	R	R	R	R	I	R		R
290721-490285	PICU	R	I	R	R	S	R		S
290721-490315	PICU	R	R	R	R	I	R		S
060821-199599	Infections A	R	R	R	R	I	R		S
060821-296570	Infections E	R	I	R	R	I	R		S
070821-296696	Infections E	R	I	R	R	I	R		S
080821-296772	Infections E	R	R	R	R	I	R		S
080821-290142	Infections E	R	R	R	R	I	R		R
080821-290158	Infections E	R	I	R	R	I	R		S
090821-145449	AICU	R	R	R	R	I	R		R
100821-491655	PICU	R	R	R	R	I	R		R
100821-145645	AICU	R	R	R	R	I	R		S
100821-145690	AICU	R	R	R	R	R	R		R
150821-290944	Infections E	R	I	R	R	I	R		S
160821-492364	PICU	R	R	R	R	R	R		R
210821-190577	Infections A	R	R			I	R		I
210821-725904	Emergency Dept	R	R	R	R	R	R		S
230821-299187	Infections E	R	I	R	R	I	R		S
230821-148372	AICU	R	R	R	R	I	R		R
240821-148607	AICU	R	R	R	R	R	R		S
240821-190972	Infections A	R	R	R	R	R	R		R
250821-292029	Infections E	R	I	R	R	I	R		S
250821-291998	Infections E	R	I	R	R	I	R		S
280821-191596	Infections A	R	R	R	R	I	R		S
290821-292554	Infections E	R	R	R	R	I	R		S
040921-295702	Infections E	R	R	R	R	I	R		S
040921-192780	Infections A	R	I	R	R	I	R		S
050921-293391	Infections E	R	I	R	R	I	R		S
060921-295953	Infections E	R	I	R	R	I	R		S
060921-725171	Emergency Dept	R	R	R	R	I	R		S
070921-990805	PICU	R	I	R	R	I	R		S
070921-296138	Infections E	R	I	R	R	I	R		S
070921-296159	Infections E	R	I	R	R	I	R		S
090921-296394	Infections E	R	R	R	R	S	R		S
110921-193849	Infections A	R	I	R	R	I	R		S
120921-296916	Infections E	R	I	R	R	I	R		S
130921-496635	PICU	R	I	R	R	I	R		S
180921-297656	Infections E	R	I			I	R		S
210921-149256	AICU	R	R	R	R	R	R		S
230921-298348	Infections E	R	I	R	R	I	R		S
240921-289529	Infections E	R	R			R	R		S
300921-299299	Infections E	R	R	R	R	I	R		S
061021-140903	AICU	R	R	R	R	R	R		R
161021-142869	AICU	R	R	R	R	R	R		R
171021-565730	PICU	R	R	R	R	R	R		R
201021-440405	Infections E	R	R	R	R	R	R		S
031121-292908	Infections E	R	R	R	R	I	R		S
291121-289727	Infections E	R	I			R	R		S
161221-291441	Infections E	R	R			R	R		R
171221-140561	AICU	R	R	R	R	R	R		I
171221-447779	Infections E	R	R	R	R	I	R		R
250122-294990	Infections E		R	R			S	R	R
310122-295305	Infections E		R				R	R	I
020222-265503	Infections D		R	R			S	R	R
200222-149709	AICU		R	R			S	R	R
170322-297699	Infections E		R	R			R	R	I
110122-572342	PICU		R	R			S	R	I
051021-196897	Infections A	R	R	R	R	R	R		S
151021-142662	AICU	R	I	S		S	R		S
ERR4244680	AICU	R	R	I	S	R	R		S
ERR4244681	AICU	R	R	I	S	R	R		S
ERR4244682	AICU	R	R	I	S	R	R		S
ERR4244683	VA	R	R	R	R	S	R		R
ERR4244684	VA	R	R	R	R	S	R		R
ERR4244675	VA	R	R	R	R	S	R		R
ERR4244677	VA	R	R	R	R	S	R		R
ERR4244678	VA	R	R	R	R	S	R		R
ERR4244679	VA	R	R	R	R	S	R		R
