ERR3584928	/data/SiNguyen/40EN/raw_read/Kp_ST16_PRJEB28400_PRJEB29424/ERR3584928_1.fastq.gz	/data/SiNguyen/40EN/raw_read/Kp_ST16_PRJEB28400_PRJEB29424/ERR3584928_2.fastq.gz
ERR3567165	/data/SiNguyen/40EN/raw_read/Kp_ST16_PRJEB28400_PRJEB29424/ERR3567165_1.fastq.gz	/data/SiNguyen/40EN/raw_read/Kp_ST16_PRJEB28400_PRJEB29424/ERR3567165_2.fastq.gz
ERR3584929	/data/SiNguyen/40EN/raw_read/Kp_ST16_PRJEB28400_PRJEB29424/ERR3584929_1.fastq.gz	/data/SiNguyen/40EN/raw_read/Kp_ST16_PRJEB28400_PRJEB29424/ERR3584929_2.fastq.gz
ERR3584932	/data/SiNguyen/40EN/raw_read/Kp_ST16_PRJEB28400_PRJEB29424/ERR3584932_1.fastq.gz	/data/SiNguyen/40EN/raw_read/Kp_ST16_PRJEB28400_PRJEB29424/ERR3584932_2.fastq.gz
ERR3584933	/data/SiNguyen/40EN/raw_read/Kp_ST16_PRJEB28400_PRJEB29424/ERR3584933_1.fastq.gz	/data/SiNguyen/40EN/raw_read/Kp_ST16_PRJEB28400_PRJEB29424/ERR3584933_2.fastq.gz
ERR3584934	/data/SiNguyen/40EN/raw_read/Kp_ST16_PRJEB28400_PRJEB29424/ERR3584934_1.fastq.gz	/data/SiNguyen/40EN/raw_read/Kp_ST16_PRJEB28400_PRJEB29424/ERR3584934_2.fastq.gz
ERR3584935	/data/SiNguyen/40EN/raw_read/Kp_ST16_PRJEB28400_PRJEB29424/ERR3584935_1.fastq.gz	/data/SiNguyen/40EN/raw_read/Kp_ST16_PRJEB28400_PRJEB29424/ERR3584935_2.fastq.gz
ERR3567836	/data/SiNguyen/40EN/raw_read/Kp_ST16_PRJEB28400_PRJEB29424/ERR3567836_1.fastq.gz	/data/SiNguyen/40EN/raw_read/Kp_ST16_PRJEB28400_PRJEB29424/ERR3567836_2.fastq.gz
ERR3567839	/data/SiNguyen/40EN/raw_read/Kp_ST16_PRJEB28400_PRJEB29424/ERR3567839_1.fastq.gz	/data/SiNguyen/40EN/raw_read/Kp_ST16_PRJEB28400_PRJEB29424/ERR3567839_2.fastq.gz
ERR3567877	/data/SiNguyen/40EN/raw_read/Kp_ST16_PRJEB28400_PRJEB29424/ERR3567877_1.fastq.gz	/data/SiNguyen/40EN/raw_read/Kp_ST16_PRJEB28400_PRJEB29424/ERR3567877_2.fastq.gz
ERR3567803	/data/SiNguyen/40EN/raw_read/Kp_ST16_PRJEB28400_PRJEB29424/ERR3567803_1.fastq.gz	/data/SiNguyen/40EN/raw_read/Kp_ST16_PRJEB28400_PRJEB29424/ERR3567803_2.fastq.gz
ERR3567737	/data/SiNguyen/40EN/raw_read/Kp_ST16_PRJEB28400_PRJEB29424/ERR3567737_1.fastq.gz	/data/SiNguyen/40EN/raw_read/Kp_ST16_PRJEB28400_PRJEB29424/ERR3567737_2.fastq.gz
ERR3567794	/data/SiNguyen/40EN/raw_read/Kp_ST16_PRJEB28400_PRJEB29424/ERR3567794_1.fastq.gz	/data/SiNguyen/40EN/raw_read/Kp_ST16_PRJEB28400_PRJEB29424/ERR3567794_2.fastq.gz
ERR3567864	/data/SiNguyen/40EN/raw_read/Kp_ST16_PRJEB28400_PRJEB29424/ERR3567864_1.fastq.gz	/data/SiNguyen/40EN/raw_read/Kp_ST16_PRJEB28400_PRJEB29424/ERR3567864_2.fastq.gz
ERR3567867	/data/SiNguyen/40EN/raw_read/Kp_ST16_PRJEB28400_PRJEB29424/ERR3567867_1.fastq.gz	/data/SiNguyen/40EN/raw_read/Kp_ST16_PRJEB28400_PRJEB29424/ERR3567867_2.fastq.gz
ERR3585138	/data/SiNguyen/40EN/raw_read/Kp_ST16_PRJEB28400_PRJEB29424/ERR3585138_1.fastq.gz	/data/SiNguyen/40EN/raw_read/Kp_ST16_PRJEB28400_PRJEB29424/ERR3585138_2.fastq.gz
ERR3585141	/data/SiNguyen/40EN/raw_read/Kp_ST16_PRJEB28400_PRJEB29424/ERR3585141_1.fastq.gz	/data/SiNguyen/40EN/raw_read/Kp_ST16_PRJEB28400_PRJEB29424/ERR3585141_2.fastq.gz
ERR3585071	/data/SiNguyen/40EN/raw_read/Kp_ST16_PRJEB28400_PRJEB29424/ERR3585071_1.fastq.gz	/data/SiNguyen/40EN/raw_read/Kp_ST16_PRJEB28400_PRJEB29424/ERR3585071_2.fastq.gz
ERR3585075	/data/SiNguyen/40EN/raw_read/Kp_ST16_PRJEB28400_PRJEB29424/ERR3585075_1.fastq.gz	/data/SiNguyen/40EN/raw_read/Kp_ST16_PRJEB28400_PRJEB29424/ERR3585075_2.fastq.gz
ERR3585081	/data/SiNguyen/40EN/raw_read/Kp_ST16_PRJEB28400_PRJEB29424/ERR3585081_1.fastq.gz	/data/SiNguyen/40EN/raw_read/Kp_ST16_PRJEB28400_PRJEB29424/ERR3585081_2.fastq.gz
ERR3585083	/data/SiNguyen/40EN/raw_read/Kp_ST16_PRJEB28400_PRJEB29424/ERR3585083_1.fastq.gz	/data/SiNguyen/40EN/raw_read/Kp_ST16_PRJEB28400_PRJEB29424/ERR3585083_2.fastq.gz
ERR3585085	/data/SiNguyen/40EN/raw_read/Kp_ST16_PRJEB28400_PRJEB29424/ERR3585085_1.fastq.gz	/data/SiNguyen/40EN/raw_read/Kp_ST16_PRJEB28400_PRJEB29424/ERR3585085_2.fastq.gz
ERR3585086	/data/SiNguyen/40EN/raw_read/Kp_ST16_PRJEB28400_PRJEB29424/ERR3585086_1.fastq.gz	/data/SiNguyen/40EN/raw_read/Kp_ST16_PRJEB28400_PRJEB29424/ERR3585086_2.fastq.gz
ERR3585127	/data/SiNguyen/40EN/raw_read/Kp_ST16_PRJEB28400_PRJEB29424/ERR3585127_1.fastq.gz	/data/SiNguyen/40EN/raw_read/Kp_ST16_PRJEB28400_PRJEB29424/ERR3585127_2.fastq.gz
ERR3585164	/data/SiNguyen/40EN/raw_read/Kp_ST16_PRJEB28400_PRJEB29424/ERR3585164_1.fastq.gz	/data/SiNguyen/40EN/raw_read/Kp_ST16_PRJEB28400_PRJEB29424/ERR3585164_2.fastq.gz
ERR3585166	/data/SiNguyen/40EN/raw_read/Kp_ST16_PRJEB28400_PRJEB29424/ERR3585166_1.fastq.gz	/data/SiNguyen/40EN/raw_read/Kp_ST16_PRJEB28400_PRJEB29424/ERR3585166_2.fastq.gz
ERR3585168	/data/SiNguyen/40EN/raw_read/Kp_ST16_PRJEB28400_PRJEB29424/ERR3585168_1.fastq.gz	/data/SiNguyen/40EN/raw_read/Kp_ST16_PRJEB28400_PRJEB29424/ERR3585168_2.fastq.gz
ERR3585169	/data/SiNguyen/40EN/raw_read/Kp_ST16_PRJEB28400_PRJEB29424/ERR3585169_1.fastq.gz	/data/SiNguyen/40EN/raw_read/Kp_ST16_PRJEB28400_PRJEB29424/ERR3585169_2.fastq.gz
ERR3585210	/data/SiNguyen/40EN/raw_read/Kp_ST16_PRJEB28400_PRJEB29424/ERR3585210_1.fastq.gz	/data/SiNguyen/40EN/raw_read/Kp_ST16_PRJEB28400_PRJEB29424/ERR3585210_2.fastq.gz
ERR3585170	/data/SiNguyen/40EN/raw_read/Kp_ST16_PRJEB28400_PRJEB29424/ERR3585170_1.fastq.gz	/data/SiNguyen/40EN/raw_read/Kp_ST16_PRJEB28400_PRJEB29424/ERR3585170_2.fastq.gz
ERR3585171	/data/SiNguyen/40EN/raw_read/Kp_ST16_PRJEB28400_PRJEB29424/ERR3585171_1.fastq.gz	/data/SiNguyen/40EN/raw_read/Kp_ST16_PRJEB28400_PRJEB29424/ERR3585171_2.fastq.gz
ERR3585173	/data/SiNguyen/40EN/raw_read/Kp_ST16_PRJEB28400_PRJEB29424/ERR3585173_1.fastq.gz	/data/SiNguyen/40EN/raw_read/Kp_ST16_PRJEB28400_PRJEB29424/ERR3585173_2.fastq.gz
ERR3585175	/data/SiNguyen/40EN/raw_read/Kp_ST16_PRJEB28400_PRJEB29424/ERR3585175_1.fastq.gz	/data/SiNguyen/40EN/raw_read/Kp_ST16_PRJEB28400_PRJEB29424/ERR3585175_2.fastq.gz
ERR3585217	/data/SiNguyen/40EN/raw_read/Kp_ST16_PRJEB28400_PRJEB29424/ERR3585217_1.fastq.gz	/data/SiNguyen/40EN/raw_read/Kp_ST16_PRJEB28400_PRJEB29424/ERR3585217_2.fastq.gz
ERR3585220	/data/SiNguyen/40EN/raw_read/Kp_ST16_PRJEB28400_PRJEB29424/ERR3585220_1.fastq.gz	/data/SiNguyen/40EN/raw_read/Kp_ST16_PRJEB28400_PRJEB29424/ERR3585220_2.fastq.gz
ERR3585259	/data/SiNguyen/40EN/raw_read/Kp_ST16_PRJEB28400_PRJEB29424/ERR3585259_1.fastq.gz	/data/SiNguyen/40EN/raw_read/Kp_ST16_PRJEB28400_PRJEB29424/ERR3585259_2.fastq.gz
ERR3585260	/data/SiNguyen/40EN/raw_read/Kp_ST16_PRJEB28400_PRJEB29424/ERR3585260_1.fastq.gz	/data/SiNguyen/40EN/raw_read/Kp_ST16_PRJEB28400_PRJEB29424/ERR3585260_2.fastq.gz
ERR3585262	/data/SiNguyen/40EN/raw_read/Kp_ST16_PRJEB28400_PRJEB29424/ERR3585262_1.fastq.gz	/data/SiNguyen/40EN/raw_read/Kp_ST16_PRJEB28400_PRJEB29424/ERR3585262_2.fastq.gz
ERR3585263	/data/SiNguyen/40EN/raw_read/Kp_ST16_PRJEB28400_PRJEB29424/ERR3585263_1.fastq.gz	/data/SiNguyen/40EN/raw_read/Kp_ST16_PRJEB28400_PRJEB29424/ERR3585263_2.fastq.gz
ERR3585269	/data/SiNguyen/40EN/raw_read/Kp_ST16_PRJEB28400_PRJEB29424/ERR3585269_1.fastq.gz	/data/SiNguyen/40EN/raw_read/Kp_ST16_PRJEB28400_PRJEB29424/ERR3585269_2.fastq.gz
ERR3585364	/data/SiNguyen/40EN/raw_read/Kp_ST16_PRJEB28400_PRJEB29424/ERR3585364_1.fastq.gz	/data/SiNguyen/40EN/raw_read/Kp_ST16_PRJEB28400_PRJEB29424/ERR3585364_2.fastq.gz
ERR3585365	/data/SiNguyen/40EN/raw_read/Kp_ST16_PRJEB28400_PRJEB29424/ERR3585365_1.fastq.gz	/data/SiNguyen/40EN/raw_read/Kp_ST16_PRJEB28400_PRJEB29424/ERR3585365_2.fastq.gz
ERR3585405	/data/SiNguyen/40EN/raw_read/Kp_ST16_PRJEB28400_PRJEB29424/ERR3585405_1.fastq.gz	/data/SiNguyen/40EN/raw_read/Kp_ST16_PRJEB28400_PRJEB29424/ERR3585405_2.fastq.gz
ERR3585395	/data/SiNguyen/40EN/raw_read/Kp_ST16_PRJEB28400_PRJEB29424/ERR3585395_1.fastq.gz	/data/SiNguyen/40EN/raw_read/Kp_ST16_PRJEB28400_PRJEB29424/ERR3585395_2.fastq.gz
ERR3585398	/data/SiNguyen/40EN/raw_read/Kp_ST16_PRJEB28400_PRJEB29424/ERR3585398_1.fastq.gz	/data/SiNguyen/40EN/raw_read/Kp_ST16_PRJEB28400_PRJEB29424/ERR3585398_2.fastq.gz
ERR3567377	/data/SiNguyen/40EN/raw_read/Kp_ST16_PRJEB28400_PRJEB29424/ERR3567377_1.fastq.gz	/data/SiNguyen/40EN/raw_read/Kp_ST16_PRJEB28400_PRJEB29424/ERR3567377_2.fastq.gz
ERR3567288	/data/SiNguyen/40EN/raw_read/Kp_ST16_PRJEB28400_PRJEB29424/ERR3567288_1.fastq.gz	/data/SiNguyen/40EN/raw_read/Kp_ST16_PRJEB28400_PRJEB29424/ERR3567288_2.fastq.gz
ERR3595903	/data/SiNguyen/40EN/raw_read/Kp_ST16_PRJEB28400_PRJEB29424/ERR3595903_1.fastq.gz	/data/SiNguyen/40EN/raw_read/Kp_ST16_PRJEB28400_PRJEB29424/ERR3595903_2.fastq.gz
ERR3595905	/data/SiNguyen/40EN/raw_read/Kp_ST16_PRJEB28400_PRJEB29424/ERR3595905_1.fastq.gz	/data/SiNguyen/40EN/raw_read/Kp_ST16_PRJEB28400_PRJEB29424/ERR3595905_2.fastq.gz
ERR3642062	/data/SiNguyen/40EN/raw_read/Kp_ST16_PRJEB28400_PRJEB29424/ERR3642062_1.fastq.gz	/data/SiNguyen/40EN/raw_read/Kp_ST16_PRJEB28400_PRJEB29424/ERR3642062_2.fastq.gz
ERR3642070	/data/SiNguyen/40EN/raw_read/Kp_ST16_PRJEB28400_PRJEB29424/ERR3642070_1.fastq.gz	/data/SiNguyen/40EN/raw_read/Kp_ST16_PRJEB28400_PRJEB29424/ERR3642070_2.fastq.gz
ERR3642309	/data/SiNguyen/40EN/raw_read/Kp_ST16_PRJEB28400_PRJEB29424/ERR3642309_1.fastq.gz	/data/SiNguyen/40EN/raw_read/Kp_ST16_PRJEB28400_PRJEB29424/ERR3642309_2.fastq.gz
ERR3642314	/data/SiNguyen/40EN/raw_read/Kp_ST16_PRJEB28400_PRJEB29424/ERR3642314_1.fastq.gz	/data/SiNguyen/40EN/raw_read/Kp_ST16_PRJEB28400_PRJEB29424/ERR3642314_2.fastq.gz
ERR3642318	/data/SiNguyen/40EN/raw_read/Kp_ST16_PRJEB28400_PRJEB29424/ERR3642318_1.fastq.gz	/data/SiNguyen/40EN/raw_read/Kp_ST16_PRJEB28400_PRJEB29424/ERR3642318_2.fastq.gz
ERR3642324	/data/SiNguyen/40EN/raw_read/Kp_ST16_PRJEB28400_PRJEB29424/ERR3642324_1.fastq.gz	/data/SiNguyen/40EN/raw_read/Kp_ST16_PRJEB28400_PRJEB29424/ERR3642324_2.fastq.gz
ERR3642376	/data/SiNguyen/40EN/raw_read/Kp_ST16_PRJEB28400_PRJEB29424/ERR3642376_1.fastq.gz	/data/SiNguyen/40EN/raw_read/Kp_ST16_PRJEB28400_PRJEB29424/ERR3642376_2.fastq.gz
ERR3642382	/data/SiNguyen/40EN/raw_read/Kp_ST16_PRJEB28400_PRJEB29424/ERR3642382_1.fastq.gz	/data/SiNguyen/40EN/raw_read/Kp_ST16_PRJEB28400_PRJEB29424/ERR3642382_2.fastq.gz
ERR3567495	/data/SiNguyen/40EN/raw_read/Kp_ST16_PRJEB28400_PRJEB29424/ERR3567495_1.fastq.gz	/data/SiNguyen/40EN/raw_read/Kp_ST16_PRJEB28400_PRJEB29424/ERR3567495_2.fastq.gz
ERR3567498	/data/SiNguyen/40EN/raw_read/Kp_ST16_PRJEB28400_PRJEB29424/ERR3567498_1.fastq.gz	/data/SiNguyen/40EN/raw_read/Kp_ST16_PRJEB28400_PRJEB29424/ERR3567498_2.fastq.gz
ERR3595946	/data/SiNguyen/40EN/raw_read/Kp_ST16_PRJEB28400_PRJEB29424/ERR3595946_1.fastq.gz	/data/SiNguyen/40EN/raw_read/Kp_ST16_PRJEB28400_PRJEB29424/ERR3595946_2.fastq.gz
ERR3595950	/data/SiNguyen/40EN/raw_read/Kp_ST16_PRJEB28400_PRJEB29424/ERR3595950_1.fastq.gz	/data/SiNguyen/40EN/raw_read/Kp_ST16_PRJEB28400_PRJEB29424/ERR3595950_2.fastq.gz
ERR3642151	/data/SiNguyen/40EN/raw_read/Kp_ST16_PRJEB28400_PRJEB29424/ERR3642151_1.fastq.gz	/data/SiNguyen/40EN/raw_read/Kp_ST16_PRJEB28400_PRJEB29424/ERR3642151_2.fastq.gz
ERR3642042	/data/SiNguyen/40EN/raw_read/Kp_ST16_PRJEB28400_PRJEB29424/ERR3642042_1.fastq.gz	/data/SiNguyen/40EN/raw_read/Kp_ST16_PRJEB28400_PRJEB29424/ERR3642042_2.fastq.gz
ERR3642039	/data/SiNguyen/40EN/raw_read/Kp_ST16_PRJEB28400_PRJEB29424/ERR3642039_1.fastq.gz	/data/SiNguyen/40EN/raw_read/Kp_ST16_PRJEB28400_PRJEB29424/ERR3642039_2.fastq.gz
ERR3642156	/data/SiNguyen/40EN/raw_read/Kp_ST16_PRJEB28400_PRJEB29424/ERR3642156_1.fastq.gz	/data/SiNguyen/40EN/raw_read/Kp_ST16_PRJEB28400_PRJEB29424/ERR3642156_2.fastq.gz
ERR3655957	/data/SiNguyen/40EN/raw_read/Kp_ST16_PRJEB28400_PRJEB29424/ERR3655957_1.fastq.gz	/data/SiNguyen/40EN/raw_read/Kp_ST16_PRJEB28400_PRJEB29424/ERR3655957_2.fastq.gz
ERR3655959	/data/SiNguyen/40EN/raw_read/Kp_ST16_PRJEB28400_PRJEB29424/ERR3655959_1.fastq.gz	/data/SiNguyen/40EN/raw_read/Kp_ST16_PRJEB28400_PRJEB29424/ERR3655959_2.fastq.gz
