Node	Total SNPs	Number of SNPs Inside Recombinations	Number of SNPs Outside Recombinations	Number of Recombination Blocks	Bases in Recombinations	Cumulative Bases in Recombinations	r/m	rho/theta	Genome Length	Bases in Clonal Frame
ERR3567165	13	12	1	1	0	191913	12.000000	1.000000	5097195	4905275
ERR3567288	9	3	6	1	0	191913	0.500000	0.166667	5096274	4904354
ERR3567377	9	5	4	1	0	191913	1.250000	0.250000	5095761	4903841
ERR3567495	9	9	0	1	0	191913	0.000000	0.000000	5096157	4904237
ERR3567498	16	12	4	1	0	191913	3.000000	0.250000	5096086	4904166
ERR3567737	20	17	3	1	0	191913	5.666667	0.333333	5095043	4903123
ERR3567794	0	0	0	0	0	191913	0.000000	0.000000	5095144	4903224
ERR3567803	3	0	3	0	0	191913	0.000000	0.000000	5095257	4903337
ERR3567836	12	11	1	2	0	191982	11.000000	2.000000	5096403	4904413
ERR3567839	5	0	5	0	0	191982	0.000000	0.000000	5096343	4904353
ERR3567864	4	4	0	1	0	191941	0.000000	0.000000	5085047	4893099
ERR3567867	13	11	2	1	0	191941	5.500000	0.500000	5084657	4892709
ERR3567877	20	18	2	2	0	192060	9.000000	1.000000	5095509	4903519
ERR3584928	59	56	3	3	0	191941	18.666666	1.000000	5086091	4894171
ERR3584929	9	3	6	1	0	191913	0.500000	0.166667	5096729	4904809
ERR3584932	14	6	8	1	0	191913	0.750000	0.125000	5095873	4903953
ERR3584933	5	4	1	1	0	191913	4.000000	1.000000	5096050	4904130
ERR3584934	13	7	6	1	0	191913	1.166667	0.166667	5096355	4904435
ERR3584935	60	60	0	4	13464	191941	0.000000	0.000000	5086094	4894174
ERR3585071	15	0	15	0	0	191913	0.000000	0.000000	5096781	4904861
ERR3585075	34	14	20	2	0	191913	0.700000	0.100000	5096696	4904776
ERR3585081	13	12	1	2	0	191982	12.000000	2.000000	5096583	4904593
ERR3585083	13	13	0	2	0	191982	0.000000	0.000000	5095700	4903710
ERR3585085	16	14	2	2	0	191982	7.000000	1.000000	5096415	4904425
ERR3585086	1	0	1	0	0	191982	0.000000	0.000000	5096168	4904178
ERR3585127	20	18	2	2	0	191982	9.000000	1.000000	5096364	4904374
ERR3585138	4	0	4	0	0	191941	0.000000	0.000000	5084286	4892338
ERR3585141	16	11	5	1	0	191941	2.200000	0.200000	5084844	4892896
ERR3585164	7	5	2	1	0	191913	2.500000	0.500000	5093014	4901094
ERR3585166	3	0	3	0	0	191913	0.000000	0.000000	5092358	4900438
ERR3585168	9	7	2	2	0	191913	3.500000	1.000000	5095579	4903659
ERR3585169	8	4	4	1	0	191913	1.000000	0.250000	5092595	4900675
ERR3585170	11	7	4	1	0	191913	1.750000	0.250000	5092152	4900232
ERR3585171	56	50	6	2	0	191941	8.333333	0.333333	5084313	4892393
ERR3585173	8	0	8	0	0	191913	0.000000	0.000000	5092294	4900374
ERR3585175	19	17	2	3	0	191932	8.500000	1.500000	5092145	4900225
ERR3585210	53	52	1	2	0	191941	52.000000	2.000000	5081805	4889885
ERR3585217	0	0	0	0	0	191941	0.000000	0.000000	5084922	4892974
ERR3585220	7	6	1	1	0	191941	6.000000	1.000000	5084516	4892568
ERR3585259	4	0	4	0	0	191941	0.000000	0.000000	5084555	4892607
ERR3585260	15	14	1	1	0	191941	14.000000	1.000000	5085034	4893086
ERR3585262	10	8	2	1	0	191941	4.000000	0.500000	5084686	4892738
ERR3585263	0	0	0	0	0	191941	0.000000	0.000000	5085102	4893154
ERR3585269	56	51	5	2	0	191941	10.200000	0.400000	5084795	4892875
ERR3585364	8	3	5	1	0	191913	0.600000	0.200000	5095551	4903631
ERR3585365	10	9	1	2	0	191913	9.000000	2.000000	5095632	4903712
ERR3585395	20	18	2	2	0	191982	9.000000	1.000000	5095958	4903968
ERR3585398	13	11	2	2	0	191982	5.500000	1.000000	5095970	4903980
ERR3585405	35	29	6	3	0	191955	4.833333	0.500000	5087537	4895617
ERR3595903	13	12	1	2	0	191913	12.000000	2.000000	5095219	4903299
ERR3595905	6	4	2	1	0	191913	2.000000	0.500000	5096402	4904482
ERR3595946	2	0	2	0	0	191913	0.000000	0.000000	5095593	4903673
ERR3595950	7	6	1	1	0	191913	6.000000	1.000000	5096585	4904665
ERR3642039	29	28	1	2	0	191913	28.000000	2.000000	5094739	4902819
ERR3642042	5	3	2	1	0	191913	1.500000	0.500000	5095591	4903671
ERR3642062	13	13	0	3	0	191913	0.000000	0.000000	5095524	4903604
ERR3642070	15	13	2	2	0	191913	6.500000	1.000000	5100085	4908165
ERR3642151	15	11	4	2	0	191913	2.750000	0.500000	5095610	4903690
ERR3642156	16	8	8	1	0	192285	1.000000	0.125000	5095240	4903320
ERR3642309	6	4	2	1	0	191913	2.000000	0.500000	5095762	4903842
ERR3642314	7	5	2	1	0	191913	2.500000	0.500000	5096958	4905038
ERR3642318	0	0	0	0	0	191941	0.000000	0.000000	5085108	4893160
ERR3642324	13	11	2	1	0	191941	5.500000	0.500000	5085728	4893780
ERR3642376	20	19	1	1	0	191941	19.000000	1.000000	5086000	4894052
ERR3642382	3	3	0	1	0	191941	0.000000	0.000000	5085087	4893139
ERR3655957	15	15	0	2	0	191913	0.000000	0.000000	5096530	4904610
ERR3655959	10	6	4	1	0	191913	1.500000	0.250000	5096613	4904693
020222-265503	6	0	6	0	0	85587	0.000000	0.000000	5179824	5094230
031121-292908	233	222	11	2	0	192010	20.181818	0.181818	5144077	4952059
040921-192780	4	3	1	1	0	192010	3.000000	1.000000	5144990	4952972
040921-295702	152	149	3	2	0	192010	49.666668	0.666667	5143649	4951631
050921-293391	168	165	3	3	0	192010	55.000000	1.000000	5143262	4951244
051021-196897	2	0	2	0	0	106086	0.000000	0.000000	5157243	5051148
060821-199599	3	0	3	0	0	192010	0.000000	0.000000	5138486	4946468
060821-296570	9	8	1	2	0	192010	8.000000	2.000000	5139061	4947043
060921-295953	3	0	3	0	0	192010	0.000000	0.000000	5143269	4951251
060921-725171	12	6	6	2	39300	92071	1.000000	0.333333	5176377	5084304
061021-140903	4	0	4	0	0	92065	0.000000	0.000000	5177434	5085361
070821-296696	15	12	3	1	0	192010	4.000000	0.333333	5139186	4947168
070921-296138	159	157	2	3	0	192010	78.500000	1.500000	5143060	4951042
070921-296159	7	4	3	1	0	192010	1.333333	0.333333	5142896	4950878
070921-990805	12	7	5	2	0	192010	1.400000	0.400000	5139252	4947234
080821-290142	0	0	0	0	0	92065	0.000000	0.000000	5177009	5084936
080821-290158	8	3	5	1	0	192010	0.600000	0.200000	5137339	4945321
080821-296772	7	3	4	1	0	192010	0.750000	0.250000	5139449	4947431
090821-145449	6	3	3	1	0	92071	1.000000	0.333333	5178312	5086239
090921-296394	247	242	5	3	0	192010	48.400002	0.600000	5142139	4950121
100821-145645	17	12	5	3	0	192010	2.400000	0.600000	5139353	4947335
100821-145690	78	6	72	1	0	92065	0.083333	0.013889	5171945	5079872
100821-491655	10	9	1	2	0	192010	9.000000	2.000000	5138974	4946956
110122-572342	5	3	2	1	0	85590	1.500000	0.500000	5179984	5094390
110921-193849	17	13	4	2	0	192010	3.250000	0.500000	5140243	4948225
120921-296916	262	260	2	4	13464	192010	130.000000	2.000000	5141300	4949282
130921-496635	168	165	3	3	0	192033	55.000000	1.000000	5142832	4950814
150821-290944	5	0	5	0	0	192010	0.000000	0.000000	5139236	4947218
151021-142662	2	0	2	0	0	92065	0.000000	0.000000	5177470	5085397
160821-492364	21	14	7	2	0	192010	2.000000	0.285714	5138204	4946186
161021-142869	18	9	9	1	0	92065	1.000000	0.111111	5177538	5085465
161221-291441	27	6	21	2	60680	85923	0.285714	0.095238	5179322	5094004
170322-297699	5	3	2	1	0	140653	1.500000	0.500000	5176785	5036127
171021-565730	4	3	1	1	0	192010	3.000000	1.000000	5140836	4948818
171221-140561	9	0	9	0	0	140653	0.000000	0.000000	5176516	5035858
171221-447779	5	0	5	0	0	140653	0.000000	0.000000	5175498	5034840
180921-297656	1	0	1	0	0	192010	0.000000	0.000000	5138700	4946682
190721-489228	2	0	2	0	0	192010	0.000000	0.000000	5138348	4946330
200222-149709	132	122	10	2	0	192010	12.200000	0.200000	5139091	4947073
201021-440405	5	0	5	0	0	192490	0.000000	0.000000	5143204	4950705
210821-190577	6	3	3	1	0	192010	1.000000	0.333333	5138984	4946966
210821-725904	5	0	5	0	0	106086	0.000000	0.000000	5156086	5049991
210921-149256	79	74	5	3	22844	111916	14.800000	0.600000	5142031	5035936
230721-489585	7	3	4	1	0	192010	0.750000	0.250000	5139066	4947048
230821-299187	2	0	2	0	0	192010	0.000000	0.000000	5139299	4947281
230921-298348	6	0	6	0	0	192010	0.000000	0.000000	5143059	4951041
240821-148607	9	0	9	0	0	106086	0.000000	0.000000	5158290	5052195
240821-190972	7	0	7	0	0	92065	0.000000	0.000000	5164180	5072107
240921-289529	21	16	5	2	0	192490	3.200000	0.400000	5142432	4949933
250122-294990	9	0	9	0	0	192010	0.000000	0.000000	5139182	4947164
250721-198666	5	3	2	1	0	92071	1.500000	0.500000	5176548	5084475
250821-291998	14	9	5	2	0	192010	1.800000	0.400000	5145907	4953889
250821-292029	3	0	3	0	0	192010	0.000000	0.000000	5139201	4947183
280721-490181	7	7	0	2	0	192010	0.000000	0.000000	5138368	4946350
280821-191596	19	14	5	3	0	192010	2.800000	0.600000	5167711	4975693
290721-490280	10	7	3	2	39300	92066	2.333333	0.666667	5175756	5083683
290721-490285	14	9	5	2	0	192010	1.800000	0.400000	5138859	4946841
290721-490315	16	13	3	3	0	192010	4.333333	1.000000	5138738	4946720
290821-292554	11	4	7	1	0	192010	0.571429	0.142857	5139867	4947849
291121-289727	163	152	11	2	0	192010	13.818182	0.181818	5143022	4951004
300921-299299	2	0	2	0	0	192010	0.000000	0.000000	5134363	4942345
310122-295305	7	0	7	0	0	140653	0.000000	0.000000	5175391	5034733
ERR4244675	55	50	5	3	51059	105065	10.000000	0.600000	5059917	4967874
ERR4244677	30	26	4	3	44625	125669	6.500000	0.750000	5073299	4973879
ERR4244680	22	20	2	2	45809	75936	10.000000	1.000000	5079464	5009402
ERR4244681	18	17	1	3	67556	70063	17.000000	3.000000	5043620	4973558
ERR4244682	24	17	7	1	6488	70057	2.428571	0.142857	5048358	4978296
ERR4244683	20	16	4	2	21380	107517	4.000000	0.500000	5031209	4931789
ERR4244684	13	8	5	2	21380	102450	1.600000	0.400000	4969803	4870383
Reference	1797	1674	123	6	118106	118106	13.609756	0.048780	5312206	5312206
Node_1	6	0	6	0	0	92065	0.000000	0.000000	5179086	5087013
Node_2	2	0	2	0	0	92065	0.000000	0.000000	5179494	5087421
Node_3	0	0	0	0	0	92065	0.000000	0.000000	5179586	5087513
Node_4	1	0	1	0	0	92065	0.000000	0.000000	5179665	5087592
Node_5	3	0	3	0	0	92065	0.000000	0.000000	5179738	5087665
Node_6	0	0	0	0	0	92065	0.000000	0.000000	5179761	5087688
Node_7	0	0	0	0	0	92065	0.000000	0.000000	5179939	5087866
Node_8	2	0	2	0	0	92065	0.000000	0.000000	5179967	5087894
Node_9	31	6	25	2	39300	92065	0.240000	0.080000	5180104	5088068
Node_10	0	0	0	0	0	106086	0.000000	0.000000	5159385	5053290
Node_11	1	0	1	0	0	106086	0.000000	0.000000	5160422	5054327
Node_12	82	61	21	4	53490	106086	2.904762	0.190476	5160508	5068465
Node_13	8	3	5	1	0	92036	0.600000	0.200000	5191294	5099258
Node_14	18	16	2	2	60680	92030	8.000000	1.000000	5192235	5106917
Node_15	0	0	0	0	0	85311	0.000000	0.000000	5192237	5106919
Node_16	41	21	20	2	60680	85587	1.050000	0.100000	5181240	5095922
Node_17	41	24	17	2	60680	85311	1.411765	0.117647	5192713	5117559
Node_18	3	0	3	0	0	140653	0.000000	0.000000	5177334	5036676
Node_19	11	0	11	0	0	140653	0.000000	0.000000	5177584	5036926
Node_20	592	567	25	4	56297	140653	22.680000	0.160000	5179925	5080505
Node_21	1	0	1	0	0	99414	0.000000	0.000000	5132955	5033535
Node_22	0	0	0	0	0	99414	0.000000	0.000000	5152372	5052952
Node_23	184	137	47	4	72688	99414	2.914894	0.085106	5201903	5126749
Node_24	259	195	64	6	75148	75148	3.046875	0.093750	5205429	5205429
Node_25	0	0	0	0	0	0	0.000000	0.000000	5312206	5312206
Node_26	3	0	3	0	0	70057	0.000000	0.000000	5113192	5043130
Node_27	0	0	0	0	0	70057	0.000000	0.000000	5141188	5071126
Node_28	16	7	9	2	0	191913	0.777778	0.222222	5096491	4904571
Node_29	1	0	1	0	0	191913	0.000000	0.000000	5097365	4905445
Node_30	6	6	0	1	0	191913	0.000000	0.000000	5097809	4905889
Node_31	0	0	0	0	0	191913	0.000000	0.000000	5097864	4905944
Node_32	4	0	4	0	0	191913	0.000000	0.000000	5097514	4905594
Node_33	0	0	0	0	0	191913	0.000000	0.000000	5098466	4906546
Node_34	10	9	1	2	0	191913	9.000000	2.000000	5098791	4906871
Node_35	4	0	4	0	0	191913	0.000000	0.000000	5097886	4905966
Node_36	0	0	0	0	0	191913	0.000000	0.000000	5099088	4907168
Node_37	1	0	1	0	0	191941	0.000000	0.000000	5086235	4894287
Node_38	3	3	0	1	0	191941	0.000000	0.000000	5087111	4895163
Node_39	66	61	5	3	0	191941	12.200000	0.600000	5087525	4895605
Node_40	4	0	4	0	0	191913	0.000000	0.000000	5096656	4904736
Node_41	0	0	0	0	0	191913	0.000000	0.000000	5093408	4901488
Node_42	4	4	0	1	0	191913	0.000000	0.000000	5093821	4901901
Node_43	3	0	3	0	0	191913	0.000000	0.000000	5094620	4902700
Node_44	1	0	1	0	0	191913	0.000000	0.000000	5094920	4903000
Node_45	3	0	3	0	0	191913	0.000000	0.000000	5095004	4903084
Node_46	0	0	0	0	0	191913	0.000000	0.000000	5098244	4906324
Node_47	0	0	0	0	0	191913	0.000000	0.000000	5098320	4906400
Node_48	2	0	2	0	0	191913	0.000000	0.000000	5098469	4906549
Node_49	6	4	2	1	0	191913	2.000000	0.500000	5096055	4904135
Node_50	2	0	2	0	0	191913	0.000000	0.000000	5096537	4904617
Node_51	10	8	2	2	0	191913	4.000000	1.000000	5098652	4906732
Node_52	0	0	0	0	0	191913	0.000000	0.000000	5099139	4907219
Node_53	1	0	1	0	0	191913	0.000000	0.000000	5099200	4907280
Node_54	1	0	1	0	0	191913	0.000000	0.000000	5097801	4905881
Node_55	7	7	0	1	0	191913	0.000000	0.000000	5099442	4907522
Node_56	0	0	0	0	0	191913	0.000000	0.000000	5099476	4907556
Node_57	0	0	0	0	0	191913	0.000000	0.000000	5099486	4907566
Node_58	8	4	4	1	0	191941	1.000000	0.250000	5086180	4894232
Node_59	8	4	4	1	0	191941	1.000000	0.250000	5085835	4893887
Node_60	1	0	1	0	0	191941	0.000000	0.000000	5086747	4894799
Node_61	9	8	1	1	0	191941	8.000000	1.000000	5085762	4893814
Node_62	0	0	0	0	0	191941	0.000000	0.000000	5087229	4895281
Node_63	1	0	1	0	0	191941	0.000000	0.000000	5086006	4894058
Node_64	2	0	2	0	0	191941	0.000000	0.000000	5086404	4894456
Node_65	0	0	0	0	0	191941	0.000000	0.000000	5086509	4894561
Node_66	63	61	2	2	0	191941	30.500000	1.000000	5087526	4895606
Node_67	2	0	2	0	0	191913	0.000000	0.000000	5098637	4906717
Node_68	2	0	2	0	0	191913	0.000000	0.000000	5099919	4907999
Node_69	7	0	7	0	0	191913	0.000000	0.000000	5100121	4908201
Node_70	6	0	6	0	0	192010	0.000000	0.000000	5141587	4949569
Node_71	19	14	5	2	0	192010	2.800000	0.400000	5141224	4949206
Node_72	0	0	0	0	0	192010	0.000000	0.000000	5140357	4948339
Node_73	6	0	6	0	0	192010	0.000000	0.000000	5140906	4948888
Node_74	0	0	0	0	0	192010	0.000000	0.000000	5141552	4949534
Node_75	13	8	5	1	0	192010	1.600000	0.200000	5140296	4948278
Node_76	8	0	8	0	0	192010	0.000000	0.000000	5141825	4949807
Node_77	167	160	7	3	0	192010	22.857143	0.428571	5144456	4952438
Node_78	0	0	0	0	0	192010	0.000000	0.000000	5147991	4955973
Node_79	222	219	3	3	0	192010	73.000000	1.000000	5146386	4954368
Node_80	0	0	0	0	0	192010	0.000000	0.000000	5147982	4955964
Node_81	1	0	1	0	0	192010	0.000000	0.000000	5148649	4956631
Node_82	0	0	0	0	0	192010	0.000000	0.000000	5148964	4956946
Node_83	0	0	0	0	0	192010	0.000000	0.000000	5149343	4957325
Node_84	0	0	0	0	0	192010	0.000000	0.000000	5147567	4955549
Node_85	2	0	2	0	0	192010	0.000000	0.000000	5149533	4957515
Node_86	0	0	0	0	0	192010	0.000000	0.000000	5149563	4957545
Node_87	0	0	0	0	0	192010	0.000000	0.000000	5147080	4955062
Node_88	3	0	3	0	0	192010	0.000000	0.000000	5147594	4955576
Node_89	4	0	4	0	0	192010	0.000000	0.000000	5149631	4957613
Node_90	0	0	0	0	0	192010	0.000000	0.000000	5149637	4957619
Node_91	0	0	0	0	0	192010	0.000000	0.000000	5149663	4957645
Node_92	0	0	0	0	0	192010	0.000000	0.000000	5149792	4957774
Node_93	1	0	1	0	0	192010	0.000000	0.000000	5149827	4957809
Node_94	0	0	0	0	0	192010	0.000000	0.000000	5149859	4957841
Node_95	0	0	0	0	0	192010	0.000000	0.000000	5150024	4958006
Node_96	0	0	0	0	0	192010	0.000000	0.000000	5140447	4948429
Node_97	0	0	0	0	0	192010	0.000000	0.000000	5150035	4958017
Node_98	15	13	2	1	0	192010	6.500000	0.500000	5147631	4955613
Node_99	3	3	0	1	0	192010	0.000000	0.000000	5171123	4979105
Node_100	4	3	1	1	0	192010	3.000000	1.000000	5172874	4980856
Node_101	0	0	0	0	0	192010	0.000000	0.000000	5172901	4980883
Node_102	5	0	5	0	0	192010	0.000000	0.000000	5172903	4980885
Node_103	0	0	0	0	0	192010	0.000000	0.000000	5172914	4980896
Node_104	9	0	9	0	0	192010	0.000000	0.000000	5172916	4980898
Node_105	0	0	0	0	0	192010	0.000000	0.000000	5172959	4980941
Node_106	151	147	4	3	0	192490	36.750000	0.750000	5144021	4952003
Node_107	130	120	10	2	0	192010	12.000000	0.200000	5142801	4950783
Node_108	0	0	0	0	0	192010	0.000000	0.000000	5151164	4959146
Node_109	307	291	16	7	120025	192010	18.187500	0.437500	5173729	4981739
Node_110	2	0	2	0	0	191982	0.000000	0.000000	5097406	4905416
Node_111	5	4	1	1	0	191982	4.000000	1.000000	5097449	4905459
Node_112	0	0	0	0	0	191982	0.000000	0.000000	5098165	4906175
Node_113	0	0	0	0	0	191982	0.000000	0.000000	5098592	4906602
Node_114	0	0	0	0	0	191982	0.000000	0.000000	5099106	4907116
Node_115	2	0	2	0	0	191982	0.000000	0.000000	5099196	4907206
Node_116	0	0	0	0	0	191982	0.000000	0.000000	5099234	4907244
Node_117	5	3	2	1	0	191982	1.500000	0.500000	5097322	4905332
Node_118	0	0	0	0	0	191982	0.000000	0.000000	5099372	4907382
Node_119	12	7	5	2	0	191982	1.400000	0.400000	5181150	4989230
Node_120	1	0	1	0	0	191913	0.000000	0.000000	5181432	4989512
Node_121	0	0	0	0	0	191913	0.000000	0.000000	5182025	4990105
Node_122	6	5	1	1	0	191913	5.000000	1.000000	5096944	4905024
Node_123	1	0	1	0	0	191913	0.000000	0.000000	5097420	4905500
Node_124	0	0	0	0	0	191913	0.000000	0.000000	5097252	4905332
Node_125	0	0	0	0	0	191913	0.000000	0.000000	5098136	4906216
Node_126	1	0	1	0	0	191913	0.000000	0.000000	5096685	4904765
Node_127	14	13	1	1	0	191913	13.000000	1.000000	5097845	4905925
Node_128	0	0	0	0	0	191913	0.000000	0.000000	5124735	4932815
Node_129	0	0	0	0	0	191913	0.000000	0.000000	5097686	4905766
Node_130	9	4	5	1	0	191913	0.800000	0.200000	5125263	4933343
Node_131	6	0	6	0	0	191913	0.000000	0.000000	5125698	4933778
Node_132	0	0	0	0	0	191913	0.000000	0.000000	5183873	4991953
Node_133	14	12	2	1	0	191913	6.000000	0.500000	5183917	4991997
Node_134	1325	1293	32	8	168245	191913	40.406250	0.250000	5183920	5113858
Node_135	371	239	132	5	70057	70057	1.810606	0.037879	5188800	5188800
Node_136	0	0	0	0	0	0	0.000000	0.000000	5312206	5312206
