sample_ID	Yersiniabactin	Bla_acquired	Bla_ESBL_acquired	Bla_Carb_acquired	Omp_mutations	Bla_chr_AMP	Col_mutations	Flq_acquired	Flq_mutations	MLS_acquired	Phe_acquired	Rif_acquired	Sul_acquired	Tet_acquired	Tmt_acquired
020222-265503	ybt 9; ICEKp3	OXA-1;TEM-1D.v1	CTX-M-15	OXA-48	OmpK35-trunc;OmpK36TD	SHV-1	AMR_N	AMR_Y	AMR_Y	AMR_N	AMR_N	AMR_N	AMR_Y	AMR_Y	AMR_Y
031121-292908	ybt 16; ICEKp12	OXA-1;TEM-1D.v1	CTX-M-15	OXA-181	OmpK35-trunc;OmpK36TD	SHV-1	AMR_N	AMR_Y	AMR_Y	AMR_Y	AMR_N	AMR_N	AMR_N	AMR_N	AMR_N
040921-192780	ybt 16; ICEKp12	OXA-1;TEM-1D.v1	CTX-M-15	OXA-181	OmpK35-trunc;OmpK36TD	SHV-1	AMR_N	AMR_Y	AMR_Y	AMR_Y	AMR_N	AMR_N	AMR_N	AMR_N	AMR_N
040921-295702	ybt 16; ICEKp12	OXA-1;TEM-1D.v1	CTX-M-15	OXA-181	OmpK35-trunc;OmpK36TD	SHV-1	AMR_N	AMR_Y	AMR_Y	AMR_Y	AMR_N	AMR_N	AMR_N	AMR_N	AMR_N
050921-293391	ybt 16; ICEKp12	OXA-1;TEM-1D.v1	CTX-M-15	OXA-181	OmpK35-trunc;OmpK36TD	SHV-1	AMR_N	AMR_Y	AMR_Y	AMR_Y	AMR_N	AMR_N	AMR_N	AMR_N	AMR_N
051021-196897	ybt 9; ICEKp3	OXA-1;TEM-1D.v1	CTX-M-15	OXA-48	OmpK35-trunc;OmpK36TD	SHV-1	MgrB-trunc	AMR_Y	AMR_Y	AMR_N	AMR_N	AMR_N	AMR_Y	AMR_Y	AMR_Y
060821-199599	ybt 16; ICEKp12	OXA-1;TEM-1D.v1	CTX-M-15	OXA-181	OmpK35-trunc;OmpK36TD	SHV-1	AMR_N	AMR_Y	AMR_Y	AMR_Y	AMR_N	AMR_N	AMR_N	AMR_N	AMR_N
060821-296570	ybt 16; ICEKp12	OXA-1;TEM-1D.v1	CTX-M-15	OXA-181	OmpK35-trunc;OmpK36TD	SHV-1	AMR_N	AMR_Y	AMR_Y	AMR_Y	AMR_N	AMR_N	AMR_N	AMR_N	AMR_N
060921-295953	ybt 16; ICEKp12	OXA-1;TEM-1D.v1	CTX-M-15	OXA-181	OmpK35-trunc;OmpK36TD	SHV-1	AMR_N	AMR_Y	AMR_Y	AMR_Y	AMR_N	AMR_N	AMR_N	AMR_N	AMR_N
060921-725171	ybt 9; ICEKp3	OXA-1;TEM-1D.v1	CTX-M-15	OXA-48	OmpK35-trunc;OmpK36TD	SHV-1	AMR_N	AMR_Y	AMR_Y	AMR_N	AMR_N	AMR_N	AMR_Y	AMR_Y	AMR_Y
061021-140903	ybt 9; ICEKp3	OXA-1;TEM-1D.v1	CTX-M-15	OXA-48	OmpK35-trunc;OmpK36TD	SHV-1	MgrB-trunc	AMR_Y	AMR_Y	AMR_N	AMR_N	AMR_N	AMR_Y	AMR_Y	AMR_Y
070821-296696	ybt 16; ICEKp12	OXA-1;TEM-1D.v1	CTX-M-15	OXA-181	OmpK35-trunc;OmpK36TD	SHV-1	AMR_N	AMR_Y	AMR_Y	AMR_Y	AMR_N	AMR_N	AMR_N	AMR_N	AMR_N
070921-296138	ybt 16; ICEKp12	OXA-1;TEM-1D.v1	CTX-M-15	OXA-181	OmpK35-trunc;OmpK36TD	SHV-1	AMR_N	AMR_Y	AMR_Y	AMR_Y	AMR_N	AMR_N	AMR_N	AMR_N	AMR_N
070921-296159	ybt 16; ICEKp12	OXA-1;TEM-1D.v1	CTX-M-15	OXA-181	OmpK35-trunc;OmpK36TD	SHV-1	AMR_N	AMR_Y	AMR_Y	AMR_Y	AMR_N	AMR_N	AMR_N	AMR_N	AMR_N
070921-990805	ybt 16; ICEKp12	OXA-1;TEM-1D.v1	CTX-M-15	OXA-181	OmpK35-trunc;OmpK36TD	SHV-1	AMR_N	AMR_Y	AMR_Y	AMR_Y	AMR_N	AMR_N	AMR_N	AMR_N	AMR_N
080821-290142	ybt 9; ICEKp3	OXA-1;TEM-1D.v1	CTX-M-15	OXA-48	OmpK35-trunc;OmpK36TD	SHV-1	AMR_N	AMR_Y	AMR_Y	AMR_N	AMR_N	AMR_N	AMR_Y	AMR_Y	AMR_Y
080821-290158	ybt 16; ICEKp12	OXA-1;TEM-1D.v1	CTX-M-15	OXA-181	OmpK35-trunc;OmpK36TD	SHV-1	AMR_N	AMR_Y	AMR_Y	AMR_Y	AMR_N	AMR_N	AMR_N	AMR_N	AMR_N
080821-296772	ybt 16; ICEKp12	OXA-1;TEM-1D.v1	CTX-M-15	OXA-181	OmpK35-trunc;OmpK36TD	SHV-1	AMR_N	AMR_Y	AMR_Y	AMR_Y	AMR_N	AMR_N	AMR_N	AMR_N	AMR_N
090821-145449	ybt 9; ICEKp3	OXA-1;TEM-1D.v1	CTX-M-15	OXA-48	OmpK35-trunc;OmpK36TD	SHV-1	AMR_N	AMR_Y	AMR_Y	AMR_N	AMR_N	AMR_N	AMR_Y	AMR_Y	AMR_Y
090921-296394	ybt 16; ICEKp12	OXA-1;TEM-1D.v1	CTX-M-15	OXA-181	OmpK35-trunc;OmpK36TD	SHV-1	AMR_N	AMR_Y	AMR_Y	AMR_Y	AMR_N	AMR_N	AMR_N	AMR_N	AMR_N
100821-145645	ybt 16; ICEKp12	OXA-1;TEM-1D.v1	CTX-M-15	OXA-181	OmpK35-trunc;OmpK36TD	SHV-1	AMR_N	AMR_Y	AMR_Y	AMR_Y	AMR_N	AMR_N	AMR_N	AMR_N	AMR_N
100821-145690	ybt 9; ICEKp3	OXA-1;TEM-1D.v1	CTX-M-15	OXA-48	OmpK35-trunc;OmpK36TD	SHV-1	MgrB-trunc	AMR_Y	AMR_Y	AMR_N	AMR_N	AMR_N	AMR_Y	AMR_Y	AMR_Y
100821-491655	ybt 16; ICEKp12	OXA-1;TEM-1D.v1	CTX-M-15	OXA-181	OmpK35-trunc;OmpK36TD	SHV-1	AMR_N	AMR_Y	AMR_Y	AMR_Y	AMR_N	AMR_N	AMR_Y	AMR_Y	AMR_Y
110122-572342	ybt 9; ICEKp3	OXA-1;TEM-1D.v1	CTX-M-15	OXA-48	OmpK35-trunc;OmpK36TD	SHV-1	AMR_N	AMR_Y	AMR_Y	AMR_N	AMR_N	AMR_N	AMR_Y	AMR_Y	AMR_Y
110921-193849	ybt 16; ICEKp12	OXA-1;TEM-1D.v1	CTX-M-15	OXA-181	OmpK35-trunc;OmpK36TD	SHV-1	AMR_N	AMR_Y	AMR_Y	AMR_Y	AMR_N	AMR_N	AMR_N	AMR_N	AMR_N
120921-296916	ybt 16; ICEKp12	TEM-1D.v1	CTX-M-15	OXA-181	OmpK35-trunc;OmpK36TD	SHV-1	AMR_N	AMR_Y	AMR_Y	AMR_Y	AMR_N	AMR_N	AMR_N	AMR_N	AMR_N
130921-496635	ybt 16; ICEKp12	OXA-1;TEM-1D.v1	CTX-M-15	OXA-181	OmpK35-trunc;OmpK36TD	SHV-1	AMR_N	AMR_Y	AMR_Y	AMR_Y	AMR_N	AMR_N	AMR_N	AMR_N	AMR_N
150821-290944	ybt 16; ICEKp12	OXA-1;TEM-1D.v1	CTX-M-15	OXA-181	OmpK35-trunc;OmpK36TD	SHV-1	AMR_N	AMR_Y	AMR_Y	AMR_Y	AMR_N	AMR_N	AMR_N	AMR_N	AMR_N
151021-142662	ybt 9; ICEKp3	OXA-1;TEM-1D.v1	CTX-M-15	OXA-48	OmpK35-trunc;OmpK36TD	SHV-1	MgrB-trunc	AMR_Y	AMR_Y	AMR_N	AMR_N	AMR_N	AMR_Y	AMR_Y	AMR_Y
160821-492364	ybt 16; ICEKp12	OXA-1;TEM-1D.v1	CTX-M-15	AMR_N	OmpK35-trunc;OmpK36TD	SHV-1	MgrB-trunc	AMR_Y	AMR_Y	AMR_N	AMR_N	AMR_N	AMR_Y	AMR_Y	AMR_Y
161021-142869	ybt 9; ICEKp3	OXA-1;TEM-1D.v1	CTX-M-15	OXA-48	OmpK35-trunc;OmpK36TD	SHV-1	MgrB-trunc	AMR_Y	AMR_Y	AMR_N	AMR_N	AMR_N	AMR_Y	AMR_Y	AMR_Y
161221-291441	ybt 9; ICEKp3	OXA-1;TEM-1D.v1	CTX-M-15	OXA-48	OmpK35-trunc;OmpK36TD	SHV-1	AMR_N	AMR_N	AMR_Y	AMR_N	AMR_N	AMR_N	AMR_Y	AMR_Y	AMR_Y
170322-297699	ybt 9; ICEKp3	AMR_N	CTX-M-15	NDM-4;OXA-181	OmpK35-trunc;OmpK36TD	SHV-1	AMR_N	AMR_Y	AMR_Y	AMR_Y	AMR_Y	AMR_Y	AMR_Y	AMR_Y	AMR_Y
171021-565730	ybt 16; ICEKp12	OXA-1;TEM-1D.v1	CTX-M-15	OXA-181	OmpK35-trunc;OmpK36TD	SHV-1	AMR_N	AMR_Y	AMR_Y	AMR_Y	AMR_N	AMR_N	AMR_Y	AMR_Y	AMR_Y
171221-140561	ybt 9; ICEKp3	AMR_N	CTX-M-15	NDM-4;OXA-181	OmpK35-trunc;OmpK36TD	SHV-1	AMR_N	AMR_Y	AMR_Y	AMR_Y	AMR_Y	AMR_Y	AMR_Y	AMR_Y	AMR_Y
171221-447779	ybt 9; ICEKp3	AMR_N	CTX-M-15	NDM-4;OXA-181	OmpK35-trunc;OmpK36TD	SHV-1	AMR_N	AMR_Y	AMR_Y	AMR_Y	AMR_Y	AMR_Y	AMR_Y	AMR_Y	AMR_Y
180921-297656	ybt 16; ICEKp12	OXA-1;TEM-1D.v1	CTX-M-15	OXA-181	OmpK35-trunc;OmpK36-trunc	SHV-1	AMR_N	AMR_Y	AMR_Y	AMR_Y	AMR_N	AMR_N	AMR_N	AMR_N	AMR_N
190721-489228	ybt 16; ICEKp12	OXA-1	CTX-M-15	OXA-181	OmpK35-trunc;OmpK36TD	SHV-1	AMR_N	AMR_Y	AMR_Y	AMR_Y	AMR_N	AMR_N	AMR_N	AMR_N	AMR_N
200222-149709	ybt 16; ICEKp12	OXA-1;TEM-1D.v1	CTX-M-15	NDM-4;OXA-181	OmpK35-trunc;OmpK36TD	SHV-1	AMR_N	AMR_Y	AMR_Y	AMR_N	AMR_N	AMR_N	AMR_N	AMR_N	AMR_N
201021-440405	ybt 16; ICEKp12	OXA-1;TEM-1D.v1	CTX-M-15	NDM-4;OXA-181	OmpK35-trunc;OmpK36TD	SHV-1	AMR_N	AMR_Y	AMR_Y	AMR_Y	AMR_N	AMR_N	AMR_N	AMR_N	AMR_N
210821-190577	ybt 16; ICEKp12	OXA-1;TEM-1D.v1	CTX-M-15	OXA-181	OmpK35-trunc;OmpK36TD	SHV-1	AMR_N	AMR_Y	AMR_Y	AMR_Y	AMR_N	AMR_N	AMR_N	AMR_N	AMR_N
210821-725904	ybt 9; ICEKp3	OXA-1;TEM-1D.v1	CTX-M-15	OXA-48	OmpK35-trunc;OmpK36TD	SHV-1	MgrB-trunc	AMR_Y	AMR_Y	AMR_N	AMR_N	AMR_N	AMR_Y	AMR_Y	AMR_Y
210921-149256	ybt 9; ICEKp3	OXA-1;TEM-1D.v1	CTX-M-15	OXA-48	OmpK35-trunc;OmpK36TD	SHV-1	MgrB-trunc	AMR_Y	AMR_Y	AMR_N	AMR_N	AMR_N	AMR_Y	AMR_Y	AMR_Y
230721-489585	ybt 16; ICEKp12	OXA-1;TEM-1D.v1	CTX-M-15	OXA-181	OmpK35-trunc;OmpK36TD	SHV-1	AMR_N	AMR_Y	AMR_Y	AMR_Y	AMR_N	AMR_N	AMR_N	AMR_N	AMR_N
230821-148372	ybt_none	OXA-1;TEM-1D.v1	CTX-M-15	NDM-4	OmpK35-trunc;OmpK36TD	SHV-1	AMR_N	AMR_Y	AMR_Y	AMR_Y	AMR_N	AMR_N	AMR_Y	AMR_Y	AMR_Y
230821-299187	ybt 16; ICEKp12	OXA-1;TEM-1D.v1	CTX-M-15	OXA-181	OmpK35-trunc;OmpK36TD	SHV-1	AMR_N	AMR_Y	AMR_Y	AMR_Y	AMR_N	AMR_N	AMR_N	AMR_N	AMR_N
230921-298348	ybt 16; ICEKp12	OXA-1;TEM-1D.v1	CTX-M-15	OXA-181	OmpK35-trunc;OmpK36TD	SHV-1	AMR_N	AMR_Y	AMR_Y	AMR_Y	AMR_N	AMR_N	AMR_N	AMR_N	AMR_N
240821-148607	ybt 9; ICEKp3	OXA-1;TEM-1D.v1	CTX-M-15	OXA-48	OmpK35-trunc;OmpK36TD	SHV-1	MgrB-trunc	AMR_Y	AMR_Y	AMR_N	AMR_N	AMR_N	AMR_Y	AMR_Y	AMR_Y
240821-190972	ybt 9; ICEKp3	OXA-1;TEM-1D.v1	CTX-M-15	OXA-48	OmpK35-trunc;OmpK36TD	SHV-1	MgrB-trunc	AMR_Y	AMR_Y	AMR_N	AMR_N	AMR_N	AMR_Y	AMR_Y	AMR_Y
240921-289529	ybt 16; ICEKp12	OXA-1;TEM-1D.v1	CTX-M-15	NDM-4;OXA-181	OmpK35-trunc;OmpK36TD	SHV-1	AMR_N	AMR_Y	AMR_Y	AMR_Y	AMR_N	AMR_N	AMR_N	AMR_N	AMR_N
250122-294990	ybt 16; ICEKp12	TEM-1D.v1	CTX-M-15	OXA-181	OmpK35-trunc;OmpK36TD	SHV-1	AMR_N	AMR_Y	AMR_Y	AMR_N	AMR_N	AMR_N	AMR_N	AMR_N	AMR_N
250721-198666	ybt 9; ICEKp3	OXA-1;TEM-1D.v1	CTX-M-15	OXA-48	OmpK35-trunc;OmpK36TD	SHV-1	AMR_N	AMR_Y	AMR_Y	AMR_N	AMR_N	AMR_N	AMR_Y	AMR_Y	AMR_Y
250821-291998	ybt 16; ICEKp12	OXA-1;TEM-1D.v1	CTX-M-15	OXA-181	OmpK35-trunc;OmpK36TD	SHV-1	AMR_N	AMR_Y	AMR_Y	AMR_Y	AMR_N	AMR_N	AMR_N	AMR_N	AMR_N
250821-292029	ybt 16; ICEKp12	OXA-1;TEM-1D.v1	CTX-M-15	OXA-181	OmpK35-trunc;OmpK36TD	SHV-1	AMR_N	AMR_Y	AMR_Y	AMR_Y	AMR_N	AMR_N	AMR_N	AMR_N	AMR_N
280721-490181	ybt 16; ICEKp12	OXA-1;TEM-1D.v1	CTX-M-15	OXA-181	OmpK35-trunc;OmpK36TD	SHV-1	AMR_N	AMR_Y	AMR_Y	AMR_Y	AMR_N	AMR_N	AMR_N	AMR_N	AMR_N
280821-191596	ybt 16; ICEKp12	OXA-1;TEM-1D.v1	CTX-M-15	OXA-181	OmpK35-trunc;OmpK36TD	SHV-1	AMR_N	AMR_Y	AMR_Y	AMR_Y	AMR_N	AMR_N	AMR_N	AMR_N	AMR_N
290721-490280	ybt 9; ICEKp3	OXA-1;TEM-1D.v1	CTX-M-15	AMR_N	OmpK35-trunc;OmpK36TD	SHV-1	AMR_N	AMR_Y	AMR_Y	AMR_N	AMR_N	AMR_N	AMR_Y	AMR_N	AMR_N
290721-490285	ybt 16; ICEKp12	OXA-1;TEM-1D.v1	CTX-M-15	OXA-181	OmpK35-trunc;OmpK36TD	SHV-1	AMR_N	AMR_Y	AMR_Y	AMR_Y	AMR_N	AMR_N	AMR_N	AMR_N	AMR_N
290721-490315	ybt 16; ICEKp12	OXA-1;TEM-1D.v1	CTX-M-15	OXA-181	OmpK35-trunc;OmpK36TD	SHV-1	AMR_N	AMR_Y	AMR_Y	AMR_Y	AMR_N	AMR_N	AMR_N	AMR_N	AMR_N
290821-292554	ybt 16; ICEKp12	TEM-1D.v1	AMR_N	NDM-4;OXA-181	OmpK35-trunc;OmpK36TD	SHV-1	AMR_N	AMR_Y	AMR_Y	AMR_Y	AMR_N	AMR_N	AMR_N	AMR_N	AMR_N
291121-289727	ybt 16; ICEKp12	OXA-1;TEM-1D.v1	CTX-M-15	OXA-181	OmpK35-trunc;OmpK36TD	SHV-1	AMR_N	AMR_Y	AMR_Y	AMR_Y	AMR_N	AMR_N	AMR_N	AMR_N	AMR_N
300921-299299	ybt 16; ICEKp12	TEM-1D.v1	AMR_N	NDM-4;OXA-181	OmpK35-trunc;OmpK36TD	SHV-1	AMR_N	AMR_Y	AMR_Y	AMR_Y	AMR_N	AMR_N	AMR_N	AMR_N	AMR_N
310122-295305	ybt 9; ICEKp3	TEM-1D.v1	CTX-M-15	NDM-4;OXA-181	OmpK35-trunc;OmpK36TD	SHV-1	AMR_N	AMR_Y	AMR_Y	AMR_Y	AMR_Y	AMR_N	AMR_N	AMR_Y	AMR_N
ERR4244675	ybt 9; ICEKp3-trunc	OXA-1;TEM-1D.v1	CTX-M-15	OXA-48	OmpK35-trunc;OmpK36TD	SHV-1	PmrB-trunc	AMR_Y	AMR_Y	AMR_N	AMR_Y	AMR_N	AMR_Y	AMR_Y	AMR_Y
ERR4244677	ybt 9; ICEKp3-trunc	TEM-1D.v1	CTX-M-15	OXA-181	OmpK35-trunc;OmpK36TD	SHV-1	AMR_N	AMR_Y	AMR_Y	AMR_Y	AMR_Y	AMR_Y	AMR_Y	AMR_Y	AMR_Y
ERR4244678	ybt_none	TEM-1	CTX-M-15	OXA-181	OmpK35-trunc;OmpK36-trunc	SHV-1	MgrB-trunc;PmrB-trunc	AMR_Y	AMR_Y	AMR_Y	AMR_N	AMR_Y	AMR_Y	AMR_Y	AMR_Y
ERR4244679	ybt unknown	TEM-1D.v1	AMR_N	OXA-181	OmpK35-trunc;OmpK36TD	SHV-1	PmrB-trunc	AMR_Y	AMR_Y	AMR_Y	AMR_Y	AMR_N	AMR_N	AMR_Y	AMR_N
ERR4244680	ybt 9; ICEKp3	AMR_N	AMR_N	OXA-181	OmpK35-trunc;OmpK36TD	SHV-1	MgrB-trunc	AMR_Y	AMR_Y	AMR_Y	AMR_N	AMR_N	AMR_N	AMR_N	AMR_N
ERR4244681	ybt 9; ICEKp3	AMR_N	AMR_N	OXA-181	OmpK35-trunc;OmpK36TD	SHV-1	MgrB-trunc	AMR_Y	AMR_Y	AMR_Y	AMR_N	AMR_N	AMR_N	AMR_N	AMR_N
ERR4244682	ybt 9; ICEKp3	AMR_N	AMR_N	AMR_N	OmpK35-trunc;OmpK36TD	SHV-1	MgrB-trunc	AMR_N	AMR_Y	AMR_Y	AMR_N	AMR_N	AMR_N	AMR_N	AMR_N
ERR4244683	ybt 9; ICEKp3-trunc	TEM-1D.v1	CTX-M-15	OXA-181	OmpK35-trunc;OmpK36TD	SHV-1	PmrB-trunc	AMR_Y	AMR_Y	AMR_Y	AMR_N	AMR_Y	AMR_Y	AMR_Y	AMR_Y
ERR4244684	ybt unknown	TEM-135.v1	CTX-M-15	OXA-181	OmpK35-trunc;OmpK36TD	AMR_N	PmrB-trunc	AMR_Y	AMR_Y	AMR_Y	AMR_Y	AMR_N	AMR_Y	AMR_Y	AMR_N
