{
  "projects": {
    "ionic-app1": {
      "integrations": {
        "cordova": {}
      },
      "type": "angular",
      "root": "projects/mobile-apps/ionic-app1"
    }
  },
  "integrations": {
    "cordova": {}
  }
}
