{
  "SERVER_ON": {
    "status": 200,
    "message": "Le serveur fonctionne"
  },
  "INVALID_DATA": {
    "status": 422,
    "message": "Les données fournies sont invalides ou incomplètes"
  },
  "USER_ALREADY_EXISTS": {
    "status": 403,
    "message": "L'utilisateur existe déjà. Veuillez vous connecter"
  },
  "USER_CREATED": {
    "status": 201,
    "message": "L'utilisateur a bien été crée."
  },
  "USERNAME_ALREADY_TAKEN": {
    "status": 403,
    "message": "Le nom d'utilisateur existe déjà. Veuillez en choisir un autre"
  },
  "USER_NOT_FOUND": {
    "status": 404,
    "message": "L'utilisateur n'a pas été trouvé"
  },
  "INVALID_PASSWORD": {
    "status": 401,
    "message": "Le mot de passe est incorrecte"
  },
  "USER_LOGGED": {
    "status": 200,
    "message": "L'utilisateur s'est bien connecté"
  },
  "FORBIDDEN_ACCESS": {
    "status": 403,
    "message": "L'accées est interdit. Veuillez vous connecter."
  },
  "COMPETITIONS_DETAILS_RETRIEVED": {
    "status": 200,
    "message": "Les détails de la compétitions ont été récupérés"
  },
  "COMPETITIONS_TEAMS_RETRIEVED": {
    "status": 200,
    "message": "Les équipes de la compétitions ont été récupérées"
  },
  "COMPETITIONS_MATCHES_RETRIEVED": {
    "status": 200,
    "message": "Les matchs de la compétitions ont été récupérées"
  },
  "BETS_RETRIEVED": {
    "status": 200,
    "message": "Les paris ont été récupérées"
  },
  "BET_SAVED": {
    "status": 201,
    "message": "Les paris ont bien été sauvegardés."
  },
  "LEAGUES_RETRIEVED": {
    "status": 200,
    "message": "Les ligues ont bien été récupérées."
  },
  "LEAGUE_CREATED": {
    "status": 201,
    "message": "La ligue a bien été crée."
  },
  "LEAGUE_NAME_ALREADY_TAKEN": {
    "status": 403,
    "message": "Le nom de la ligue est déjà utilisé"
  },
  "LEAGUE_JOINED": {
    "status": 200,
    "message": "L'utilisateur a rejoint la ligue"
  },
  "LEAGUE_DOES_NOT_EXIST": {
    "status": 404,
    "message": "La ligue demandé n'existe pas."
  },
  "USER_ALREADY_REGISTERED_IN_LEAGUE": {
    "status": 403,
    "message": "L'utilisateur a déjà rejoins la ligue"
  },
  "LEAGUE_STANDING_RETRIEVED": {
    "status": 200,
    "message": "Le classement de la ligue a bien été récupéré."
  },
  "USER_RETRIEVED": {
    "status": 200,
    "message": "L'utilisateur a bien été récupéré."
  },
  "GOOGLE_RECAPTCHA_FAILURE": {
    "status": 403,
    "message": "Le captcha est incorrecte."
  },
  "LEAGUE_INVITE_SENT":{
    "status":200,
    "message":"Les invitations ont été envoyées."
  }
}
