// Jest Snapshot v1, https://goo.gl/fbAQLP

exports[`withAlarm should return a critical alarm 1`] = `
Object {
  "Resources": Object {
    "TheAlarmF06FB10C": Object {
      "Properties": Object {
        "AlarmActions": Array [
          "arn:aws:sns:us-west-2:12345678890:CriticalAlarmSnsArn",
        ],
        "AlarmName": "AwesomeAlarm",
        "ComparisonOperator": "GreaterThanOrEqualToThreshold",
        "EvaluationPeriods": 1,
        "MetricName": "Count",
        "Namespace": "Cocoa/Namespace",
        "Period": 300,
        "Statistic": "Average",
        "Threshold": 1,
      },
      "Type": "AWS::CloudWatch::Alarm",
    },
  },
}
`;

exports[`withAlarm should return a mild alarm 1`] = `
Object {
  "Resources": Object {
    "TheAlarmF06FB10C": Object {
      "Properties": Object {
        "AlarmActions": Array [
          "arn:aws:sns:us-west-2:12345678890:MildAlarmSnsArn",
        ],
        "AlarmName": "AwesomeAlarm",
        "ComparisonOperator": "GreaterThanOrEqualToThreshold",
        "EvaluationPeriods": 1,
        "MetricName": "Count",
        "Namespace": "Cocoa/Namespace",
        "Period": 300,
        "Statistic": "Average",
        "Threshold": 1,
      },
      "Type": "AWS::CloudWatch::Alarm",
    },
  },
}
`;

exports[`withApiGatewayErrorsAlarm should create an alarm for 4XX errors 1`] = `
Object {
  "Resources": Object {
    "CocoaRestApiTestAlarmF666320B": Object {
      "Properties": Object {
        "AlarmActions": Array [
          "arn:aws:sns:us-west-2:12345678890:CriticalAlarmSnsArn",
        ],
        "AlarmDescription": "Alarm description for Rest Api 4XX Errors",
        "AlarmName": "jiygflgxzg-4XXError",
        "ComparisonOperator": "GreaterThanOrEqualToThreshold",
        "DatapointsToAlarm": 1,
        "Dimensions": Array [
          Object {
            "Name": "ApiName",
            "Value": "Cocoa-Rest-Api-Test",
          },
        ],
        "EvaluationPeriods": 1,
        "MetricName": "4XXError",
        "Namespace": "AWS/ApiGateway",
        "Period": 300,
        "Statistic": "Sum",
        "Threshold": 100,
        "TreatMissingData": "notBreaching",
      },
      "Type": "AWS::CloudWatch::Alarm",
    },
  },
}
`;

exports[`withApiGatewayErrorsAlarm should create an alarm for 4XX errors and override props 1`] = `
Object {
  "Resources": Object {
    "CocoaRestApiTestAlarmF666320B": Object {
      "Properties": Object {
        "AlarmActions": Array [
          "arn:aws:sns:us-west-2:12345678890:CriticalAlarmSnsArn",
        ],
        "AlarmDescription": "Alarm description for Rest Api 4XX Errors",
        "AlarmName": "jiygflgxzg-4XXError",
        "ComparisonOperator": "GreaterThanOrEqualToThreshold",
        "DatapointsToAlarm": 1,
        "Dimensions": Array [
          Object {
            "Name": "ApiName",
            "Value": "Cocoa-Rest-Api-Test",
          },
        ],
        "EvaluationPeriods": 1,
        "MetricName": "4XXError",
        "Namespace": "AWS/ApiGateway",
        "Period": 300,
        "Statistic": "Sum",
        "Threshold": 100,
        "TreatMissingData": "ignore",
      },
      "Type": "AWS::CloudWatch::Alarm",
    },
  },
}
`;

exports[`withApiGatewayErrorsAlarm should create an alarm for 5XX errors 1`] = `
Object {
  "Resources": Object {
    "CocoaRestApiTestAlarmF666320B": Object {
      "Properties": Object {
        "AlarmActions": Array [
          "arn:aws:sns:us-west-2:12345678890:CriticalAlarmSnsArn",
        ],
        "AlarmDescription": "Alarm description for Rest Api 5XX Errors",
        "AlarmName": "jiygflgxzg-5XXError",
        "ComparisonOperator": "GreaterThanOrEqualToThreshold",
        "DatapointsToAlarm": 1,
        "Dimensions": Array [
          Object {
            "Name": "ApiName",
            "Value": "Cocoa-Rest-Api-Test",
          },
        ],
        "EvaluationPeriods": 1,
        "MetricName": "5XXError",
        "Namespace": "AWS/ApiGateway",
        "Period": 300,
        "Statistic": "Sum",
        "Threshold": 100,
        "TreatMissingData": "notBreaching",
      },
      "Type": "AWS::CloudWatch::Alarm",
    },
  },
}
`;

exports[`withApiGatewayErrorsAlarm should create an alarm for 5XX errors and override props 1`] = `
Object {
  "Resources": Object {
    "CocoaRestApiTestAlarmF666320B": Object {
      "Properties": Object {
        "AlarmActions": Array [
          "arn:aws:sns:us-west-2:12345678890:CriticalAlarmSnsArn",
        ],
        "AlarmDescription": "Alarm description for Rest Api 5XX Errors",
        "AlarmName": "jiygflgxzg-5XXError",
        "ComparisonOperator": "GreaterThanOrEqualToThreshold",
        "DatapointsToAlarm": 1,
        "Dimensions": Array [
          Object {
            "Name": "ApiName",
            "Value": "Cocoa-Rest-Api-Test",
          },
        ],
        "EvaluationPeriods": 1,
        "MetricName": "5XXError",
        "Namespace": "AWS/ApiGateway",
        "Period": 300,
        "Statistic": "Sum",
        "Threshold": 100,
        "TreatMissingData": "ignore",
      },
      "Type": "AWS::CloudWatch::Alarm",
    },
  },
}
`;

exports[`withFunctionAlarms should create an alarm for Http (5XX) errors 1`] = `
Object {
  "Resources": Object {
    "TestWrapperTestFunction5XX79A4A03C": Object {
      "Properties": Object {
        "AlarmActions": Array [
          "arn:aws:sns:us-west-2:12345678890:CriticalAlarmSnsArn",
        ],
        "AlarmDescription": "This alarm gets triggered when the function's: TestFunction http call in TestWrapper responds with 5XX errors",
        "AlarmName": "TestWrapper-TestFunction5XX",
        "ComparisonOperator": "GreaterThanOrEqualToThreshold",
        "DatapointsToAlarm": 1,
        "Dimensions": Array [
          Object {
            "Name": "Function",
            "Value": "TestFunction",
          },
        ],
        "EvaluationPeriods": 1,
        "MetricName": "5XX",
        "Namespace": "testNamespace",
        "Period": 300,
        "Statistic": "Sum",
        "Threshold": 1,
        "TreatMissingData": "notBreaching",
      },
      "Type": "AWS::CloudWatch::Alarm",
    },
  },
}
`;

exports[`withFunctionAlarms should create an alarm for Http (5XX) errors and override props 1`] = `
Object {
  "Resources": Object {
    "TestWrapperTestFunction5XX79A4A03C": Object {
      "Properties": Object {
        "AlarmActions": Array [
          "arn:aws:sns:us-west-2:12345678890:CriticalAlarmSnsArn",
        ],
        "AlarmDescription": "This alarm gets triggered when the function's: TestFunction http call in TestWrapper responds with 5XX errors",
        "AlarmName": "TestWrapper-TestFunction5XX",
        "ComparisonOperator": "GreaterThanOrEqualToThreshold",
        "DatapointsToAlarm": 1,
        "Dimensions": Array [
          Object {
            "Name": "Function",
            "Value": "TestFunction",
          },
        ],
        "EvaluationPeriods": 1,
        "MetricName": "5XX",
        "Namespace": "testNamespace",
        "Period": 120,
        "Statistic": "Sum",
        "Threshold": 1,
        "TreatMissingData": "ignore",
      },
      "Type": "AWS::CloudWatch::Alarm",
    },
  },
}
`;

exports[`withFunctionAlarms should create an alarm for count errors 1`] = `
Object {
  "Resources": Object {
    "TestWrapperTestFunctionCountF2735975": Object {
      "Properties": Object {
        "AlarmActions": Array [
          "arn:aws:sns:us-west-2:12345678890:CriticalAlarmSnsArn",
        ],
        "AlarmDescription": "This alarm gets triggered when the function: TestFunction in TestWrapper call count is in the alarm range",
        "AlarmName": "TestWrapper-TestFunctionCount",
        "ComparisonOperator": "GreaterThanOrEqualToThreshold",
        "DatapointsToAlarm": 1,
        "Dimensions": Array [
          Object {
            "Name": "Function",
            "Value": "TestFunction",
          },
        ],
        "EvaluationPeriods": 1,
        "MetricName": "Count",
        "Namespace": "testNamespace",
        "Period": 300,
        "Statistic": "Sum",
        "Threshold": 20,
        "TreatMissingData": "notBreaching",
      },
      "Type": "AWS::CloudWatch::Alarm",
    },
  },
}
`;

exports[`withFunctionAlarms should create an alarm for count errors and override props 1`] = `
Object {
  "Resources": Object {
    "TestWrapperTestFunctionCountF2735975": Object {
      "Properties": Object {
        "AlarmActions": Array [
          "arn:aws:sns:us-west-2:12345678890:CriticalAlarmSnsArn",
        ],
        "AlarmDescription": "This alarm gets triggered when the function: TestFunction in TestWrapper call count is in the alarm range",
        "AlarmName": "TestWrapper-TestFunctionCount",
        "ComparisonOperator": "GreaterThanOrEqualToThreshold",
        "DatapointsToAlarm": 1,
        "Dimensions": Array [
          Object {
            "Name": "Function",
            "Value": "TestFunction",
          },
        ],
        "EvaluationPeriods": 1,
        "MetricName": "Count",
        "Namespace": "testNamespace",
        "Period": 300,
        "Statistic": "Sum",
        "Threshold": 20,
        "TreatMissingData": "ignore",
      },
      "Type": "AWS::CloudWatch::Alarm",
    },
  },
}
`;

exports[`withLambdaErrorsAlarm should create an alarm for the specified lambda errors 1`] = `
Object {
  "Resources": Object {
    "CocoaTestHandlerAlarm25A4EC3D": Object {
      "Properties": Object {
        "AlarmActions": Array [
          "arn:aws:sns:us-west-2:12345678890:CriticalAlarmSnsArn",
        ],
        "AlarmDescription": "Alarm Description Test",
        "AlarmName": "arn:aws:lambda:us-west-2:435692684201:function:Cocoa-Test-Handler-Dev-HasErrors",
        "ComparisonOperator": "GreaterThanOrEqualToThreshold",
        "DatapointsToAlarm": 1,
        "Dimensions": Array [
          Object {
            "Name": "FunctionName",
            "Value": "Cocoa-Test-Handler-Dev",
          },
        ],
        "EvaluationPeriods": 1,
        "MetricName": "Errors",
        "Namespace": "AWS/Lambda",
        "Period": 300,
        "Statistic": "Sum",
        "Threshold": 1,
        "TreatMissingData": "notBreaching",
      },
      "Type": "AWS::CloudWatch::Alarm",
    },
  },
}
`;

exports[`withLambdaErrorsAlarm should create an alarm for the specified lambda errors and override props 1`] = `
Object {
  "Resources": Object {
    "CocoaTestHandlerAlarm25A4EC3D": Object {
      "Properties": Object {
        "AlarmActions": Array [
          "arn:aws:sns:us-west-2:12345678890:CriticalAlarmSnsArn",
        ],
        "AlarmDescription": "Alarm Description Test",
        "AlarmName": "arn:aws:lambda:us-west-2:435692684201:function:Cocoa-Test-Handler-Dev-HasErrors",
        "ComparisonOperator": "GreaterThanOrEqualToThreshold",
        "DatapointsToAlarm": 2,
        "Dimensions": Array [
          Object {
            "Name": "FunctionName",
            "Value": "Cocoa-Test-Handler-Dev",
          },
        ],
        "EvaluationPeriods": 2,
        "MetricName": "Errors",
        "Namespace": "AWS/Lambda",
        "Period": 300,
        "Statistic": "Sum",
        "Threshold": 1,
        "TreatMissingData": "notBreaching",
      },
      "Type": "AWS::CloudWatch::Alarm",
    },
  },
}
`;

exports[`withProjectionDLQAlarm should create an alarm for the specified DLQ 1`] = `
Object {
  "Resources": Object {
    "TestDLQAlarmC8456975": Object {
      "Properties": Object {
        "AlarmActions": Array [
          "arn:aws:sns:us-west-2:12345678890:CriticalAlarmSnsArn",
        ],
        "AlarmDescription": "Critical alarm. This should never get triggered. Finding messages in this queue means that the projection might be outdated/out of sync.",
        "AlarmName": "ProjectionDLQ-HasMessages",
        "ComparisonOperator": "GreaterThanOrEqualToThreshold",
        "DatapointsToAlarm": 1,
        "Dimensions": Array [
          Object {
            "Name": "QueueName",
            "Value": "TestDLQ",
          },
        ],
        "EvaluationPeriods": 1,
        "MetricName": "ApproximateNumberOfMessagesVisible",
        "Namespace": "AWS/SQS",
        "Period": 60,
        "Statistic": "Sum",
        "Threshold": 1,
        "TreatMissingData": "notBreaching",
      },
      "Type": "AWS::CloudWatch::Alarm",
    },
  },
}
`;

exports[`withSqsAlarm should create an alarm for the specified SQS 1`] = `
Object {
  "Resources": Object {
    "TestDLQAlarmC8456975": Object {
      "Properties": Object {
        "AlarmActions": Array [
          "arn:aws:sns:us-west-2:12345678890:CriticalAlarmSnsArn",
        ],
        "AlarmDescription": "DLQ Alarm description",
        "AlarmName": "SQS-HasMessages",
        "ComparisonOperator": "GreaterThanOrEqualToThreshold",
        "DatapointsToAlarm": 1,
        "Dimensions": Array [
          Object {
            "Name": "QueueName",
            "Value": "TestDLQ",
          },
        ],
        "EvaluationPeriods": 1,
        "MetricName": "ApproximateNumberOfMessagesVisible",
        "Namespace": "AWS/SQS",
        "Period": 60,
        "Statistic": "Sum",
        "Threshold": 1,
        "TreatMissingData": "notBreaching",
      },
      "Type": "AWS::CloudWatch::Alarm",
    },
  },
}
`;
