// Jest Snapshot v1, https://goo.gl/fbAQLP

exports[`vpc should create a vpc peering connection 1`] = `
Object {
  "Resources": Object {
    "FromVpcCDC4218A": Object {
      "Properties": Object {
        "CidrBlock": "10.0.0.0/24",
        "EnableDnsHostnames": true,
        "EnableDnsSupport": true,
        "InstanceTenancy": "default",
        "Tags": Array [
          Object {
            "Key": "Name",
            "Value": "TestStack/FromVpc",
          },
        ],
      },
      "Type": "AWS::EC2::VPC",
    },
    "FromVpcIGW575A78E7": Object {
      "Properties": Object {
        "Tags": Array [
          Object {
            "Key": "Name",
            "Value": "TestStack/FromVpc",
          },
        ],
      },
      "Type": "AWS::EC2::InternetGateway",
    },
    "FromVpcVPCGW08AE23E3": Object {
      "Properties": Object {
        "InternetGatewayId": Object {
          "Ref": "FromVpcIGW575A78E7",
        },
        "VpcId": Object {
          "Ref": "FromVpcCDC4218A",
        },
      },
      "Type": "AWS::EC2::VPCGatewayAttachment",
    },
    "FromVpcingressSubnet1DefaultRouteB15D565D": Object {
      "DependsOn": Array [
        "FromVpcVPCGW08AE23E3",
      ],
      "Properties": Object {
        "DestinationCidrBlock": "0.0.0.0/0",
        "GatewayId": Object {
          "Ref": "FromVpcIGW575A78E7",
        },
        "RouteTableId": Object {
          "Ref": "FromVpcingressSubnet1RouteTableCD16EE45",
        },
      },
      "Type": "AWS::EC2::Route",
    },
    "FromVpcingressSubnet1RouteTableAssociation7E09A35D": Object {
      "Properties": Object {
        "RouteTableId": Object {
          "Ref": "FromVpcingressSubnet1RouteTableCD16EE45",
        },
        "SubnetId": Object {
          "Ref": "FromVpcingressSubnet1Subnet3225C7AE",
        },
      },
      "Type": "AWS::EC2::SubnetRouteTableAssociation",
    },
    "FromVpcingressSubnet1RouteTableCD16EE45": Object {
      "Properties": Object {
        "Tags": Array [
          Object {
            "Key": "Name",
            "Value": "TestStack/FromVpc/ingressSubnet1",
          },
        ],
        "VpcId": Object {
          "Ref": "FromVpcCDC4218A",
        },
      },
      "Type": "AWS::EC2::RouteTable",
    },
    "FromVpcingressSubnet1Subnet3225C7AE": Object {
      "Properties": Object {
        "AvailabilityZone": Object {
          "Fn::Select": Array [
            0,
            Object {
              "Fn::GetAZs": "",
            },
          ],
        },
        "CidrBlock": "10.0.0.0/28",
        "MapPublicIpOnLaunch": true,
        "Tags": Array [
          Object {
            "Key": "aws-cdk:subnet-name",
            "Value": "ingress",
          },
          Object {
            "Key": "aws-cdk:subnet-type",
            "Value": "Public",
          },
          Object {
            "Key": "Name",
            "Value": "TestStack/FromVpc/ingressSubnet1",
          },
        ],
        "VpcId": Object {
          "Ref": "FromVpcCDC4218A",
        },
      },
      "Type": "AWS::EC2::Subnet",
    },
    "TestPeeringConnectionV1": Object {
      "Properties": Object {
        "PeerVpcId": Object {
          "Ref": "ToVpcCFC3F06F",
        },
        "VpcId": Object {
          "Ref": "FromVpcCDC4218A",
        },
      },
      "Type": "AWS::EC2::VPCPeeringConnection",
    },
    "TestPeeringRouteFromSubnet0V1": Object {
      "Properties": Object {
        "DestinationCidrBlock": Object {
          "Fn::GetAtt": Array [
            "ToVpcCFC3F06F",
            "CidrBlock",
          ],
        },
        "RouteTableId": Object {
          "Ref": "FromVpcingressSubnet1RouteTableCD16EE45",
        },
        "VpcPeeringConnectionId": Object {
          "Ref": "TestPeeringConnectionV1",
        },
      },
      "Type": "AWS::EC2::Route",
    },
    "TestPeeringRouteToSubnet0V1": Object {
      "Properties": Object {
        "DestinationCidrBlock": Object {
          "Fn::GetAtt": Array [
            "FromVpcCDC4218A",
            "CidrBlock",
          ],
        },
        "RouteTableId": Object {
          "Ref": "ToVpcrdsSubnet1RouteTable12AF02BE",
        },
        "VpcPeeringConnectionId": Object {
          "Ref": "TestPeeringConnectionV1",
        },
      },
      "Type": "AWS::EC2::Route",
    },
    "TestPeeringRouteToSubnet1V1": Object {
      "Properties": Object {
        "DestinationCidrBlock": Object {
          "Fn::GetAtt": Array [
            "FromVpcCDC4218A",
            "CidrBlock",
          ],
        },
        "RouteTableId": Object {
          "Ref": "ToVpcrdsSubnet2RouteTable56EE296E",
        },
        "VpcPeeringConnectionId": Object {
          "Ref": "TestPeeringConnectionV1",
        },
      },
      "Type": "AWS::EC2::Route",
    },
    "ToVpcCFC3F06F": Object {
      "Properties": Object {
        "CidrBlock": "10.0.1.0/24",
        "EnableDnsHostnames": true,
        "EnableDnsSupport": true,
        "InstanceTenancy": "default",
        "Tags": Array [
          Object {
            "Key": "Name",
            "Value": "TestStack/ToVpc",
          },
        ],
      },
      "Type": "AWS::EC2::VPC",
    },
    "ToVpcIGWB141BDC2": Object {
      "Properties": Object {
        "Tags": Array [
          Object {
            "Key": "Name",
            "Value": "TestStack/ToVpc",
          },
        ],
      },
      "Type": "AWS::EC2::InternetGateway",
    },
    "ToVpcVPCGWD8D4CA42": Object {
      "Properties": Object {
        "InternetGatewayId": Object {
          "Ref": "ToVpcIGWB141BDC2",
        },
        "VpcId": Object {
          "Ref": "ToVpcCFC3F06F",
        },
      },
      "Type": "AWS::EC2::VPCGatewayAttachment",
    },
    "ToVpccomputeSubnet1DefaultRouteA33DF725": Object {
      "Properties": Object {
        "DestinationCidrBlock": "0.0.0.0/0",
        "NatGatewayId": Object {
          "Ref": "ToVpcingressSubnet1NATGateway9F6E6BDE",
        },
        "RouteTableId": Object {
          "Ref": "ToVpccomputeSubnet1RouteTableB095F01C",
        },
      },
      "Type": "AWS::EC2::Route",
    },
    "ToVpccomputeSubnet1RouteTableAssociation54641D9E": Object {
      "Properties": Object {
        "RouteTableId": Object {
          "Ref": "ToVpccomputeSubnet1RouteTableB095F01C",
        },
        "SubnetId": Object {
          "Ref": "ToVpccomputeSubnet1SubnetD544B9F5",
        },
      },
      "Type": "AWS::EC2::SubnetRouteTableAssociation",
    },
    "ToVpccomputeSubnet1RouteTableB095F01C": Object {
      "Properties": Object {
        "Tags": Array [
          Object {
            "Key": "Name",
            "Value": "TestStack/ToVpc/computeSubnet1",
          },
        ],
        "VpcId": Object {
          "Ref": "ToVpcCFC3F06F",
        },
      },
      "Type": "AWS::EC2::RouteTable",
    },
    "ToVpccomputeSubnet1SubnetD544B9F5": Object {
      "Properties": Object {
        "AvailabilityZone": Object {
          "Fn::Select": Array [
            0,
            Object {
              "Fn::GetAZs": "",
            },
          ],
        },
        "CidrBlock": "10.0.1.32/28",
        "MapPublicIpOnLaunch": false,
        "Tags": Array [
          Object {
            "Key": "aws-cdk:subnet-name",
            "Value": "compute",
          },
          Object {
            "Key": "aws-cdk:subnet-type",
            "Value": "Private",
          },
          Object {
            "Key": "Name",
            "Value": "TestStack/ToVpc/computeSubnet1",
          },
        ],
        "VpcId": Object {
          "Ref": "ToVpcCFC3F06F",
        },
      },
      "Type": "AWS::EC2::Subnet",
    },
    "ToVpccomputeSubnet2DefaultRouteB232B3E4": Object {
      "Properties": Object {
        "DestinationCidrBlock": "0.0.0.0/0",
        "NatGatewayId": Object {
          "Ref": "ToVpcingressSubnet2NATGatewayEF83471A",
        },
        "RouteTableId": Object {
          "Ref": "ToVpccomputeSubnet2RouteTable00B20DBC",
        },
      },
      "Type": "AWS::EC2::Route",
    },
    "ToVpccomputeSubnet2RouteTable00B20DBC": Object {
      "Properties": Object {
        "Tags": Array [
          Object {
            "Key": "Name",
            "Value": "TestStack/ToVpc/computeSubnet2",
          },
        ],
        "VpcId": Object {
          "Ref": "ToVpcCFC3F06F",
        },
      },
      "Type": "AWS::EC2::RouteTable",
    },
    "ToVpccomputeSubnet2RouteTableAssociationE5A09E69": Object {
      "Properties": Object {
        "RouteTableId": Object {
          "Ref": "ToVpccomputeSubnet2RouteTable00B20DBC",
        },
        "SubnetId": Object {
          "Ref": "ToVpccomputeSubnet2Subnet681D66F6",
        },
      },
      "Type": "AWS::EC2::SubnetRouteTableAssociation",
    },
    "ToVpccomputeSubnet2Subnet681D66F6": Object {
      "Properties": Object {
        "AvailabilityZone": Object {
          "Fn::Select": Array [
            1,
            Object {
              "Fn::GetAZs": "",
            },
          ],
        },
        "CidrBlock": "10.0.1.48/28",
        "MapPublicIpOnLaunch": false,
        "Tags": Array [
          Object {
            "Key": "aws-cdk:subnet-name",
            "Value": "compute",
          },
          Object {
            "Key": "aws-cdk:subnet-type",
            "Value": "Private",
          },
          Object {
            "Key": "Name",
            "Value": "TestStack/ToVpc/computeSubnet2",
          },
        ],
        "VpcId": Object {
          "Ref": "ToVpcCFC3F06F",
        },
      },
      "Type": "AWS::EC2::Subnet",
    },
    "ToVpcingressSubnet1DefaultRouteFD9AE465": Object {
      "DependsOn": Array [
        "ToVpcVPCGWD8D4CA42",
      ],
      "Properties": Object {
        "DestinationCidrBlock": "0.0.0.0/0",
        "GatewayId": Object {
          "Ref": "ToVpcIGWB141BDC2",
        },
        "RouteTableId": Object {
          "Ref": "ToVpcingressSubnet1RouteTableBBF6F5E4",
        },
      },
      "Type": "AWS::EC2::Route",
    },
    "ToVpcingressSubnet1EIP125A7909": Object {
      "Properties": Object {
        "Domain": "vpc",
        "Tags": Array [
          Object {
            "Key": "Name",
            "Value": "TestStack/ToVpc/ingressSubnet1",
          },
        ],
      },
      "Type": "AWS::EC2::EIP",
    },
    "ToVpcingressSubnet1NATGateway9F6E6BDE": Object {
      "DependsOn": Array [
        "ToVpcingressSubnet1DefaultRouteFD9AE465",
        "ToVpcingressSubnet1RouteTableAssociation4EB86263",
      ],
      "Properties": Object {
        "AllocationId": Object {
          "Fn::GetAtt": Array [
            "ToVpcingressSubnet1EIP125A7909",
            "AllocationId",
          ],
        },
        "SubnetId": Object {
          "Ref": "ToVpcingressSubnet1Subnet1D633279",
        },
        "Tags": Array [
          Object {
            "Key": "Name",
            "Value": "TestStack/ToVpc/ingressSubnet1",
          },
        ],
      },
      "Type": "AWS::EC2::NatGateway",
    },
    "ToVpcingressSubnet1RouteTableAssociation4EB86263": Object {
      "Properties": Object {
        "RouteTableId": Object {
          "Ref": "ToVpcingressSubnet1RouteTableBBF6F5E4",
        },
        "SubnetId": Object {
          "Ref": "ToVpcingressSubnet1Subnet1D633279",
        },
      },
      "Type": "AWS::EC2::SubnetRouteTableAssociation",
    },
    "ToVpcingressSubnet1RouteTableBBF6F5E4": Object {
      "Properties": Object {
        "Tags": Array [
          Object {
            "Key": "Name",
            "Value": "TestStack/ToVpc/ingressSubnet1",
          },
        ],
        "VpcId": Object {
          "Ref": "ToVpcCFC3F06F",
        },
      },
      "Type": "AWS::EC2::RouteTable",
    },
    "ToVpcingressSubnet1Subnet1D633279": Object {
      "Properties": Object {
        "AvailabilityZone": Object {
          "Fn::Select": Array [
            0,
            Object {
              "Fn::GetAZs": "",
            },
          ],
        },
        "CidrBlock": "10.0.1.0/28",
        "MapPublicIpOnLaunch": true,
        "Tags": Array [
          Object {
            "Key": "aws-cdk:subnet-name",
            "Value": "ingress",
          },
          Object {
            "Key": "aws-cdk:subnet-type",
            "Value": "Public",
          },
          Object {
            "Key": "Name",
            "Value": "TestStack/ToVpc/ingressSubnet1",
          },
        ],
        "VpcId": Object {
          "Ref": "ToVpcCFC3F06F",
        },
      },
      "Type": "AWS::EC2::Subnet",
    },
    "ToVpcingressSubnet2DefaultRoute9B11A620": Object {
      "DependsOn": Array [
        "ToVpcVPCGWD8D4CA42",
      ],
      "Properties": Object {
        "DestinationCidrBlock": "0.0.0.0/0",
        "GatewayId": Object {
          "Ref": "ToVpcIGWB141BDC2",
        },
        "RouteTableId": Object {
          "Ref": "ToVpcingressSubnet2RouteTableA7FC6477",
        },
      },
      "Type": "AWS::EC2::Route",
    },
    "ToVpcingressSubnet2EIPFFF9CB91": Object {
      "Properties": Object {
        "Domain": "vpc",
        "Tags": Array [
          Object {
            "Key": "Name",
            "Value": "TestStack/ToVpc/ingressSubnet2",
          },
        ],
      },
      "Type": "AWS::EC2::EIP",
    },
    "ToVpcingressSubnet2NATGatewayEF83471A": Object {
      "DependsOn": Array [
        "ToVpcingressSubnet2DefaultRoute9B11A620",
        "ToVpcingressSubnet2RouteTableAssociationC821CC6C",
      ],
      "Properties": Object {
        "AllocationId": Object {
          "Fn::GetAtt": Array [
            "ToVpcingressSubnet2EIPFFF9CB91",
            "AllocationId",
          ],
        },
        "SubnetId": Object {
          "Ref": "ToVpcingressSubnet2Subnet21BA2264",
        },
        "Tags": Array [
          Object {
            "Key": "Name",
            "Value": "TestStack/ToVpc/ingressSubnet2",
          },
        ],
      },
      "Type": "AWS::EC2::NatGateway",
    },
    "ToVpcingressSubnet2RouteTableA7FC6477": Object {
      "Properties": Object {
        "Tags": Array [
          Object {
            "Key": "Name",
            "Value": "TestStack/ToVpc/ingressSubnet2",
          },
        ],
        "VpcId": Object {
          "Ref": "ToVpcCFC3F06F",
        },
      },
      "Type": "AWS::EC2::RouteTable",
    },
    "ToVpcingressSubnet2RouteTableAssociationC821CC6C": Object {
      "Properties": Object {
        "RouteTableId": Object {
          "Ref": "ToVpcingressSubnet2RouteTableA7FC6477",
        },
        "SubnetId": Object {
          "Ref": "ToVpcingressSubnet2Subnet21BA2264",
        },
      },
      "Type": "AWS::EC2::SubnetRouteTableAssociation",
    },
    "ToVpcingressSubnet2Subnet21BA2264": Object {
      "Properties": Object {
        "AvailabilityZone": Object {
          "Fn::Select": Array [
            1,
            Object {
              "Fn::GetAZs": "",
            },
          ],
        },
        "CidrBlock": "10.0.1.16/28",
        "MapPublicIpOnLaunch": true,
        "Tags": Array [
          Object {
            "Key": "aws-cdk:subnet-name",
            "Value": "ingress",
          },
          Object {
            "Key": "aws-cdk:subnet-type",
            "Value": "Public",
          },
          Object {
            "Key": "Name",
            "Value": "TestStack/ToVpc/ingressSubnet2",
          },
        ],
        "VpcId": Object {
          "Ref": "ToVpcCFC3F06F",
        },
      },
      "Type": "AWS::EC2::Subnet",
    },
    "ToVpcrdsSubnet1RouteTable12AF02BE": Object {
      "Properties": Object {
        "Tags": Array [
          Object {
            "Key": "Name",
            "Value": "TestStack/ToVpc/rdsSubnet1",
          },
        ],
        "VpcId": Object {
          "Ref": "ToVpcCFC3F06F",
        },
      },
      "Type": "AWS::EC2::RouteTable",
    },
    "ToVpcrdsSubnet1RouteTableAssociationD14E2BD7": Object {
      "Properties": Object {
        "RouteTableId": Object {
          "Ref": "ToVpcrdsSubnet1RouteTable12AF02BE",
        },
        "SubnetId": Object {
          "Ref": "ToVpcrdsSubnet1SubnetE5F432CE",
        },
      },
      "Type": "AWS::EC2::SubnetRouteTableAssociation",
    },
    "ToVpcrdsSubnet1SubnetE5F432CE": Object {
      "Properties": Object {
        "AvailabilityZone": Object {
          "Fn::Select": Array [
            0,
            Object {
              "Fn::GetAZs": "",
            },
          ],
        },
        "CidrBlock": "10.0.1.64/28",
        "MapPublicIpOnLaunch": false,
        "Tags": Array [
          Object {
            "Key": "aws-cdk:subnet-name",
            "Value": "rds",
          },
          Object {
            "Key": "aws-cdk:subnet-type",
            "Value": "Isolated",
          },
          Object {
            "Key": "Name",
            "Value": "TestStack/ToVpc/rdsSubnet1",
          },
        ],
        "VpcId": Object {
          "Ref": "ToVpcCFC3F06F",
        },
      },
      "Type": "AWS::EC2::Subnet",
    },
    "ToVpcrdsSubnet2RouteTable56EE296E": Object {
      "Properties": Object {
        "Tags": Array [
          Object {
            "Key": "Name",
            "Value": "TestStack/ToVpc/rdsSubnet2",
          },
        ],
        "VpcId": Object {
          "Ref": "ToVpcCFC3F06F",
        },
      },
      "Type": "AWS::EC2::RouteTable",
    },
    "ToVpcrdsSubnet2RouteTableAssociation41EF1F1C": Object {
      "Properties": Object {
        "RouteTableId": Object {
          "Ref": "ToVpcrdsSubnet2RouteTable56EE296E",
        },
        "SubnetId": Object {
          "Ref": "ToVpcrdsSubnet2SubnetF86B624C",
        },
      },
      "Type": "AWS::EC2::SubnetRouteTableAssociation",
    },
    "ToVpcrdsSubnet2SubnetF86B624C": Object {
      "Properties": Object {
        "AvailabilityZone": Object {
          "Fn::Select": Array [
            1,
            Object {
              "Fn::GetAZs": "",
            },
          ],
        },
        "CidrBlock": "10.0.1.80/28",
        "MapPublicIpOnLaunch": false,
        "Tags": Array [
          Object {
            "Key": "aws-cdk:subnet-name",
            "Value": "rds",
          },
          Object {
            "Key": "aws-cdk:subnet-type",
            "Value": "Isolated",
          },
          Object {
            "Key": "Name",
            "Value": "TestStack/ToVpc/rdsSubnet2",
          },
        ],
        "VpcId": Object {
          "Ref": "ToVpcCFC3F06F",
        },
      },
      "Type": "AWS::EC2::Subnet",
    },
  },
}
`;
