// Jest Snapshot v1, https://goo.gl/fbAQLP

exports[`sns withSqsSubscription should add a subscription to a topic 1`] = `
Object {
  "Resources": Object {
    "TestQueue3F064D2B": Object {
      "DeletionPolicy": "Delete",
      "Type": "AWS::SQS::Queue",
      "UpdateReplacePolicy": "Delete",
    },
    "TestQueuePolicy7F0730D0": Object {
      "Properties": Object {
        "PolicyDocument": Object {
          "Statement": Array [
            Object {
              "Action": "sqs:SendMessage",
              "Condition": Object {
                "ArnEquals": Object {
                  "aws:SourceArn": Object {
                    "Ref": "TestTopicA35E6463",
                  },
                },
              },
              "Effect": "Allow",
              "Principal": Object {
                "Service": "sns.amazonaws.com",
              },
              "Resource": Object {
                "Fn::GetAtt": Array [
                  "TestQueue3F064D2B",
                  "Arn",
                ],
              },
            },
          ],
          "Version": "2012-10-17",
        },
        "Queues": Array [
          Object {
            "Ref": "TestQueue3F064D2B",
          },
        ],
      },
      "Type": "AWS::SQS::QueuePolicy",
    },
    "TestQueueTestStackTestTopic944C01AEB3D1A643": Object {
      "DependsOn": Array [
        "TestQueuePolicy7F0730D0",
      ],
      "Properties": Object {
        "Endpoint": Object {
          "Fn::GetAtt": Array [
            "TestQueue3F064D2B",
            "Arn",
          ],
        },
        "Protocol": "sqs",
        "TopicArn": Object {
          "Ref": "TestTopicA35E6463",
        },
      },
      "Type": "AWS::SNS::Subscription",
    },
    "TestTopicA35E6463": Object {
      "Properties": Object {
        "TopicName": "Test-Topic",
      },
      "Type": "AWS::SNS::Topic",
    },
  },
}
`;

exports[`sns withSqsSubscription should add a subscription to a topic using a filter policy 1`] = `
Object {
  "Resources": Object {
    "TestQueue3F064D2B": Object {
      "DeletionPolicy": "Delete",
      "Type": "AWS::SQS::Queue",
      "UpdateReplacePolicy": "Delete",
    },
    "TestQueuePolicy7F0730D0": Object {
      "Properties": Object {
        "PolicyDocument": Object {
          "Statement": Array [
            Object {
              "Action": "sqs:SendMessage",
              "Condition": Object {
                "ArnEquals": Object {
                  "aws:SourceArn": Object {
                    "Ref": "TestTopicFilterPolicy91794945",
                  },
                },
              },
              "Effect": "Allow",
              "Principal": Object {
                "Service": "sns.amazonaws.com",
              },
              "Resource": Object {
                "Fn::GetAtt": Array [
                  "TestQueue3F064D2B",
                  "Arn",
                ],
              },
            },
          ],
          "Version": "2012-10-17",
        },
        "Queues": Array [
          Object {
            "Ref": "TestQueue3F064D2B",
          },
        ],
      },
      "Type": "AWS::SQS::QueuePolicy",
    },
    "TestQueueTestStackTestTopicFilterPolicy7F5FE1BE0D6799F6": Object {
      "DependsOn": Array [
        "TestQueuePolicy7F0730D0",
      ],
      "Properties": Object {
        "Endpoint": Object {
          "Fn::GetAtt": Array [
            "TestQueue3F064D2B",
            "Arn",
          ],
        },
        "FilterPolicy": Object {
          "properties": Array [
            "all-props",
          ],
        },
        "Protocol": "sqs",
        "TopicArn": Object {
          "Ref": "TestTopicFilterPolicy91794945",
        },
      },
      "Type": "AWS::SNS::Subscription",
    },
    "TestTopicFilterPolicy91794945": Object {
      "Properties": Object {
        "TopicName": "Test-Topic-Filter-Policy",
      },
      "Type": "AWS::SNS::Topic",
    },
  },
}
`;

exports[`sns withTopic should create a topic 1`] = `
Object {
  "Resources": Object {
    "TestTopicA35E6463": Object {
      "Properties": Object {
        "ContentBasedDeduplication": true,
        "FifoTopic": true,
        "TopicName": "Test-Topic.fifo",
      },
      "Type": "AWS::SNS::Topic",
    },
  },
}
`;
