// Jest Snapshot v1, https://goo.gl/fbAQLP

exports[`CardForm Should render CardForm 1`] = `
<div
  className="formWrapper"
>
  <div
    className="MuiInputBase-root MuiInput-root MuiInput-underline"
    onClick={[Function]}
    required={true}
  >
    <input
      className="MuiInputBase-input MuiInput-input"
      name="title"
      onAnimationStart={[Function]}
      onBlur={[Function]}
      onChange={[Function]}
      onFocus={[Function]}
      placeholder="Título *"
      required={true}
      type="text"
      value=""
    />
  </div>
  <div
    className="MuiInputBase-root MuiInput-root MuiInput-underline"
    onClick={[Function]}
    required={true}
  >
    <input
      className="MuiInputBase-input MuiInput-input"
      name="description"
      onAnimationStart={[Function]}
      onBlur={[Function]}
      onChange={[Function]}
      onFocus={[Function]}
      placeholder="Descripción *"
      required={true}
      type="text"
      value=""
    />
  </div>
  <div
    className="MuiInputBase-root MuiInput-root MuiInput-underline"
    onClick={[Function]}
  >
    <input
      className="MuiInputBase-input MuiInput-input"
      name="image"
      onAnimationStart={[Function]}
      onBlur={[Function]}
      onChange={[Function]}
      onFocus={[Function]}
      placeholder="Imagen (URL)"
      type="text"
      value=""
    />
  </div>
  <div
    className="buttonWrapper"
  >
    <button
      className="MuiButtonBase-root MuiButton-root MuiButton-text"
      disabled={false}
      onBlur={[Function]}
      onClick={[Function]}
      onDragLeave={[Function]}
      onFocus={[Function]}
      onKeyDown={[Function]}
      onKeyUp={[Function]}
      onMouseDown={[Function]}
      onMouseLeave={[Function]}
      onMouseUp={[Function]}
      onTouchEnd={[Function]}
      onTouchMove={[Function]}
      onTouchStart={[Function]}
      tabIndex={0}
      type="button"
    >
      <span
        className="MuiButton-label"
      >
        Añadir
      </span>
    </button>
  </div>
</div>
`;
