// Jest Snapshot v1, https://goo.gl/fbAQLP

exports[`Card Should render Card 1`] = `
<div
  className="MuiPaper-root MuiCard-root card MuiPaper-elevation8 MuiPaper-rounded"
>
  <div
    className="imageWrapper"
  >
    <div
      className="actionButtonWrapper"
    >
      <button
        className="MuiButtonBase-root MuiButton-root MuiButton-text actionButton MuiButton-textSecondary"
        disabled={false}
        onBlur={[Function]}
        onClick={[Function]}
        onDragLeave={[Function]}
        onFocus={[Function]}
        onKeyDown={[Function]}
        onKeyUp={[Function]}
        onMouseDown={[Function]}
        onMouseLeave={[Function]}
        onMouseUp={[Function]}
        onTouchEnd={[Function]}
        onTouchMove={[Function]}
        onTouchStart={[Function]}
        tabIndex={0}
        type="button"
      >
        <span
          className="MuiButton-label"
        >
          <svg
            aria-hidden={true}
            className="MuiSvgIcon-root"
            focusable="false"
            viewBox="0 0 24 24"
          >
            <path
              d="M3 17.25V21h3.75L17.81 9.94l-3.75-3.75L3 17.25zM20.71 7.04c.39-.39.39-1.02 0-1.41l-2.34-2.34a.9959.9959 0 00-1.41 0l-1.83 1.83 3.75 3.75 1.83-1.83z"
            />
          </svg>
        </span>
      </button>
      <button
        className="MuiButtonBase-root MuiButton-root MuiButton-text actionButton"
        disabled={false}
        onBlur={[Function]}
        onClick={[Function]}
        onDragLeave={[Function]}
        onFocus={[Function]}
        onKeyDown={[Function]}
        onKeyUp={[Function]}
        onMouseDown={[Function]}
        onMouseLeave={[Function]}
        onMouseUp={[Function]}
        onTouchEnd={[Function]}
        onTouchMove={[Function]}
        onTouchStart={[Function]}
        tabIndex={0}
        type="button"
      >
        <span
          className="MuiButton-label"
        >
          <svg
            aria-hidden={true}
            className="MuiSvgIcon-root"
            focusable="false"
            viewBox="0 0 24 24"
          >
            <path
              d="M6 19c0 1.1.9 2 2 2h8c1.1 0 2-.9 2-2V7H6v12zM19 4h-3.5l-1-1h-5l-1 1H5v2h14V4z"
            />
          </svg>
        </span>
      </button>
    </div>
    <img
      alt="image"
      src="https://kubalubra.is/wp-content/uploads/2017/11/default-thumbnail.jpg"
    />
    <div
      className="title"
    >
      title
    </div>
  </div>
  <div
    className="content"
  >
    <div
      className="description"
    >
      2020-11-24
      : 
      desc
    </div>
  </div>
</div>
`;
