<?xml version="1.0" encoding="UTF-8" standalone="no"?>
<svg
   xmlns:dc="http://purl.org/dc/elements/1.1/"
   xmlns:cc="http://creativecommons.org/ns#"
   xmlns:rdf="http://www.w3.org/1999/02/22-rdf-syntax-ns#"
   xmlns:svg="http://www.w3.org/2000/svg"
   xmlns="http://www.w3.org/2000/svg"
   xmlns:sodipodi="http://sodipodi.sourceforge.net/DTD/sodipodi-0.dtd"
   xmlns:inkscape="http://www.inkscape.org/namespaces/inkscape"
   version="1.1"
   x="0px"
   y="0px"
   viewBox="0 0 1000 1000"
   enable-background="new 0 0 1000 1000"
   xml:space="preserve"
   sodipodi:docname="ea1d0ad91b22d1c768feb73771fbe7e9 (1).svg"
   inkscape:version="1.0.2 (e86c870879, 2021-01-15)">
<sodipodi:namedview
   pagecolor="#ffffff"
   bordercolor="#666666"
   borderopacity="1"
   objecttolerance="10"
   gridtolerance="10"
   guidetolerance="10"
   inkscape:pageopacity="0"
   inkscape:pageshadow="2"
   inkscape:window-width="1920"
   inkscape:window-height="1043"
   showgrid="false"
   inkscape:zoom="0.886"
   inkscape:cx="244.92099"
   inkscape:cy="500"
   inkscape:window-x="0"
   inkscape:window-y="18"
   inkscape:window-maximized="0"
   inkscape:current-layer="svg8" />
<g><path
     d="M500,42.7c162.1,0,294,131.9,294,294c0,51.6-13.7,102.4-39.5,147L500,924.7l-254.5-441c-25.8-44.6-39.5-95.4-39.5-147C206,174.5,337.9,42.7,500,42.7L500,42.7z M500,451c63,0,114.3-51.3,114.3-114.3c0-63-51.3-114.3-114.3-114.3c-63,0-114.3,51.3-114.3,114.3C385.7,399.7,437,451,500,451z M500,10c-180.4,0-326.7,146.3-326.7,326.7c0,59.6,16,115.3,43.9,163.3L500,990l282.8-490c27.8-48.1,43.9-103.8,43.9-163.3C826.6,156.3,680.4,10,500,10L500,10L500,10z M500,418.3c-45.1,0-81.7-36.5-81.7-81.6c0-45.1,36.6-81.6,81.7-81.6c45.1,0,81.6,36.6,81.6,81.6C581.7,381.8,545.1,418.3,500,418.3L500,418.3z"
     /></g>
<path
   style="fill:#ff0000;stroke-width:1.12867"
   d="M 494.71818,43.447111 C 447.62807,42.687988 400.97203,56.330904 359.68905,78.502116 277.11505,122.93183 218.10621,208.82582 208.07327,302.26761 c -7.6221,65.70698 7.23435,133.87886 42.53627,189.93256 77.67227,134.95992 154.99792,270.13361 233.79342,404.43683 5.20553,7.60586 8.87492,16.84619 15.50004,23.23417 5.45894,-3.98096 7.88668,-11.55763 11.94779,-16.9546 70.98647,-120.31611 140.15502,-241.70883 209.98872,-362.70165 16.34774,-29.93019 35.50058,-58.44298 49.20699,-89.74187 25.09019,-59.32591 29.28149,-127.11339 13.11555,-189.35391 C 759.07514,165.13726 682.06159,84.922059 587.23604,55.825176 557.98739,46.569876 527.28142,42.313353 496.61179,43.443158 l -1.12865,0.0024 z M 500,223.15225 c 39.9216,-1.53122 78.5692,22.06011 98.46527,56.16888 25.8364,43.01204 18.36603,102.45896 -17.49788,137.55746 -19.91789,19.77813 -47.12056,33.33924 -75.52465,33.03235 -18.0871,1.37853 -36.35677,-1.39307 -52.69239,-9.50196 -42.84176,-18.95393 -71.29168,-66.49733 -66.15087,-113.3034 2.67174,-45.1182 35.95926,-85.99013 79.06338,-99.10435 11.04344,-3.958 22.61492,-5.27155 34.33714,-4.84898 z"
   id="paro2-color" /></svg>
