{
    "nombreApp": "Componentes",
    "peliculas": [
        {
            "ruta": "https://images.alphacoders.com/824/thumb-1920-82401.jpg",
            "color": "red",
            "texto": "Iron Man"
        },
        {
            "ruta": "https://images2.alphacoders.com/587/thumb-1920-58780.jpg",
            "color": "blue",
            "texto": "Shrek"
        },
        {
            "ruta": "https://images3.alphacoders.com/674/674048.jpg",
            "color": "green",
            "texto": "Thor"
        },
        {
            "ruta": "https://images6.alphacoders.com/417/417300.jpg",
            "color": "yellow",
            "texto": "Deadpool"
        },
        {
            "ruta": "https://images4.alphacoders.com/759/thumb-1920-759351.jpg",
            "color": "orange",
            "texto": "Dr.Strange"
        },
        {
            "ruta": "https://images6.alphacoders.com/617/617105.jpg",
            "color": "indigo",
            "texto": "R F 7"
        }
    ],
    "proximos": [
        {
            "ruta": "https://cnet1.cbsistatic.com/img/NZuEKZd-wg4PBl-To6q7acsSpZQ=/2019/08/05/4b672a8b-710f-4c78-bfb3-375bda92907e/mulan-2020-live-action-8.jpg",
            "color": "blue",
            "texto": "Mulan"
        },
        {
            "ruta": "https://as.com/meristation/imagenes/2019/08/26/noticias/1566795311_420845_1566795358_noticia_normal.jpg",
            "color": "indigo",
            "texto": "Viuda Negra"
        },
        {
            "ruta": "https://i.blogs.es/ead50c/ww1984-2/450_1000.jpg",
            "color": "red",
            "texto": "Wonder Woman"
        },
        {
            "ruta": "https://e00-marca.uecdn.es/assets/multimedia/imagenes/2020/03/12/15840382283314.jpg",
            "color": "yellow",
            "texto": "R F 9"
        },
        {
            "ruta": "https://nick-intl.mtvnimages.com/uri/mgid:file:gsp:scenic:/international/nickelodeon.es/v2/bob-pelicula-640x360.jpg?quality=0.75&height=576&width=1024&matte=true&crop=true",
            "color": "orange",
            "texto": "Bob Esponja"
        },
        {
            "ruta": "https://e00-marca.uecdn.es/assets/multimedia/imagenes/2020/05/28/15906771243498.jpg",
            "color": "green",
            "texto": "Avatar 2"
        }
    ]

}