[
    {
        "id": "1",
        "titulo": "Casta Fior",
        "informacion":"Solo dinero en efectivo · Comidas durante la madrugada · Desayunos",
        "longitud": "-71.539586",
        "latitud":"-16.3917321",
        "tipo_comida": "Pizza",
        "imagen": "https://media-cdn.tripadvisor.com/media/photo-s/1b/19/3c/f8/tha-award-for-2020.jpg",
        "valoracion": "4.6",
        "platos": [{"plato_nombre": "algo", "precio": "un medina"},{"plato_nombre": "algo2", "precio": "un medina2"}]
    },
    {
        "id": "2",
        "titulo": "Casta Fior2",
        "informacion":"Solo dinero en efectivo · Comidas durante la madrugada · Desayunos",
        "longitud": "-71.539586",
        "latitud":"-16.3917321",
        "tipo_comida": "Hamburguesa",
        "imagen": "https://media-cdn.tripadvisor.com/media/photo-s/1b/19/3c/f8/tha-award-for-2020.jpg",
        "valoracion": "4.8",
        "platos": [{"plato_nombre": "another", "precio": "un medina3"},{"plato_nombre": "another2", "precio": "un medina4"}]
    },
    {
        "id": "3",
        "titulo": "Casta Fior",
        "informacion":"Solo dinero en efectivo · Comidas durante la madrugada · Desayunos",
        "longitud": "-71.539586",
        "latitud":"-16.3917321",
        "tipo_comida": "Pizza",
        "imagen": "https://media-cdn.tripadvisor.com/media/photo-s/1b/19/3c/f8/tha-award-for-2020.jpg",
        "valoracion": "4.6",
        "platos": [{"plato_nombre": "algo", "precio": "un medina"},{"plato_nombre": "algo2", "precio": "un medina2"}]
    },
    {
        "id": "4",
        "titulo": "Casta Fior",
        "informacion":"Solo dinero en efectivo · Comidas durante la madrugada · Desayunos",
        "longitud": "-71.539586",
        "latitud":"-16.3917321",
        "tipo_comida": "Taco",
        "imagen": "https://media-cdn.tripadvisor.com/media/photo-s/1b/19/3c/f8/tha-award-for-2020.jpg",
        "valoracion": "5.0",
        "platos": [{"plato_nombre": "algo", "precio": "un medina"},{"plato_nombre": "algo2", "precio": "un medina2"}]
    },
    {
        "id": "5",
        "titulo": "Casta Fior",
        "informacion":"Solo dinero en efectivo · Comidas durante la madrugada · Desayunos",
        "longitud": "-71.539586",
        "latitud":"-16.3917321",
        "tipo_comida": "Pollo",
        "imagen": "https://media-cdn.tripadvisor.com/media/photo-s/1b/19/3c/f8/tha-award-for-2020.jpg",
        "valoracion": "4.1",
        "platos": [{"plato_nombre": "algo", "precio": "un medina"},{"plato_nombre": "algo2", "precio": "un medina2"}]
    },
    {
        "id": "6",
        "titulo": "Casta Fior",
        "informacion":"Solo dinero en efectivo · Comidas durante la madrugada · Desayunos",
        "longitud": "-71.539586",
        "latitud":"-16.3917321",
        "tipo_comida": "Pollo",
        "imagen": "https://media-cdn.tripadvisor.com/media/photo-s/1b/19/3c/f8/tha-award-for-2020.jpg",
        "valoracion": "4.9",
        "platos": [{"plato_nombre": "algo", "precio": "un medina"},{"plato_nombre": "algo2", "precio": "un medina2"}]
    },
    {
        "id": "7",
        "titulo": "Casta Fior",
        "informacion":"Solo dinero en efectivo · Comidas durante la madrugada · Desayunos",
        "longitud": "-71.539586",
        "latitud":"-16.3917321",
        "tipo_comida": "Pollo",
        "imagen": "https://media-cdn.tripadvisor.com/media/photo-s/1b/19/3c/f8/tha-award-for-2020.jpg",
        "valoracion": "4.2",
        "platos": [{"plato_nombre": "algo", "precio": "un medina"},{"plato_nombre": "algo2", "precio": "un medina2"}]
    },
    {
        "id": "8",
        "titulo": "Casta Fior",
        "informacion":"Solo dinero en efectivo · Comidas durante la madrugada · Desayunos",
        "longitud": "-71.539586",
        "latitud":"-16.3917321",
        "tipo_comida": "Menu",
        "imagen": "https://media-cdn.tripadvisor.com/media/photo-s/1b/19/3c/f8/tha-award-for-2020.jpg",
        "valoracion": "4.0",
        "platos": [{"plato_nombre": "algo", "precio": "un medina"},{"plato_nombre": "algo2", "precio": "un medina2"}]
    }
]