<?xml version="1.0" encoding="UTF-8" standalone="no"?>
<!-- Created with Inkscape (http://www.inkscape.org/) -->

<svg
   width="400mm"
   height="400mm"
   viewBox="0 0 400 400"
   version="1.1"
   id="svg5"
   inkscape:version="1.1 (c4e8f9ed74, 2021-05-24)"
   sodipodi:docname="tux-badge.svg"
   inkscape:export-filename="/home/gk/Downloads/tux-badge.png"
   inkscape:export-xdpi="65.024002"
   inkscape:export-ydpi="65.024002"
   xmlns:inkscape="http://www.inkscape.org/namespaces/inkscape"
   xmlns:sodipodi="http://sodipodi.sourceforge.net/DTD/sodipodi-0.dtd"
   xmlns="http://www.w3.org/2000/svg"
   xmlns:svg="http://www.w3.org/2000/svg">
  <sodipodi:namedview
     id="namedview7"
     pagecolor="#505050"
     bordercolor="#ffffff"
     borderopacity="1"
     inkscape:pageshadow="0"
     inkscape:pageopacity="0"
     inkscape:pagecheckerboard="1"
     inkscape:document-units="mm"
     showgrid="false"
     inkscape:zoom="0.45795779"
     inkscape:cx="516.42314"
     inkscape:cy="660.54123"
     inkscape:window-width="1920"
     inkscape:window-height="1048"
     inkscape:window-x="0"
     inkscape:window-y="32"
     inkscape:window-maximized="1"
     inkscape:current-layer="layer3"
     width="395.875mm" />
  <defs
     id="defs2" />
  <g
     inkscape:groupmode="layer"
     id="layer3"
     inkscape:label="Background"
     style="display:inline" />
  <g
     inkscape:label="Tux"
     inkscape:groupmode="layer"
     id="layer1"
     transform="translate(154.31645,60.763496)"
     style="display:inline">
    <g
       id="g978"
       transform="translate(12.733238)">
      <g
         id="g996">
        <g
           id="g984">
          <path
             style="fill:#785f42;fill-opacity:1;stroke-width:0.288872"
             d="m -39.22131,214.67094 c -7.367687,-4.883 -26.217861,-23.87373 -31.146373,-30.66392 -25.319887,-34.88415 -43.898577,-67.45899 -47.029587,-100.148401 -0.53728,-5.60946 0.18203,-16.981707 1.56915,-23.913941 3.52254,-17.604165 5.7928,-21.798824 11.89523,-28.785833 4.706547,-5.388789 10.307406,-8.479242 20.18817,-11.111579 2.533271,-0.674888 11.747936,-1.95731 16.814442,-1.832575 10.802993,0.265967 13.693569,2.241065 21.171943,5.718005 5.642482,2.62337 10.087673,6.179164 15.294371,11.359007 8.997143,8.95074 13.774195,16.570211 18.301727,28.775768 2.3751112,6.402949 3.4396225,6.642288 2.9998692,21.42163 -0.4767157,16.021569 -0.7457969,38.499779 -0.2812971,44.001619 0.3812725,4.51608 0.8720508,7.22888 2.9761868,15.52436 l 1.5475055,6.10098 -0.018944,13.08816 c -0.2568734,20.21874 -1.2219226,38.14982 -6.1786164,56.99796 l -3.557598,6.42133 -6.955136,-2.20467 c -7.164419,-2.73508 -12.885121,-6.41088 -17.59104,-10.7479 z"
             id="path20792"
             sodipodi:nodetypes="cssssssssssssccccccc"
             inkscape:label="tail color" />
          <path
             style="fill:#000000;fill-opacity:0.984026;stroke-width:0.540727"
             d="m -15.81874,229.08955 c -4.52215,-1.09758 -12.2869,-4.64854 -17.39173,-7.9535 -8.9407,-5.78839 -25.843235,-21.09864 -34.709375,-31.43963 -30.05475,-35.05425 -48.693965,-73.10107 -51.409885,-104.939151 -0.48966,-5.74013 -0.40245,-7.61374 0.79138,-17.00136 1.47019,-11.56089 2.6845,-17.355027 4.83402,-23.065777 4.56643,-12.131888 12.86749,-20.84731 22.941875,-24.087053 11.517459,-3.703812 22.615308,-5.199851 29.571346,-3.986348 12.597169,2.197614 23.815089,8.598094 34.402409,19.628566 8.35098,8.700525 14.20027,18.518632 18.15938,30.480732 l 1.93113,5.83478 -0.99475,18.92755 c -1.59717,30.389671 -0.35348,46.065561 4.56507,57.540011 1.06555,14.70045 -1.75339,80.22395 -12.69087,80.06118 z m 9.30392,-75.71137 c -1.68225,-7.08256 -2.89984,-11.11843 -4.02223,-17.55332 -1.04701,-6.00262 -1.24422,-25.36042 -0.49586,-48.671991 l 0.46001,-14.32931 -1.9837,-5.62538 c -4.29361,-12.17593 -9.89476,-21.053697 -19.1803,-30.400547 -11.47292,-11.5487 -23.572637,-16.839041 -38.695418,-16.918745 -6.051537,-0.0319 -7.781727,0.168544 -12.436756,1.44078 -21.093856,5.765024 -28.883696,17.093349 -32.539236,47.319922 -0.79826,6.60053 -0.84242,8.70478 -0.30637,14.59968 3.03348,33.359491 20.701798,70.139901 49.692841,103.446331 5.188684,5.96104 19.900159,20.50748 26.385869,26.08986 7.18792,6.18681 16.8588,10.97296 24.49216,13.25984 8.1737,-14.59176 8.50295,-58.29163 8.62899,-72.65712 z m -32.91638,40.71889 c -0.73222,-1.31524 -0.87186,-8.54639 -0.23102,-11.96242 l 0.37152,-1.98036 -6.91917,-4.52359 c -3.80552,-2.48794 -11.844136,-7.38075 -17.86357,-10.87286 -14.520089,-8.42365 -13.972447,-9.65269 0.9634,-2.16208 6.041952,3.03015 18.65866,10.51345 22.07088,13.09082 1.46925,1.10977 1.90497,1.22884 2.28199,0.62354 0.60066,-0.96432 6.51675,-18.76282 8.31602,-25.01867 1.1661,-4.05446 1.26439,-4.89842 0.62966,-5.40729 -0.41367,-0.33165 -3.88205,-3.14128 -7.7075,-6.24364 -9.00859,-7.30576 -16.387316,-12.14706 -17.229693,-11.30468 -0.102363,0.10247 -1.187718,5.90017 -2.411604,12.8837 -1.223883,6.98355 -2.419304,12.89144 -2.656477,13.12861 -0.23717,0.23717 -0.865116,0.26474 -1.395435,0.0613 -0.859928,-0.32999 -0.923813,-0.84348 -0.590731,-4.7491 0.205381,-2.40852 0.95038,-7.54237 1.655559,-11.40858 0.705177,-3.86621 1.443991,-8.2743 1.641825,-9.79575 l 0.359696,-2.76633 -7.224683,-4.48815 c -8.224296,-5.10912 -17.078236,-9.856 -17.883116,-9.5877 -0.29887,0.0996 -1.094902,2.31152 -1.768958,4.91532 -1.20563,4.65723 -1.636346,5.67616 -2.172673,5.13983 -0.438771,-0.43878 -0.450989,-4.22106 -0.02703,-8.36288 l 0.394845,-3.85719 -3.354269,-2.07037 c -3.68585,-2.27503 -3.523694,-2.95133 0.38806,-1.61847 1.386577,0.47246 2.714232,0.85901 2.950344,0.85901 0.803235,0 2.049695,-5.65729 3.157154,-14.329311 0.607672,-4.75841 1.587598,-10.27106 2.177615,-12.25034 0.590015,-1.97927 1.072755,-3.73929 1.072755,-3.91116 0,-0.495 -5.141314,-2.97044 -11.337407,-5.45873 -5.35253,-2.14952 -10.011357,-3.51 -14.786317,-4.31793 -1.73107,-0.2929 -2.03427,-0.53875 -1.89255,-1.53461 0.14376,-1.01009 0.56508,-1.21091 2.84284,-1.35496 3.16209,-0.19998 6.247969,0.83443 16.180719,5.42396 3.827329,1.76845 7.764093,3.34606 8.74837,3.50579 1.774906,0.28802 1.808261,0.25326 4.063896,-4.23511 2.944229,-5.85858 5.936296,-10.25274 9.625943,-14.13667 1.716175,-1.80656 2.755293,-3.309767 2.465743,-3.566967 -0.275266,-0.24452 -3.445065,-1.47236 -7.044011,-2.72854 -9.175495,-3.20263 -11.839724,-4.96455 -8.478579,-5.60707 4.172832,-0.79769 16.912365,4.76087 28.139006,12.277697 11.318393,7.57825 20.678633,16.68305 20.678633,20.11431 0,1.12962 -0.49869,0.77767 -3.6499,-2.57585 -8.12758,-8.64941 -18.081357,-16.68223 -22.99832,-18.56005 l -2.340487,-0.89384 -5.513082,5.5861 c -5.80257,5.87941 -7.636555,8.22939 -9.325182,11.94884 -1.676443,3.69262 -1.444931,4.48568 1.785341,6.11569 3.742831,1.88866 18.017854,10.47447 23.007675,13.8381 2.170855,1.46337 4.334985,2.58432 4.809225,2.491 0.47423,-0.0934 2.14231,-2.48131 3.70686,-5.30662 2.93962,-5.30841 4.92887,-7.4224 6.4391,-6.84287 0.79917,0.30667 0.79654,0.48271 -0.0315,2.10178 -0.49705,0.9719 -2.19078,3.53696 -3.76383,5.70014 -1.57308,2.16317 -3.02861,4.70016 -3.23453,5.63774 -0.32301,1.47063 -0.16145,1.85796 1.17648,2.82083 6.75391,4.860551 14.258,13.162091 14.258,15.773151 0,1.12121 -1.07787,0.22389 -6.69509,-5.57365 -3.68232,-3.80049 -7.659,-7.451581 -8.83711,-8.113511 l -2.142,-1.20352 -2.02664,4.666241 c -2.77401,6.38703 -6.788084,18.55307 -6.940257,21.03488 -0.123242,2.00915 -0.04131,2.09898 5.823047,6.38138 3.27142,2.38895 9.10736,6.49303 12.96878,9.12022 7.99789,5.44148 7.51811,5.46588 9.49786,-0.48326 1.08003,-3.24554 2.56672,-5.05763 4.14938,-5.05763 1.19062,0 0.76537,2.12734 -1.47213,7.36435 -1.1896,2.78434 -2.16291,5.29765 -2.16291,5.58513 0,0.28748 1.64246,1.83348 3.6499,3.43558 4.53736,3.62112 5.12932,4.3309 4.90807,5.8847 -0.34214,2.40282 -2.03506,1.80741 -5.5159,-1.93995 -1.82243,-1.96198 -3.68202,-3.56722 -4.13241,-3.56722 -0.92368,0 -6.89741,15.28451 -8.66474,22.16987 -1.79278,6.98445 -1.86245,6.80072 4.61816,12.17908 3.12271,2.59159 5.67764,4.93403 5.67764,5.20543 0,0.27141 -0.37101,0.63584 -0.82449,0.80987 -0.89916,0.34503 -3.27687,-1.18112 -7.71224,-4.95021 -1.57248,-1.33628 -3.0662,-2.42962 -3.31938,-2.42962 -0.5608,0 -0.96918,2.17485 -1.44963,7.72043 -0.39574,4.56801 -0.86362,5.42209 -1.92543,3.51485 z m -17.509264,-71.93204 c 0.115469,-0.37174 0.849832,-2.98752 1.631792,-5.81283 0.781938,-2.8253 2.64538,-7.77596 4.141017,-11.00147 1.495625,-3.22551 3.047405,-6.794491 3.448415,-7.931061 l 0.72911,-2.06651 -5.77308,-4.05203 c -11.273565,-7.91275 -21.645583,-13.88138 -24.122453,-13.88138 -1.7923,0 -5.124276,14.94128 -6.046098,27.111981 -0.330183,4.35937 -0.28155,4.69468 0.727351,5.0149 0.594654,0.18872 3.973298,2.07596 7.508097,4.19384 8.012886,4.80094 15.939573,9.07642 16.852902,9.0901 0.381086,0.006 0.787419,-0.29379 0.902947,-0.66554 z"
             id="path14611"
             sodipodi:nodetypes="cssssssssscscccsscsssssssscccscsssssssscsssssscscssscsssssssscsssssssssssscsssscssscscssscscsssssscsssssssssscccssscssssscc"
             inkscape:label="tail" />
        </g>
        <g
           id="g25338"
           transform="translate(2.9150449,2.8036745)"
           inkscape:label="penguin">
          <path
             id="rect3004"
             style="display:inline;fill:#ffffff;stroke-width:0.264583"
             d="m 165.55352,115.4493 15.86766,-11.97987 12.33623,-1.62092 32.21,13.99738 10.57473,-23.687944 -17.72098,-18.827194 -47.77925,1.422343 -14.04936,7.778774 -0.25954,23.645491 z"
             sodipodi:nodetypes="cccccccccc"
             inkscape:label="eyes"
             transform="translate(-154.31645,-60.763496)" />
          <path
             id="rect4473"
             style="display:inline;fill:#ffffff;stroke-width:0.264583"
             d="m 159.97962,138.22256 26.94171,14.89891 43.40197,-18.60553 39.53267,102.74379 -21.47739,28.14659 -12.04581,55.29712 -42.84919,14.94705 -33.78426,-16.66266 -34.61332,-64.59356 z"
             sodipodi:nodetypes="cccccccccc"
             inkscape:label="stomach"
             transform="translate(-154.31645,-60.763496)" />
          <path
             id="rect5622"
             style="display:inline;fill:#ffbc00;stroke-width:0.264583"
             d="m 181.42118,103.46943 12.33623,-1.62092 32.21,13.99738 7.11093,6.59778 -2.75504,12.07227 -43.40197,18.60553 -26.94171,-14.89891 -3.21587,-17.12993 8.78977,-5.64333 z"
             sodipodi:nodetypes="cccccccccc"
             inkscape:label="beak"
             transform="translate(-154.31645,-60.763496)" />
          <path
             id="rect6961"
             style="display:inline;fill:#ffbc00;stroke-width:0.264583"
             d="m 254.18324,259.45421 59.76607,10.8927 8.74007,24.60983 11.02369,16.64393 -1.1353,9.17886 -30.04943,17.70304 -27.99931,22.11873 -17.75055,4.14979 -14.87341,-9.87994 -4.68422,-14.44876 z"
             sodipodi:nodetypes="ccccccccccc"
             inkscape:label="right foot"
             transform="translate(-154.31645,-60.763496)" />
          <path
             id="rect7872"
             style="display:inline;fill:#ffbc00;stroke-width:0.264583"
             d="m 64.37743,290.19253 21.364176,-11.8141 16.903714,-18.67584 16.81261,3.19712 45.21225,67.46701 0.62102,15.75019 -12.3732,13.30887 -20.85163,0.0681 -29.11578,-10.87807 -34.947393,-5.74846 -5.867934,-8.89007 3.430783,-19.39197 z"
             sodipodi:nodetypes="ccccccccccccc"
             inkscape:label="left foot"
             transform="translate(-154.31645,-60.763496)" />
          <path
             style="fill:#000000;fill-opacity:1;stroke-width:0.264583"
             d="m 101.23784,305.57496 c -2.96418,-0.4749 -6.908898,-1.92736 -9.76553,-3.59572 -4.651735,-2.71677 -9.81452,-9.17861 -11.417559,-14.29044 l -0.477086,-1.52135 h -3.060536 c -4.533456,0 -9.269032,-0.4213 -17.71868,-1.57276 -9.446771,-1.28733 -12.298101,-1.46344 -17.621023,-1.08834 -4.756348,0.33515 -8.518427,0.87022 -16.801041,2.38948 -5.192739,0.9525 -7.825775,1.33689 -11.910296,1.73874 l -1.459256,0.14358 -0.789702,1.50969 c -0.4343366,0.83034 -1.4636007,2.34331 -2.2872512,3.36217 -7.76459479,9.60477 -22.9710988,11.94588 -40.2035548,6.18955 -2.242536,-0.74908 -4.792691,-1.84724 -13.464524,-5.7981 -5.880325,-2.67907 -11.068589,-3.78394 -26.687526,-5.68333 -3.109232,-0.37809 -6.740638,-0.87344 -8.069791,-1.10075 -15.507804,-2.652 -19.761934,-10.79653 -14.28123,-27.34138 0.972439,-2.93555 1.00746,-3.16852 0.994336,-6.61458 -0.0094,-2.45748 -0.246324,-5.18155 -0.759526,-8.73125 -0.831432,-5.75083 -0.993748,-10.41673 -0.441804,-12.7 0.193474,-0.80037 0.830413,-2.46055 1.415415,-3.6893 0.854975,-1.7958 1.485522,-2.65398 3.214074,-4.37435 2.586127,-2.57387 4.609118,-3.69488 10.808102,-5.98906 7.816043,-2.89264 8.719465,-3.57232 13.842381,-10.4144 1.74049,-2.32457 3.917823,-5.02767 4.838517,-6.00687 l 1.673987,-1.78037 -0.284924,-3.33411 c -0.518274,-6.06466 -0.316815,-10.50992 0.787818,-17.38336 3.260889,-20.29048 15.899508,-45.38196 35.388367,-70.2566 7.02541,-8.966897 8.668814,-11.188381 10.362668,-14.00781 C -3.952399,78.678473 -0.81914492,64.242291 -2.2095409,44.20663 -2.4519072,40.71413 -2.7159534,33.629912 -2.7963074,28.463922 -2.9928743,15.826898 -2.5158173,10.158348 -0.59188107,2.2701725 1.6794425,-7.0423115 5.2888751,-13.84122 11.00592,-19.576029 c 6.932178,-6.953716 15.918418,-10.971377 28.465576,-12.726681 4.516358,-0.631825 15.536431,-0.629621 19.696711,0.0039 10.190869,1.551943 18.298265,5.484093 24.607136,11.934648 3.239593,3.312351 5.575477,6.670307 7.922837,11.3895061 3.018967,6.0694173 4.977865,12.3411959 6.356614,20.3518999 1.504864,8.743421 1.981456,16.587658 1.994586,32.82935 0.0117,14.512591 0.18874,17.27854 1.41377,22.092708 2.85612,11.224154 7.85914,19.563159 22.62022,37.703128 15.66519,19.25105 25.12081,35.34015 30.44751,51.8076 3.13505,9.69195 4.47363,18.67854 4.16536,27.96427 -0.21156,6.37215 -0.96438,11.18192 -2.65014,16.93159 -0.65368,2.22951 -0.60595,2.91216 0.20357,2.91216 0.65685,0 4.38671,2.70349 5.67573,4.11387 2.63332,2.88126 3.74748,5.53268 5.84153,13.90158 2.33248,9.3217 2.80929,10.42337 6.33854,14.64511 9.81543,11.74142 11.01344,19.2395 4.14525,25.94465 -2.63787,2.57524 -5.20189,4.12811 -14.38494,8.71191 -8.30884,4.14745 -10.78635,5.50913 -14.47377,7.95501 -3.89638,2.58448 -6.48475,4.88128 -10.49038,9.30871 -8.04053,8.88722 -15.77303,13.95357 -25.22837,16.52971 -2.57074,0.7004 -3.41992,0.80351 -7.27604,0.88352 -2.40109,0.0498 -4.72281,0.0334 -5.15938,-0.0366 z m 9.62608,-8.81783 c 6.26676,-1.27706 9.35304,-2.99931 17.36142,-9.68819 1.60073,-1.33699 4.75589,-4.12398 7.01146,-6.19337 8.72911,-8.00846 12.01973,-10.2784 24.72214,-17.05388 8.33186,-4.44423 10.48793,-5.77146 12.67206,-7.80071 2.90984,-2.70346 2.37784,-4.77742 -3.22043,-12.55503 -5.25801,-7.30486 -5.71926,-8.31871 -10.34174,-22.73252 -1.93604,-6.037 -3.31129,-8.40979 -5.48584,-9.46516 -1.08472,-0.52641 -1.79052,-0.63754 -4.61513,-0.72662 -4.34962,-0.13719 -5.61274,0.21373 -8.22828,2.28589 -4.92337,3.90057 -9.61284,6.18731 -15.0219,7.32513 -2.22335,0.4677 -7.05768,0.52308 -9.05484,0.10369 -2.06576,-0.43376 -4.92553,-1.84857 -6.41294,-3.1726 -2.47988,-2.20752 -5.69472,-7.21272 -7.15857,-11.14523 l -0.4656,-1.25079 -0.76972,0.96856 c -2.481082,3.12203 -3.771715,8.46683 -4.842494,20.05386 -1.127472,12.20047 -2.643685,20.90002 -5.556652,31.88229 -3.693642,13.92552 -4.767686,20.21909 -4.193162,24.57069 0.507027,3.84035 2.965858,8.01701 6.86135,11.65498 2.297509,2.14561 4.046998,3.0784 6.451338,3.43971 2.44235,0.36703 7.1551,0.13766 10.28753,-0.5007 z M -8.0350733,293.06781 c 4.6374659,-1.19904 8.68747471,-3.95835 10.6890212,-7.28255 1.3703141,-2.27584 2.7624616,-6.56667 2.751746,-8.48135 -0.024183,-4.32051 -4.1627584,-11.63085 -14.1549622,-25.00313 -7.3837007,-9.88139 -11.8603877,-16.78982 -19.1901057,-29.61423 -2.530731,-4.42788 -5.503947,-9.4176 -6.607148,-11.08826 -2.657404,-4.02434 -5.435627,-6.92531 -7.699738,-8.03992 -1.612794,-0.79399 -1.947605,-0.85707 -5.063831,-0.95417 l -3.336853,-0.10397 -1.183648,0.90026 c -0.651008,0.49514 -3.002373,2.97895 -5.225259,5.51955 -8.924266,10.19982 -10.45568,11.38452 -20.143319,15.58267 -6.840186,2.9642 -8.803873,4.42002 -9.584307,7.10551 -0.504568,1.73623 -0.419521,7.27856 0.181518,11.82902 0.326035,2.46841 0.493516,5.42539 0.502028,8.86354 0.01241,5.01584 -0.01085,5.24439 -0.836525,8.21524 -1.14694,4.12678 -1.664243,7.2613 -1.664243,10.08417 0,3.53118 0.621155,4.59343 3.440364,5.88346 2.05246,0.93916 3.714438,1.28137 14.864284,3.06064 18.741617,2.99078 21.749419,3.76336 33.311486,8.55647 6.640124,2.7527 13.581298,4.93773 17.333473,5.45642 2.956687,0.40873 9.151946,0.14775 11.6160187,-0.48937 z M 46.718711,263.39508 c 6.341772,-0.48223 9.469459,-1.27175 17.237904,-4.35134 7.720981,-3.06075 11.318801,-5.05058 12.677817,-7.01164 1.914364,-2.76244 3.279037,-9.35172 5.423995,-26.18965 1.383266,-10.85866 2.202813,-15.82047 3.063804,-18.54935 2.247371,-7.12292 7.897352,-15.10226 18.955069,-26.76978 l 3.70738,-3.91184 -0.44858,-1.59873 c -0.24672,-0.87931 -1.50274,-4.72263 -2.79116,-8.54072 C 101.13592,156.3698 96.641014,145.35098 88.667367,127.54974 82.282622,113.29574 74.199186,93.262923 71.478698,84.951829 71.002363,83.49662 70.527539,82.212042 70.423537,82.097213 70.319534,81.982381 65.720676,84.083564 60.203852,86.766508 44.719882,94.296679 41.351734,95.575064 36.262725,95.8534 29.689845,96.212892 22.949786,94.014012 15.910678,89.213734 l -2.512581,-1.713441 -1.224769,4.811186 C 9.4039154,103.1904 6.3062694,111.60772 -2.8880966,133.23828 c -11.5679194,27.21457 -13.5313924,32.93496 -15.6175214,45.50013 -1.280829,7.71468 -2.389582,11.57149 -3.943067,13.71602 l -0.753866,1.04068 7.710117,5.92107 c 11.6726759,8.96414 14.0121588,10.87726 17.7294038,14.49814 9.0287472,8.79467 13.7454552,17.22385 13.7811852,24.62813 0.0227,4.70286 -1.29848,7.84672 -4.693386,11.1683 l -2.0852096,2.04018 0.759476,0.92138 c 1.7245296,2.09214 6.6778236,5.43917 10.8403856,7.32502 2.798416,1.2678 6.842012,2.63787 9.343192,3.16566 2.699189,0.56957 10.63326,0.68093 16.536098,0.23209 z M 39.782654,85.340512 c 3.335129,-1.114377 8.371925,-3.441115 11.884128,-5.48985 3.197919,-1.865408 4.581684,-2.547787 8.663866,-4.272433 5.539447,-2.340311 10.05377,-5.948 11.92448,-9.529628 1.806895,-3.459451 1.324822,-6.915076 -1.308275,-9.378029 -1.636413,-1.530673 -3.911285,-2.657105 -10.503908,-5.201148 -3.288614,-1.26905 -7.46561,-3.156 -10.736617,-4.850251 -7.958338,-4.122095 -9.676614,-4.651984 -15.105295,-4.658225 -3.931452,-0.0045 -5.624219,0.348628 -8.76944,1.82949 -2.294681,1.080402 -3.921027,2.241309 -7.805208,5.57145 -1.382448,1.185257 -4.467998,3.65514 -6.856781,5.488631 -2.3887796,1.833488 -4.7728867,3.763269 -5.2980159,4.288398 -1.6877136,1.687714 -2.0981537,4.641202 -0.9765956,7.027495 1.4398334,3.063473 3.4051822,5.029867 8.7479285,8.752583 1.756061,1.22359 4.20487,3.072636 5.441797,4.108995 3.78928,3.174852 7.801779,5.64568 10.689725,6.582553 3.026913,0.981956 6.545352,0.887024 10.008211,-0.270031 z M 26.593477,77.025933 C 21.019582,75.584973 15.650858,72.372018 10.056592,67.1293 7.6458972,64.870097 6.9113186,63.737487 6.9179358,62.289967 c 0.00492,-1.078084 0.2092299,-1.418881 0.9982306,-1.665179 0.6555872,-0.20465 0.986441,0.08907 4.1034436,3.642852 2.852375,3.252073 8.728154,7.392914 12.620226,8.893853 2.812634,1.084667 5.317826,1.431237 9.129257,1.262946 3.676489,-0.16233 6.020797,-0.771816 10.908467,-2.836035 6.069689,-2.563423 13.067403,-7.026542 17.259019,-11.007743 1.24278,-1.180391 2.527488,-2.23021 2.85491,-2.332932 1.348981,-0.423217 2.394966,0.579356 1.916739,1.837187 -0.617249,1.623486 -5.114872,5.622388 -9.655802,8.585118 -2.909093,1.898039 -11.581442,6.125758 -14.926331,7.2765 -5.424133,1.866064 -10.992755,2.253041 -15.532618,1.079399 z m -1.987283,-27.00171 c -0.900295,-0.48917 -1.108472,-1.071103 -0.693156,-1.937632 0.478857,-0.999095 2.323278,-1.926388 4.112792,-2.067732 1.758032,-0.138856 2.79001,0.28243 2.920254,1.192142 0.08943,0.624633 -0.600276,1.625036 -1.120603,1.625412 -0.159345,1.13e-4 -1.044551,0.357301 -1.967124,0.79375 -1.879923,0.889349 -2.256605,0.934992 -3.252163,0.39406 z m 15.674999,-0.610124 c -1.07501,-0.536123 -2.127695,-1.237187 -2.339298,-1.557917 -0.353097,-0.535197 -0.326512,-0.641364 0.323321,-1.291196 0.652819,-0.65282 0.835906,-0.697788 2.347079,-0.576485 2.853753,0.229071 4.706636,1.596284 4.309221,3.179707 -0.17168,0.684033 -1.16056,1.266238 -2.102892,1.238078 -0.320575,-0.0096 -1.462419,-0.456062 -2.537431,-0.992187 z m -27.877649,0.530606 1.917785,-1.436532 -0.793798,-0.904084 c -1.982853,-2.258345 -3.011178,-5.469316 -2.994763,-9.351219 0.02363,-5.590272 2.109108,-9.019291 5.268772,-8.663151 2.995748,0.337664 5.308574,4.383728 5.593536,9.785337 0.08259,1.565611 0.224901,2.846564 0.316243,2.846564 0.09134,0 0.460457,-0.206856 0.820256,-0.459681 0.359801,-0.252826 1.725747,-0.891165 3.035435,-1.418532 l 2.38125,-0.95885 -0.0097,-3.939281 c -0.01021,-4.147995 -0.208692,-5.240814 -1.59481,-8.78082 -1.475856,-3.769193 -4.560308,-7.390161 -7.404246,-8.69216 -2.13914,-0.979332 -4.71829,-0.988187 -6.812142,-0.02339 -3.7386202,1.722662 -6.8039637,6.599039 -7.845824,12.481205 -0.3989652,2.252485 -0.3426355,6.854039 0.1161018,9.484638 0.4135014,2.371193 1.3744575,5.321954 2.389669,7.337851 0.9266502,1.840037 3.0372496,4.524171 3.3910482,4.312528 0.169071,-0.101139 1.170402,-0.830328 2.225185,-1.620422 z m 57.520745,-0.250921 c 2.272583,-3.575087 3.467436,-7.051741 3.907007,-11.368196 1.294516,-12.711781 -6.641716,-24.414384 -16.556852,-24.414384 -4.212154,0 -6.934402,1.234514 -10.440615,4.734721 -2.199907,2.196142 -2.712458,2.885292 -3.773564,5.073748 -1.880209,3.877805 -2.544297,6.887276 -2.544297,11.530087 0,3.704539 0.01619,3.814482 0.595313,4.038793 0.543567,0.210545 6.674336,2.282658 7.60677,2.570982 0.335936,0.103876 0.399489,-0.336259 0.413893,-2.86645 0.03946,-6.930933 3.329779,-11.978259 7.788191,-11.947041 1.743149,0.0122 2.756633,0.493151 4.045508,1.919782 2.037352,2.255107 3.107224,5.378439 3.139133,9.164243 0.03375,4.004673 -0.61876,6.30732 -2.397194,8.459473 -0.587245,0.710647 -1.007017,1.352788 -0.932825,1.426977 0.175299,0.1753 7.572462,3.136802 7.919336,3.170558 0.145521,0.01415 0.699109,-0.65782 1.230196,-1.493293 z"
             id="path85"
             inkscape:label="body" />
        </g>
      </g>
    </g>
  </g>
</svg>
