id,name,model_id:id,group_id:id,perm_read,perm_write,perm_create,perm_unlink
access_res_partner,access.res.partner,model_res_partner,base.group_user,1,1,1,1
access_car,access.car,model_car,base.group_user,1,1,1,1
access_route_route,access.route_route,model_route_route,base.group_user,1,1,1,1
access_route_order,access.route_order,model_route_order,base.group_user,1,1,1,1
access_route_order_line,access.route_order_line,model_route_order_line,base.group_user,1,1,1,1
access_product_template,access.product_template,model_product_template,base.group_user,1,1,1,1