2005,a1,$200
2006,a2,$199
2007,a2,$50
2006,a3,$20
2008,a3,$10
2009,a3,$1
malonjo01,Art Ross,1917,NHL,,
cleghod01,Art Ross,1918,NHL,,
malonjo01,Art Ross,1919,NHL,,
lalonne01,Art Ross,1920,NHL,,
broadpu01,Art Ross,1921,NHL,,