{"cid": "UgjEH89Tgm7jg3gCoAEC", "text": "Jacken4President!", "time": "há 5 anos", "author": "royblackoncrack", "channel": "UCSLUTD6J02uT8eKJfRY_S6g", "votes": "0", "photo": "https://yt3.ggpht.com/ytc/AKedOLR1ETGoPRdnFRmS1wF7JpV8bU_BDj6lSJJcfw=s176-c-k-c0x00ffffff-no-rj", "heart": false, "time_parsed": 1493769780.467009}
{"cid": "UgzTUpUNBkWikh6WhOp4AaABAg", "text": "Du behältst recht, sie haben sich mit der Grünen-Jugend in Göttingen zusammengetan und rufen nun zur Zerstörung von Wahlplakaten der AfD auf.\nNachzulesen auf der Homepage der Grünen jugend.", "time": "há 8 anos", "author": "DieFila", "channel": "UCqwNtOdGhxeR0DTmMlkKu4g", "votes": "0", "photo": "https://yt3.ggpht.com/ytc/AKedOLRkkm2_Cq6gTKzN_912pjf9mlDtf5hECZuy5Q=s176-c-k-c0x00ffffff-no-rj", "heart": false, "time_parsed": 1399075380.473313}
{"cid": "UgwoaF00coW6TEFjCHJ4AaABAg", "text": "Demokratie und freie Meinungsäusserung, vielleicht?! Wenn aufgrund dieses Videos die Leute lieber über die AfD reden wollen, ist das völlig legitim! ;)\nAlles andere zeigt nur die Lächerlichkeit der Piraten auf.....und, wie im Video ja eindeutig bewiesen, dass sie auf ihre eigene Satzung sch****en!!!\nWas für ein Clownverein....", "time": "há 8 anos", "author": "Herr Bert", "channel": "UCAc2mHAjOjImy_JCShQU3zA", "votes": "1", "photo": "https://yt3.ggpht.com/ytc/AKedOLSfPJGB5mMSXkGgRHRAvUwAvchcknHBoJ-YKSi1=s176-c-k-c0x00ffffff-no-rj", "heart": false, "time_parsed": 1399075380.475329}
{"cid": "UgyzhAAnQXJiRqMNZTZ4AaABAg", "text": "Sind heute kollektiv aus der Piratenpartei ausgetreten. Dachte noch schade - aber wenn ich das hier sehe, ist es der obligatorische Sargnagel.", "time": "há 8 anos", "author": "Beta Blocker", "channel": "UCQpMuA2KzWLMrj1yj62lKWg", "votes": "1", "photo": "https://yt3.ggpht.com/ytc/AKedOLQft_wAAxoOk22-yivUML_R2BoGglF-tJI4kdXRBg=s176-c-k-c0x00ffffff-no-rj", "heart": false, "time_parsed": 1399075380.4773}
{"cid": "Ugxws8dqi_KJK0dBGw14AaABAg", "text": "Das Thema Piraten hat sich eh erledigt... 3% BTW2013", "time": "há 8 anos", "author": "Stuttgart", "channel": "UCiCRMNxiKOQI492tnfyx8kg", "votes": "0", "photo": "https://yt3.ggpht.com/ytc/AKedOLTEsL0DPx12LEqa5BrX1i8smKja-Oru3joanh8z=s176-c-k-c0x00ffffff-no-rj", "heart": false, "time_parsed": 1399075380.479276}
{"cid": "Ugy1c4kwBGn-nxQ9rqd4AaABAg", "text": "Was sind das da für merkwürdige Menschen?", "time": "há 8 anos", "author": "Porst_GER", "channel": "UCKASgfAs-vz2FotzR6TVXcA", "votes": "0", "photo": "https://yt3.ggpht.com/ytc/AKedOLTQHJN4w7wGFmDIYYkft2dwEfbZyoebXONKg1Da0Q=s176-c-k-c0x00ffffff-no-rj", "heart": false, "time_parsed": 1399075380.481476}
{"cid": "UgzGOt5uoXljCPfnevh4AaABAg", "text": "Oha, das läuft ja wie bei der NPD. Richtig beschämend.", "time": "há 8 anos", "author": "MrWeasedd", "channel": "UCcVO5yWtBiDplKhkENdq_0A", "votes": "1", "photo": "https://yt3.ggpht.com/ytc/AKedOLTEKXYc0AzSlZ6fRuT0iAZcXq4AZ3Y7cWxFkXyS=s176-c-k-c0x00ffffff-no-rj", "heart": false, "time_parsed": 1399075380.484128}
{"cid": "Ugw5RvLq7F6U7R40iVZ4AaABAg", "text": "Die Grünen 2.0\n\nAus meiner tatsächlichen Nerdpartei ist eine linksgrünfaschistoide Hipsterpartei geworden. ", "time": "há 8 anos", "author": "Victoire Sedan", "channel": "UCFgtOKL7mpXLKOJz1HGXq2w", "votes": "1", "photo": "https://yt3.ggpht.com/ytc/AKedOLQ3PL9sOQU5YRxpfQMcfxEKweWR-QdGw0LHXsBr=s176-c-k-c0x00ffffff-no-rj", "heart": false, "time_parsed": 1399075380.488865}
{"cid": "Ugx4oMb51aSbq0zGWfl4AaABAg", "text": "Die Polizisten müssen sich auch denken \"Was sind das denn hier für Spinner?\" ", "time": "há 8 anos", "author": "Maria Rizzo", "channel": "UC7T5fupxLk0R8lFH0FFibcg", "votes": "1", "photo": "https://yt3.ggpht.com/ytc/AKedOLRTHiEJFJkSMMTl3m-pPWaav7Vvj8til86HSeP3=s176-c-k-c0x00ffffff-no-rj", "heart": false, "time_parsed": 1399075380.490921}
{"cid": "UgxVqyn1sWPKSsp2iVl4AaABAg", "text": "Die Piratenpartei zeigt erneut ihre hässliche Fratze.", "time": "há 8 anos", "author": "gggfausto", "channel": "UCovI8CgpZ-zQ7u1j41cq0vg", "votes": "0", "photo": "https://yt3.ggpht.com/ytc/AKedOLQZdbbaiw3f-eU2FGvHyv88jhlXxJc1iJLIxQ=s176-c-k-c0x00ffffff-no-rj", "heart": false, "time_parsed": 1399075380.492928}
{"cid": "UgzOhCqygAUSbKJKMUN4AaABAg", "text": "so ein orden is ja auch was ganz tolles...nicht", "time": "há 8 anos", "author": "Tod dem Marxismus - Alles für Deutschland", "channel": "UCjC3eV0ZP49aTRKzNCigCyA", "votes": "0", "photo": "https://yt3.ggpht.com/WoD8Cri3vwe-TYfsQQg6uzqN5rJwK7SatFFjGvCZX9cWU9Qp-qIS4UR4fMK56If4-FepPW1cxw=s176-c-k-c0x00ffffff-no-rj", "heart": false, "time_parsed": 1399075380.495113}
{"cid": "Ugxz3SYVbVBTeDtQN8B4AaABAg", "text": "Ja ja Vetternwirtschaft, Selbstdarsteller, mangelnde Tranzparenz. Wer braucht das? Die Piraten sind am Ende bevor sie richtig angefangen haben. Sie spielten von Anfang an mit sich selbst. Laßt sie doch, aber nicht mit unseren Geldern.", "time": "há 8 anos", "author": "kgersemi261", "channel": "UCUxIqw5Es7tRJo2KkUhuHqA", "votes": "1", "photo": "https://yt3.ggpht.com/ytc/AKedOLSixB_6zVjRpCCVQwzUO1CImudj0AhkQlI06w=s176-c-k-c0x00ffffff-no-rj", "heart": false, "time_parsed": 1399075380.49941}
{"cid": "UgznBZMZmD-RgmEpuMx4AaABAg", "text": "die piraten sind schon lange unwählbar. aber das ist erbärmlich. kann es kaum erwarten bis diese partei endlich in der bedeutungslosigkeit untergegangen ist.", "time": "há 8 anos", "author": "phisherPhisher", "channel": "UCoxTZVYnVh3H9jhV14HPOeA", "votes": "1", "photo": "https://yt3.ggpht.com/ytc/AKedOLSpRmZ5k3ZI4LsASoKvX_LUIScjX9VaVBwzuFWnxA=s176-c-k-c0x00ffffff-no-rj", "heart": false, "time_parsed": 1399075380.506699}
{"cid": "UgziBUJqqvR7IiGen9t4AaABAg", "text": "Ja, ja,... die Piraten sind längst Mainstream!", "time": "há 8 anos", "author": "Durge1000", "channel": "UC2q5Z3v3mA-tVoqPnPELxaA", "votes": "0", "photo": "https://yt3.ggpht.com/ytc/AKedOLQmBQ9D9N99fd79BeQhrTstMjcJJ2hW42QzNlow=s176-c-k-c0x00ffffff-no-rj", "heart": false, "time_parsed": 1399075380.50879}
{"cid": "UgwqergKNobY1fkfBZl4AaABAg", "text": "Piratenpartei beerdigt eigene Grundsätze\n\nUnglaublich. ein derartiges Gebaren hätte sich keine andere Partei heraus genommen.\n\nOk die Diätenerhöhungung in NRW haben sie sich alle genommen \n( Linke und FDP stimmten dagegen aber haben sie trotzdem in die Tasche gesteckt...)\n\nWas sind das nur für Deppen...PP und Transparenz das ich nicht lache...\n\nIhr habt euch die politische Bedeutungslosigkeit redlich verdient...\n\nMr.SDG", "time": "há 8 anos", "author": "HEIKO SCHWARZ", "channel": "UCIAbST2rBPhOu2vCfOBhEKQ", "votes": "1", "photo": "https://yt3.ggpht.com/ytc/AKedOLS1bAMy7Zji2cW00nEQDmNng9jiGmVDQ3Ys2hzJ=s176-c-k-c0x00ffffff-no-rj", "heart": false, "time_parsed": 1399075380.510775}
{"cid": "UgzS46abheWHDfJThX54AaABAg", "text": "Die AfD ist rassistisch? Soso...Ein NPD Wähler de AfD wählt ist aber spätestens danach kein NPD Wähler.Und jeder  EX-NPD Wähler der AfD wählt ist doch wieder bei den Guten.\nSo und nun mal zu euch: Der Hr. Kissinger hat euch wohl gewaltig den kopf gewaschen. Und wenn es ums große Geld geht (ESM) dann greifen wohl andere Kräfte. lin/alles-schallundrauch.blogspot.de/2012/05/piraten-chef-trifft-henry-kissinger.html\n\nNa dann noch viel Erfolg bei der nächsten Wahl! \n", "time": "há 8 anos", "author": "Norbert Seip", "channel": "UCzwmSXw0rcKoNUdz9GPBpjA", "votes": "0", "photo": "https://yt3.ggpht.com/ytc/AKedOLRQm4USMNlfLn79SGUN8sVZUB8apbAM6CX7sQ=s176-c-k-c0x00ffffff-no-rj", "heart": false, "time_parsed": 1399075380.512747}
{"cid": "UgzIoiSrFc2sQsJRhhp4AaABAg", "text": "Denkt die Frau sich nichts dabei, wenn sie sagt: \"Kamera runter! Abmarsch! Abmarsch!\" Wer hat denn die eingestellt?! Piraten und ihr Personal...", "time": "há 8 anos", "author": "Joachim Rotermund", "channel": "UC6bqJ5YGRd9rBBX1iZcbTkg", "votes": "1", "photo": "https://yt3.ggpht.com/ytc/AKedOLRMtG-x1lIfZc24rlbiuPNkUzYmQlPIdXhCy1j2YQ=s176-c-k-c0x00ffffff-no-rj", "heart": false, "time_parsed": 1399075380.51482}
{"cid": "Ugyz0cBXvY1_zqEAKCZ4AaABAg", "text": "1. Die Piraten haben diesen Doppelmitgliedsbeschluß gefaßt. Sie müssen bis jetzt damit leben. Der Deppenanteil der Piraten will dies aber nur in ausnahmsweise. Ziemlich unpolitisch und kindisch. Ausweg: den Beschluß aufheben.\n2. Das Hausverbot ist gegenwärtig unsubstantiiert und intransparent. Wenn die Piraten dies mit sich machen lassen, öffnen sie eine gefährliche Schleuse der Zensur und Willkür. Das ist NICHT piratig.\n3. Peukerts Starauftritt: sehr aussagekräftig. Unpolitischer geht es kaum.", "time": "há 8 anos", "author": "Joachim Rotermund", "channel": "UC6bqJ5YGRd9rBBX1iZcbTkg", "votes": "0", "photo": "https://yt3.ggpht.com/ytc/AKedOLRMtG-x1lIfZc24rlbiuPNkUzYmQlPIdXhCy1j2YQ=s176-c-k-c0x00ffffff-no-rj", "heart": false, "time_parsed": 1399075380.517322}
{"cid": "UgwRjp4X40GTvvrnEcN4AaABAg", "text": "Unglaublich. ein derartiges Gebaren hätte sich keine andere Partei heraus genommen. Es ist in Ordnung das die PP von Demokraten nicht mehr ernst genommen und auch nicht mehr gewählt wird. Ihr habt euch die politische Bedeutungslosigkeit redlich verdient.", "time": "há 8 anos", "author": "TheShaogen", "channel": "UCtCCbiVCi8bPGLXxgHVtMYA", "votes": "0", "photo": "https://yt3.ggpht.com/ytc/AKedOLS92XUKS2A6mMDr9loU-iKg7M4lsXsdl4rY4TMs=s176-c-k-c0x00ffffff-no-rj", "heart": false, "time_parsed": 1399075380.522286}
{"cid": "Ugxa2PfIjd86v9nkCwp4AaABAg", "text": "Jetzt bin ich mal bei Youtube und dann in so nem Kackvideo. LOL", "time": "há 8 anos", "author": "TheAliensHive", "channel": "UCiQF32Vc7wJUWbWwLS0hGIQ", "votes": "0", "photo": "https://yt3.ggpht.com/ytc/AKedOLRninMFIqSzP03MBOTWNSIHiHtaqkc7LY_q6mBR=s176-c-k-c0x00ffffff-no-rj", "heart": false, "time_parsed": 1399075380.524447}
{"cid": "UgzXOd10BsTlQs4jXFR4AaABAg", "text": "Zum einen musste Plagge sich nicht akkreditieren, da er bereits als Mitglied der Partei akkreditiert war. Für den Zugang zur Pressestelle wollte oder brauchte er wohl keine (Ist aber auch eher nachrangig von Belang).\nJournalistisch sich betätigen darf JEDER. Es ist ein FREIBERUF. Man wird nicht erst zum Journalisten wenn ein Sicherheitsaparat oder eine Akkreditierungsstelle das so möchte.\nVielleicht solltest Du einfach mal die Fresse halten. (Nuhr'sche Prinzip = Motto der Piraten seit 2006) m(", "time": "há 8 anos", "author": "Simon Lange", "channel": "UCNDnLB8fB0fwA1cg-18SDjw", "votes": "1", "photo": "https://yt3.ggpht.com/ytc/AKedOLQh-d0WZdg5vgV9LSQU3St2vrLEZPNlvWxqbq6OTaQ=s176-c-k-c0x00ffffff-no-rj", "heart": false, "time_parsed": 1399075380.943555}
{"cid": "Ugwq0kBRu3UaIKlmqFR4AaABAg", "text": "\" Die Polizisten haben in einem späteren Gespräch zugestimmt sie unverpixelt darzustellen.\" (Steht im Artikel, unterm Video hier, sogar bei Popcorn Piaten stehs, dummdummdumm... )\n\nWer lesen kann ist klar im Vorteil. Nächstes mal besser lesen oder fragen, wenn man schon keine Ahnung vom Presserecht hat.\n\nDer Sir Titel ist offiziell verliehen? Urkunde liegt vor? Trolling nervt oder?!\n", "time": "há 8 anos", "author": "Simon Lange", "channel": "UCNDnLB8fB0fwA1cg-18SDjw", "votes": "1", "photo": "https://yt3.ggpht.com/ytc/AKedOLQh-d0WZdg5vgV9LSQU3St2vrLEZPNlvWxqbq6OTaQ=s176-c-k-c0x00ffffff-no-rj", "heart": false, "time_parsed": 1399075380.957425}
{"cid": "UgwMYCv2vkkA5MQnSFB4AaABAg", "text": "oh, wie nett, sogar mit Kamera wegschubsen und Pöbeln.\nDie Piratenpartei, schneller in der Mitte angekommen als man meint. Gelegenheit den politischen Mitbewerber vorzuführen wurde vertan.\n\nGeniesst euren Abstieg ins Nichts.", "time": "há 8 anos", "author": "Kand1nSky", "channel": "UCaj-2fXkfvh3ofvxVnt2i2Q", "votes": "0", "photo": "https://yt3.ggpht.com/ytc/AKedOLSIohTzOWnwVfn2wZ-ihWO4rgTImh_-c1ozvMTg=s176-c-k-c0x00ffffff-no-rj", "heart": false, "time_parsed": 1399075380.966981}
{"cid": "UgySBh5zYDd2UNos93Z4AaABAg", "text": "Bitte KEINE AfD Diskussionen hier.Hier wird bitte OnTopic diskutiert. Für politische Diskussion über eine Verortung der AfD im politischen Spektrum gibt es andere weil bessere Lokalitäten. Ich würde ungern Kommentare schließen, denn ich habe nicht die Lust und Laune hier Kommentare auf ggf. vorliegende Rechtsverstösse zu sichten.\n\nDanke.", "time": "há 8 anos", "author": "Simon Lange", "channel": "UCNDnLB8fB0fwA1cg-18SDjw", "votes": "2", "photo": "https://yt3.ggpht.com/ytc/AKedOLQh-d0WZdg5vgV9LSQU3St2vrLEZPNlvWxqbq6OTaQ=s176-c-k-c0x00ffffff-no-rj", "heart": false, "time_parsed": 1399075380.980217}
{"cid": "UgwPddDWzLJ8m-tFziJ4AaABAg", "text": "Mal davon abgesehen dass der Vergleich hinkt. Auf Deinem Mensaausweis zB steht der Eigentumsvorbehalt.\n\nGemeinhin gilt wer Besitzer der Eigentümer. Im Streitfall muss halt Eigentum nachgewiesen werden. Im Beispiel die Uni durch den Aufdruck auf dem Ausweis.;)\nKann man doof finden, ist aber nunmal so.;)\n\nAber wie gesagt. Hatte schon alles etwas von Kindergarten.", "time": "há 8 anos", "author": "Simon Lange", "channel": "UCNDnLB8fB0fwA1cg-18SDjw", "votes": "0", "photo": "https://yt3.ggpht.com/ytc/AKedOLQh-d0WZdg5vgV9LSQU3St2vrLEZPNlvWxqbq6OTaQ=s176-c-k-c0x00ffffff-no-rj", "heart": false, "time_parsed": 1399075380.987482}
{"cid": "UgwXFgjnjV9FtnOpDk14AaABAg", "text": "Dazu die vielen anderen Thesen - Aber wie immer wenn es gegen Rechtspopulisten geht.. Die Presse lügt und ALLES ist erfunden.. Nicht ", "time": "há 8 anos", "author": "AngelBarachiel", "channel": "UChYVHG9Fi_QpVLYxlYblMSg", "votes": "0", "photo": "https://yt3.ggpht.com/ytc/AKedOLSOp4f8-M2E_-FbOUcR3XR2JkdeDq_qFOi2ajnexA=s176-c-k-c0x00ffffff-no-rj", "heart": false, "time_parsed": 1399075380.992804}
{"cid": "Ugxe5UbzeTjYBH4o8ml4AaABAg", "text": "Achso - Die Presse lügt natürlich und alles ist gelogen? Keine Ahnung - SoSo.. Wiederlege doch erstmal meine Thesen und die Links, das die AfD nicht Rassistisch ist bzw teilweise aus Rassisten besteht oder was macht da ne Ex DVU´lerin im VORSTAND NA??\n", "time": "há 8 anos", "author": "AngelBarachiel", "channel": "UChYVHG9Fi_QpVLYxlYblMSg", "votes": "0", "photo": "https://yt3.ggpht.com/ytc/AKedOLSOp4f8-M2E_-FbOUcR3XR2JkdeDq_qFOi2ajnexA=s176-c-k-c0x00ffffff-no-rj", "heart": false, "time_parsed": 1399075380.996644}
{"cid": "UgzYOniVl96G-e8wK8p4AaABAg", "text": "Laut Satzung steht zwar jeden eine doppelte Parteimitgliedschaft vor aber NICHT bei einer Rassistischen Partei wie die #AfD, #NPD usw. Auf den ersten Parteitag der AfD war deren Motto:Klas­si­sche Bil­dung statt #Mul­tit­kul­ti-Um­er­zie­hung“ Google: Zur Demokratiefeindlichkeit der AfD./ Frau Winkelsett (ehm. REP-Funk.) / AfD-Chef will NPD-Wähler gewinnen und Freie Wähler hadern mit Adenauer-Enkel / Der Umgang war so nicht Richtig.Das Hausverbot schon - jetzt bitte ein Parteiauschlussverfahren.", "time": "há 8 anos", "author": "AngelBarachiel", "channel": "UChYVHG9Fi_QpVLYxlYblMSg", "votes": "0", "photo": "https://yt3.ggpht.com/ytc/AKedOLSOp4f8-M2E_-FbOUcR3XR2JkdeDq_qFOi2ajnexA=s176-c-k-c0x00ffffff-no-rj", "heart": false, "time_parsed": 1399075381.000246}
