<?xml version="1.0" encoding="utf-8"?>
<!-- Generator: Adobe Illustrator 22.0.1, SVG Export Plug-In . SVG Version: 6.00 Build 0)  -->
<svg version="1.1" xmlns="http://www.w3.org/2000/svg" xmlns:xlink="http://www.w3.org/1999/xlink" x="0px" y="0px"
	 viewBox="0 0 424.8 133" style="enable-background:new 0 0 424.8 133;" xml:space="preserve">
<style type="text/css">
	.st0{fill:#57068C;}
</style>
<g id="Capa_1">
	<g>
		<path class="st0" d="M126.8,45.5c1.2,0.6,2.1,1.5,2.8,2.6c0.7,1.1,1,2.4,1,3.7c0,1.4-0.3,2.6-1,3.7c-0.7,1.1-1.6,2-2.8,2.7
			s-2.5,1-3.9,1c-1.4,0-2.7-0.3-3.9-1s-2.1-1.5-2.8-2.6c-0.7-1.1-1-2.4-1-3.8c0-1.4,0.3-2.6,1-3.7c0.7-1.1,1.6-2,2.7-2.6
			s2.5-1,3.9-1C124.3,44.5,125.6,44.9,126.8,45.5z M120.8,47.9c-0.7,0.4-1.2,0.9-1.6,1.6c-0.4,0.7-0.6,1.5-0.6,2.3
			c0,0.8,0.2,1.6,0.6,2.3c0.4,0.7,0.9,1.2,1.6,1.6c0.7,0.4,1.4,0.6,2.2,0.6c0.8,0,1.5-0.2,2.2-0.6s1.2-1,1.6-1.6s0.6-1.5,0.6-2.3
			c0-0.8-0.2-1.6-0.6-2.3c-0.4-0.7-0.9-1.2-1.6-1.6c-0.7-0.4-1.4-0.6-2.2-0.6C122.2,47.3,121.4,47.5,120.8,47.9z"/>
		<path class="st0" d="M136.8,46.7c-0.2,0.2-0.4,0.5-0.4,1v0.9h2.6v2.2h-2.6V59h-3.1v-8.3h-1.5v-2.2h1.5v-1c0-0.8,0.2-1.5,0.5-2
			c0.4-0.6,0.8-1,1.5-1.3c0.6-0.3,1.3-0.4,2-0.4c0.7,0,1.4,0.1,2.2,0.4l-0.5,2.4c-0.2-0.1-0.4-0.2-0.7-0.2c-0.2-0.1-0.4-0.1-0.7-0.1
			C137.3,46.3,137,46.5,136.8,46.7z M143.3,43.7c0.3,0.3,0.5,0.7,0.5,1.3s-0.2,0.9-0.5,1.3c-0.3,0.3-0.7,0.5-1.2,0.5
			c-0.5,0-0.9-0.2-1.2-0.5s-0.5-0.7-0.5-1.3c0-0.5,0.2-0.9,0.5-1.3c0.3-0.3,0.7-0.5,1.2-0.5C142.5,43.2,142.9,43.4,143.3,43.7z
			 M140.5,48.1h3.1v11h-3.1V48.1z"/>
		<path class="st0" d="M151.6,50.6c-0.8,0-1.4,0.3-1.9,0.8c-0.5,0.5-0.7,1.2-0.7,2.1s0.2,1.6,0.7,2.1c0.5,0.6,1.1,0.8,1.9,0.8
			c1.1,0,2-0.4,2.5-1.3l2.2,1.5c-0.5,0.8-1.1,1.4-1.9,1.8c-0.8,0.4-1.8,0.6-2.9,0.6c-1.1,0-2.1-0.2-2.9-0.7s-1.5-1.1-2-2
			c-0.5-0.8-0.7-1.8-0.7-2.9c0-1.1,0.2-2.1,0.7-2.9c0.5-0.8,1.1-1.5,2-2c0.8-0.5,1.8-0.7,2.9-0.7c1,0,2,0.2,2.8,0.6s1.5,1,2,1.7
			l-2.1,1.5C153.4,51,152.6,50.6,151.6,50.6z"/>
		<path class="st0" d="M161.1,43.7c0.3,0.3,0.5,0.7,0.5,1.3s-0.2,0.9-0.5,1.3c-0.3,0.3-0.7,0.5-1.2,0.5c-0.5,0-0.9-0.2-1.2-0.5
			c-0.3-0.3-0.5-0.7-0.5-1.3c0-0.5,0.2-0.9,0.5-1.3c0.3-0.3,0.7-0.5,1.2-0.5C160.3,43.2,160.7,43.4,161.1,43.7z M158.3,48.1h3.1v11
			h-3.1V48.1z"/>
		<path class="st0" d="M174.3,49.1c0.7,0.8,1.1,1.8,1.1,3.1V59h-3.1v-6c0-0.7-0.2-1.2-0.6-1.6c-0.4-0.4-0.9-0.6-1.6-0.6
			c-0.8,0-1.4,0.3-1.8,0.8c-0.4,0.5-0.7,1.2-0.7,2V59h-3.1v-11h3.1V50c0.8-1.3,2-2,3.8-2C172.6,47.9,173.6,48.3,174.3,49.1z"/>
		<path class="st0" d="M184.6,59v-1.3c-0.4,0.5-0.8,0.8-1.4,1.1c-0.6,0.2-1.3,0.4-2,0.4c-1.2,0-2.1-0.3-2.7-0.9
			c-0.7-0.6-1-1.5-1-2.5c0-1,0.4-1.8,1.1-2.4c0.7-0.6,1.8-0.9,3.1-0.9h3v-0.2c0-0.6-0.2-1-0.6-1.4c-0.4-0.3-1-0.5-1.7-0.5
			c-1,0-2.1,0.3-3.3,1l-1-2.2c0.9-0.4,1.7-0.8,2.4-1s1.6-0.3,2.5-0.3c1.5,0,2.6,0.3,3.4,1c0.8,0.7,1.2,1.7,1.2,2.9l0,7.1H184.6z
			 M183.7,56.4c0.5-0.3,0.8-0.7,0.8-1.2v-1h-2.5c-0.6,0-1.1,0.1-1.4,0.3s-0.4,0.5-0.4,0.9c0,0.4,0.2,0.8,0.5,1
			c0.3,0.3,0.7,0.4,1.2,0.4C182.7,56.9,183.2,56.8,183.7,56.4z"/>
		<path class="st0" d="M207.5,43.9V59h-3.1v-1.6c-0.4,0.6-0.9,1-1.5,1.3c-0.6,0.3-1.2,0.4-2,0.4c-1,0-1.9-0.2-2.7-0.7
			c-0.8-0.5-1.4-1.1-1.8-2c-0.4-0.9-0.6-1.8-0.6-3c0-1.1,0.2-2.1,0.6-2.9s1-1.5,1.8-2c0.8-0.5,1.7-0.7,2.7-0.7
			c1.5,0,2.7,0.6,3.5,1.7v-5.8H207.5z M203.6,55.8c0.5-0.6,0.8-1.3,0.8-2.2c0-0.9-0.3-1.6-0.8-2.2c-0.5-0.6-1.2-0.8-2-0.8
			c-0.8,0-1.5,0.3-2,0.8s-0.8,1.3-0.8,2.2c0,0.9,0.3,1.6,0.8,2.2s1.2,0.8,2,0.8C202.4,56.6,203.1,56.3,203.6,55.8z"/>
		<path class="st0" d="M219.4,49.5c0.9,1,1.4,2.4,1.4,4.3c0,0.3,0,0.6,0,0.7h-7.8c0.2,0.7,0.5,1.2,1,1.6c0.5,0.4,1.1,0.6,1.8,0.6
			c0.5,0,1-0.1,1.5-0.3c0.5-0.2,0.9-0.5,1.3-0.9l1.6,1.7c-0.6,0.6-1.2,1.1-2,1.4c-0.8,0.3-1.7,0.5-2.7,0.5c-1.2,0-2.2-0.2-3-0.7
			c-0.9-0.5-1.5-1.1-2-2c-0.5-0.8-0.7-1.8-0.7-2.9c0-1.1,0.2-2.1,0.7-2.9c0.5-0.8,1.1-1.5,2-2c0.9-0.5,1.8-0.7,2.9-0.7
			C217.2,48,218.5,48.5,219.4,49.5z M217.8,52.6c0-0.7-0.3-1.3-0.7-1.7c-0.4-0.4-1-0.7-1.7-0.7c-0.7,0-1.2,0.2-1.7,0.6
			s-0.7,1-0.9,1.7H217.8z"/>
		<path class="st0" d="M236.2,47.7c-0.8-0.3-1.5-0.4-2.1-0.4c-0.6,0-1,0.1-1.3,0.3c-0.3,0.2-0.5,0.5-0.5,0.9c0,0.5,0.2,0.9,0.7,1.2
			c0.5,0.3,1.2,0.5,2.2,0.8c1,0.3,1.8,0.6,2.4,0.9c0.6,0.3,1.2,0.7,1.6,1.3c0.4,0.6,0.7,1.3,0.7,2.3c0,0.9-0.2,1.7-0.7,2.4
			c-0.5,0.7-1.1,1.2-2,1.5c-0.8,0.3-1.8,0.5-2.9,0.5c-1.2,0-2.3-0.2-3.4-0.6c-1.1-0.4-2.1-1-2.9-1.7l1.3-2.6
			c0.7,0.6,1.5,1.2,2.5,1.6c0.9,0.4,1.8,0.6,2.6,0.6c0.7,0,1.2-0.1,1.6-0.4s0.6-0.6,0.6-1.1c0-0.4-0.1-0.7-0.4-0.9
			c-0.3-0.2-0.6-0.4-1-0.6c-0.4-0.1-0.9-0.3-1.6-0.5c-1-0.3-1.8-0.5-2.4-0.8c-0.6-0.3-1.2-0.7-1.6-1.2c-0.4-0.6-0.7-1.3-0.7-2.2
			c0-0.9,0.2-1.6,0.7-2.3c0.5-0.6,1.1-1.1,1.9-1.5c0.8-0.3,1.8-0.5,2.9-0.5c1,0,1.9,0.1,2.9,0.4c1,0.3,1.8,0.7,2.5,1.1l-1.2,2.7
			C237.8,48.3,237.1,47.9,236.2,47.7z"/>
		<path class="st0" d="M250.2,48.6c0.9,0.5,1.6,1.1,2.1,2s0.7,1.8,0.7,2.9c0,1.1-0.2,2.1-0.7,2.9c-0.5,0.8-1.2,1.5-2.1,2
			c-0.9,0.5-1.9,0.7-3.1,0.7c-1.2,0-2.2-0.2-3.1-0.7c-0.9-0.5-1.6-1.1-2.1-2c-0.5-0.8-0.7-1.8-0.7-2.9c0-1.1,0.2-2.1,0.7-2.9
			s1.2-1.5,2.1-2s1.9-0.7,3.1-0.7C248.3,48,249.3,48.2,250.2,48.6z M245.2,51.4c-0.5,0.6-0.8,1.3-0.8,2.2c0,0.9,0.3,1.6,0.8,2.2
			c0.5,0.6,1.2,0.8,2,0.8c0.8,0,1.5-0.3,2-0.8c0.5-0.6,0.8-1.3,0.8-2.2c0-0.9-0.3-1.6-0.8-2.2s-1.2-0.8-2-0.8
			C246.3,50.6,245.7,50.8,245.2,51.4z"/>
		<path class="st0" d="M259.1,46.7c-0.2,0.2-0.4,0.5-0.4,1v0.9h2.6v2.2h-2.6V59h-3.1v-8.3h-1.5v-2.2h1.5v-1c0-0.8,0.2-1.5,0.5-2
			c0.4-0.6,0.8-1,1.5-1.3c0.6-0.3,1.3-0.4,2-0.4c0.7,0,1.4,0.1,2.2,0.4l-0.5,2.4c-0.2-0.1-0.4-0.2-0.7-0.2c-0.2-0.1-0.4-0.1-0.7-0.1
			C259.7,46.3,259.4,46.5,259.1,46.7z"/>
		<path class="st0" d="M269.9,58.4c-0.4,0.2-0.9,0.4-1.4,0.6c-0.5,0.1-1,0.2-1.5,0.2c-1,0-1.8-0.3-2.5-0.9s-1-1.4-1-2.5v-5.1h-1.5
			v-2.2h1.5v-3h3.1v3h3v2.2h-3v4.5c0,0.8,0.3,1.3,1,1.3c0.5,0,1-0.1,1.5-0.4L269.9,58.4z"/>
		<path class="st0" d="M270.3,48.1l3.2,0l2.4,7.8l2.4-7.8h3.1l2.4,7.8l2.4-7.8h3.1l-4,11h-3.1l-2.4-7.2l-2.3,7.2h-3.1L270.3,48.1z"
			/>
		<path class="st0" d="M296.8,59v-1.3c-0.4,0.5-0.8,0.8-1.4,1.1c-0.6,0.2-1.3,0.4-2,0.4c-1.2,0-2.1-0.3-2.7-0.9
			c-0.7-0.6-1-1.5-1-2.5c0-1,0.4-1.8,1.1-2.4c0.7-0.6,1.8-0.9,3.1-0.9h3v-0.2c0-0.6-0.2-1-0.6-1.4c-0.4-0.3-1-0.5-1.7-0.5
			c-1,0-2.1,0.3-3.3,1l-1-2.2c0.9-0.4,1.7-0.8,2.4-1s1.6-0.3,2.5-0.3c1.5,0,2.6,0.3,3.4,1c0.8,0.7,1.2,1.7,1.2,2.9l0,7.1H296.8z
			 M296,56.4c0.5-0.3,0.8-0.7,0.8-1.2v-1h-2.5c-0.6,0-1.1,0.1-1.4,0.3s-0.4,0.5-0.4,0.9c0,0.4,0.2,0.8,0.5,1
			c0.3,0.3,0.7,0.4,1.2,0.4C294.9,56.9,295.5,56.8,296,56.4z"/>
		<path class="st0" d="M307.3,48.5c0.6-0.4,1.3-0.5,2.1-0.5v3c-0.1,0-0.3,0-0.5,0c-1,0-1.7,0.3-2.3,0.8c-0.6,0.5-0.8,1.2-0.8,2.1V59
			h-3.1v-11h3.1v2C306.2,49.3,306.7,48.8,307.3,48.5z"/>
		<path class="st0" d="M320,49.5c0.9,1,1.4,2.4,1.4,4.3c0,0.3,0,0.6,0,0.7h-7.8c0.2,0.7,0.5,1.2,1,1.6c0.5,0.4,1.1,0.6,1.8,0.6
			c0.5,0,1-0.1,1.5-0.3c0.5-0.2,0.9-0.5,1.3-0.9l1.6,1.7c-0.6,0.6-1.2,1.1-2,1.4c-0.8,0.3-1.7,0.5-2.7,0.5c-1.2,0-2.2-0.2-3-0.7
			c-0.9-0.5-1.5-1.1-2-2c-0.5-0.8-0.7-1.8-0.7-2.9c0-1.1,0.2-2.1,0.7-2.9c0.5-0.8,1.1-1.5,2-2c0.9-0.5,1.8-0.7,2.9-0.7
			C317.7,48,319.1,48.5,320,49.5z M318.4,52.6c0-0.7-0.3-1.3-0.7-1.7c-0.4-0.4-1-0.7-1.7-0.7c-0.7,0-1.2,0.2-1.7,0.6s-0.7,1-0.9,1.7
			H318.4z"/>
		<path class="st0" d="M329.8,44.8h3.2v11.4h6.1V59h-9.3V44.8z"/>
		<path class="st0" d="M343.8,43.7c0.3,0.3,0.5,0.7,0.5,1.3s-0.2,0.9-0.5,1.3c-0.3,0.3-0.7,0.5-1.2,0.5c-0.5,0-0.9-0.2-1.2-0.5
			c-0.3-0.3-0.5-0.7-0.5-1.3c0-0.5,0.2-0.9,0.5-1.3c0.3-0.3,0.7-0.5,1.2-0.5C343.1,43.2,343.5,43.4,343.8,43.7z M341,48.1h3.1v11
			H341V48.1z"/>
		<path class="st0" d="M356.7,48.7c0.8,0.5,1.4,1.1,1.8,2c0.4,0.9,0.6,1.8,0.6,3c0,1.1-0.2,2.1-0.6,2.9c-0.4,0.8-1,1.5-1.8,1.9
			c-0.8,0.5-1.7,0.7-2.7,0.7c-0.8,0-1.4-0.1-2-0.4c-0.6-0.3-1.1-0.7-1.5-1.3V59h-3.1V43.9h3.1v5.8c0.4-0.6,0.9-1,1.5-1.3
			s1.3-0.4,2-0.4C355,48,355.9,48.2,356.7,48.7z M355.2,55.7c0.5-0.6,0.8-1.3,0.8-2.2c0-0.9-0.3-1.6-0.8-2.2
			c-0.5-0.6-1.2-0.8-1.9-0.8c-0.8,0-1.5,0.3-2,0.8c-0.5,0.6-0.8,1.3-0.8,2.2c0,0.9,0.3,1.6,0.8,2.2c0.5,0.6,1.2,0.8,2,0.8
			C354,56.5,354.7,56.2,355.2,55.7z"/>
		<path class="st0" d="M365.9,48.5c0.6-0.4,1.3-0.5,2.1-0.5v3c-0.1,0-0.3,0-0.5,0c-1,0-1.7,0.3-2.3,0.8c-0.6,0.5-0.8,1.2-0.8,2.1V59
			h-3.1v-11h3.1v2C364.8,49.3,365.3,48.8,365.9,48.5z"/>
		<path class="st0" d="M378.6,49.5c0.9,1,1.4,2.4,1.4,4.3c0,0.3,0,0.6,0,0.7h-7.8c0.2,0.7,0.5,1.2,1,1.6c0.5,0.4,1.1,0.6,1.8,0.6
			c0.5,0,1-0.1,1.5-0.3c0.5-0.2,0.9-0.5,1.3-0.9l1.6,1.7c-0.6,0.6-1.2,1.1-2,1.4c-0.8,0.3-1.7,0.5-2.7,0.5c-1.2,0-2.2-0.2-3-0.7
			c-0.9-0.5-1.5-1.1-2-2c-0.5-0.8-0.7-1.8-0.7-2.9c0-1.1,0.2-2.1,0.7-2.9c0.5-0.8,1.1-1.5,2-2c0.9-0.5,1.8-0.7,2.9-0.7
			C376.3,48,377.7,48.5,378.6,49.5z M377,52.6c0-0.7-0.3-1.3-0.7-1.7c-0.4-0.4-1-0.7-1.7-0.7c-0.7,0-1.2,0.2-1.7,0.6s-0.7,1-0.9,1.7
			H377z"/>
		<path class="st0" d="M119.3,82.3c0.8,0.8,1.8,1.2,3.2,1.2c1.3,0,2.4-0.4,3.2-1.2c0.8-0.8,1.2-1.9,1.2-3.3v-8.4h1.6V79
			c0,1.8-0.5,3.3-1.6,4.3s-2.5,1.6-4.4,1.6s-3.3-0.5-4.4-1.6s-1.6-2.5-1.6-4.3v-8.4h1.6V79C118.2,80.4,118.6,81.5,119.3,82.3z"/>
		<path class="st0" d="M141.1,75.2c0.7,0.7,1.1,1.8,1.1,3.1v6.6h-1.6v-6.2c0-0.9-0.3-1.7-0.8-2.2c-0.5-0.5-1.3-0.8-2.2-0.8
			c-1,0-1.9,0.3-2.5,1c-0.6,0.6-1,1.5-1.1,2.5v5.7h-1.6V74.1h1.6v2.4c0.7-1.6,2.1-2.4,4.2-2.4C139.3,74,140.3,74.4,141.1,75.2z"/>
		<path class="st0" d="M147.3,70.2c0.2,0.2,0.3,0.5,0.3,0.8c0,0.3-0.1,0.6-0.3,0.8c-0.2,0.2-0.4,0.3-0.7,0.3c-0.3,0-0.5-0.1-0.7-0.3
			c-0.2-0.2-0.3-0.5-0.3-0.8s0.1-0.6,0.3-0.8c0.2-0.2,0.4-0.3,0.7-0.3C146.8,69.9,147.1,70,147.3,70.2z M145.8,74.1h1.6v10.7h-1.6
			V74.1z"/>
		<path class="st0" d="M149.4,74.1h1.7l3.4,9.1l3.4-9.1h1.6l-4.2,10.7h-1.6L149.4,74.1z"/>
		<path class="st0" d="M169.2,75.7c0.9,1.1,1.2,2.5,1.2,4.4h-8.7c0.1,1.1,0.6,1.9,1.3,2.5c0.7,0.6,1.6,1,2.6,1
			c0.6,0,1.3-0.1,1.8-0.4c0.6-0.2,1.1-0.6,1.5-1l0.9,0.9c-0.5,0.6-1.1,1-1.9,1.3c-0.7,0.3-1.5,0.5-2.4,0.5c-1,0-2-0.2-2.8-0.7
			c-0.8-0.5-1.4-1.1-1.9-1.9s-0.7-1.8-0.7-2.8c0-1,0.2-2,0.7-2.8c0.4-0.8,1.1-1.5,1.9-1.9s1.7-0.7,2.8-0.7
			C167.1,74,168.4,74.6,169.2,75.7z M169,78.8c-0.1-1-0.4-1.9-1-2.5c-0.6-0.6-1.5-0.9-2.5-0.9c-1,0-1.9,0.3-2.6,0.9
			c-0.7,0.6-1.1,1.4-1.2,2.5H169z"/>
		<path class="st0" d="M176.3,74.7c0.6-0.4,1.4-0.6,2.3-0.6v1.5c-1.1,0-2,0.3-2.7,0.9c-0.7,0.6-1.1,1.5-1.2,2.6v5.7h-1.6V74.1h1.6
			v2.4C175.2,75.7,175.7,75.1,176.3,74.7z"/>
		<path class="st0" d="M185.2,75.6c-0.5-0.1-1-0.2-1.5-0.2c-0.6,0-1.1,0.1-1.5,0.4c-0.4,0.2-0.6,0.6-0.6,1.1c0,0.3,0.1,0.6,0.3,0.8
			s0.5,0.4,0.8,0.5c0.3,0.1,0.8,0.3,1.3,0.5c0.7,0.2,1.4,0.5,1.8,0.7s0.9,0.5,1.2,0.9c0.3,0.4,0.5,0.9,0.5,1.6c0,1-0.4,1.7-1.1,2.3
			c-0.8,0.5-1.7,0.8-2.8,0.8c-0.8,0-1.5-0.1-2.3-0.4c-0.7-0.3-1.4-0.6-1.9-1.1l0.6-1.2c0.5,0.4,1,0.7,1.6,1s1.3,0.4,1.9,0.4
			c0.7,0,1.2-0.1,1.7-0.4c0.4-0.3,0.6-0.7,0.6-1.2c0-0.5-0.2-0.9-0.6-1.2c-0.4-0.3-1.1-0.5-1.9-0.8c-0.7-0.2-1.3-0.4-1.7-0.6
			c-0.4-0.2-0.8-0.5-1.1-0.9c-0.3-0.4-0.5-0.9-0.5-1.6c0-1,0.4-1.7,1.1-2.2c0.7-0.5,1.6-0.7,2.7-0.7c0.6,0,1.2,0.1,1.8,0.3
			c0.6,0.2,1.1,0.4,1.6,0.7l-0.6,1.2C186.1,75.9,185.7,75.7,185.2,75.6z"/>
		<path class="st0" d="M191.7,70.2c0.2,0.2,0.3,0.5,0.3,0.8c0,0.3-0.1,0.6-0.3,0.8c-0.2,0.2-0.4,0.3-0.7,0.3c-0.3,0-0.5-0.1-0.7-0.3
			c-0.2-0.2-0.3-0.5-0.3-0.8s0.1-0.6,0.3-0.8c0.2-0.2,0.4-0.3,0.7-0.3C191.3,69.9,191.5,70,191.7,70.2z M190.2,74.1h1.6v10.7h-1.6
			V74.1z"/>
		<path class="st0" d="M205.6,69.7v15.1H204v-2.3c-0.4,0.8-1,1.3-1.7,1.8c-0.7,0.4-1.5,0.6-2.5,0.6c-1,0-1.9-0.2-2.7-0.7
			c-0.8-0.5-1.4-1.1-1.8-1.9c-0.4-0.8-0.7-1.8-0.7-2.8c0-1.1,0.2-2,0.7-2.8c0.4-0.8,1-1.5,1.8-1.9c0.8-0.5,1.7-0.7,2.7-0.7
			c0.9,0,1.8,0.2,2.5,0.6s1.3,1,1.7,1.8v-6.7H205.6z M202.1,83c0.6-0.3,1-0.8,1.4-1.4s0.5-1.3,0.5-2.1c0-0.8-0.2-1.5-0.5-2.1
			c-0.3-0.6-0.8-1.1-1.4-1.5c-0.6-0.3-1.2-0.5-2-0.5c-0.7,0-1.4,0.2-2,0.5c-0.6,0.3-1,0.8-1.4,1.5s-0.5,1.3-0.5,2.1
			c0,0.8,0.2,1.5,0.5,2.1s0.8,1.1,1.4,1.4c0.6,0.3,1.3,0.5,2,0.5C200.9,83.5,201.6,83.4,202.1,83z"/>
		<path class="st0" d="M216.3,84.8v-1.7c-0.9,1.2-2.2,1.7-3.9,1.7c-0.7,0-1.4-0.1-1.9-0.4c-0.6-0.3-1-0.7-1.3-1.2
			c-0.3-0.5-0.5-1-0.5-1.6c0-0.9,0.4-1.7,1.1-2.2c0.7-0.6,1.7-0.8,3-0.8h3.5v-0.7c0-0.8-0.2-1.4-0.7-1.9c-0.5-0.4-1.2-0.7-2.1-0.7
			c-1.1,0-2.2,0.4-3.4,1.2l-0.7-1.1c0.8-0.5,1.5-0.9,2.1-1.1s1.4-0.3,2.3-0.3c1.3,0,2.3,0.3,3,1c0.7,0.6,1.1,1.6,1.1,2.7l0,7.1
			H216.3z M215,82.9c0.6-0.4,1.1-1,1.3-1.8v-1.3h-3.3c-1.8,0-2.7,0.6-2.7,1.7c0,0.6,0.2,1.1,0.7,1.4c0.4,0.4,1,0.5,1.8,0.5
			C213.6,83.5,214.4,83.3,215,82.9z"/>
		<path class="st0" d="M231.3,69.7v15.1h-1.6v-2.3c-0.4,0.8-1,1.3-1.7,1.8c-0.7,0.4-1.5,0.6-2.5,0.6c-1,0-1.9-0.2-2.7-0.7
			c-0.8-0.5-1.4-1.1-1.8-1.9c-0.4-0.8-0.7-1.8-0.7-2.8c0-1.1,0.2-2,0.7-2.8c0.4-0.8,1-1.5,1.8-1.9c0.8-0.5,1.7-0.7,2.7-0.7
			c0.9,0,1.8,0.2,2.5,0.6s1.3,1,1.7,1.8v-6.7H231.3z M227.9,83c0.6-0.3,1-0.8,1.4-1.4s0.5-1.3,0.5-2.1c0-0.8-0.2-1.5-0.5-2.1
			c-0.3-0.6-0.8-1.1-1.4-1.5c-0.6-0.3-1.2-0.5-2-0.5c-0.7,0-1.4,0.2-2,0.5c-0.6,0.3-1,0.8-1.4,1.5s-0.5,1.3-0.5,2.1
			c0,0.8,0.2,1.5,0.5,2.1s0.8,1.1,1.4,1.4c0.6,0.3,1.3,0.5,2,0.5C226.6,83.5,227.3,83.4,227.9,83z"/>
		<path class="st0" d="M251.5,69.7v15.1h-1.6v-2.3c-0.4,0.8-1,1.3-1.7,1.8c-0.7,0.4-1.5,0.6-2.5,0.6c-1,0-1.9-0.2-2.7-0.7
			c-0.8-0.5-1.4-1.1-1.8-1.9c-0.4-0.8-0.7-1.8-0.7-2.8c0-1.1,0.2-2,0.7-2.8c0.4-0.8,1-1.5,1.8-1.9c0.8-0.5,1.7-0.7,2.7-0.7
			c0.9,0,1.8,0.2,2.5,0.6s1.3,1,1.7,1.8v-6.7H251.5z M248,83c0.6-0.3,1-0.8,1.4-1.4s0.5-1.3,0.5-2.1c0-0.8-0.2-1.5-0.5-2.1
			c-0.3-0.6-0.8-1.1-1.4-1.5c-0.6-0.3-1.2-0.5-2-0.5c-0.7,0-1.4,0.2-2,0.5c-0.6,0.3-1,0.8-1.4,1.5s-0.5,1.3-0.5,2.1
			c0,0.8,0.2,1.5,0.5,2.1s0.8,1.1,1.4,1.4c0.6,0.3,1.3,0.5,2,0.5C246.8,83.5,247.4,83.4,248,83z"/>
		<path class="st0" d="M263.6,75.7c0.9,1.1,1.2,2.5,1.2,4.4H256c0.1,1.1,0.6,1.9,1.3,2.5c0.7,0.6,1.6,1,2.6,1c0.6,0,1.3-0.1,1.8-0.4
			c0.6-0.2,1.1-0.6,1.5-1l0.9,0.9c-0.5,0.6-1.1,1-1.9,1.3c-0.7,0.3-1.5,0.5-2.4,0.5c-1,0-2-0.2-2.8-0.7c-0.8-0.5-1.4-1.1-1.9-1.9
			s-0.7-1.8-0.7-2.8c0-1,0.2-2,0.7-2.8c0.4-0.8,1.1-1.5,1.9-1.9s1.7-0.7,2.8-0.7C261.5,74,262.7,74.6,263.6,75.7z M263.3,78.8
			c-0.1-1-0.4-1.9-1-2.5c-0.6-0.6-1.5-0.9-2.5-0.9c-1,0-1.9,0.3-2.6,0.9c-0.7,0.6-1.1,1.4-1.2,2.5H263.3z"/>
		<path class="st0" d="M274,70.6h1.6v12.7h6.2v1.5H274V70.6z"/>
		<path class="st0" d="M291.1,84.8v-1.7c-0.9,1.2-2.2,1.7-3.9,1.7c-0.7,0-1.4-0.1-1.9-0.4c-0.6-0.3-1-0.7-1.3-1.2
			c-0.3-0.5-0.5-1-0.5-1.6c0-0.9,0.4-1.7,1.1-2.2c0.7-0.6,1.7-0.8,3-0.8h3.5v-0.7c0-0.8-0.2-1.4-0.7-1.9c-0.5-0.4-1.2-0.7-2.1-0.7
			c-1.1,0-2.2,0.4-3.4,1.2l-0.7-1.1c0.8-0.5,1.5-0.9,2.1-1.1s1.4-0.3,2.3-0.3c1.3,0,2.3,0.3,3,1c0.7,0.6,1.1,1.6,1.1,2.7l0,7.1
			H291.1z M289.8,82.9c0.6-0.4,1.1-1,1.3-1.8v-1.3h-3.3c-1.8,0-2.7,0.6-2.7,1.7c0,0.6,0.2,1.1,0.7,1.4c0.4,0.4,1,0.5,1.8,0.5
			C288.3,83.5,289.1,83.3,289.8,82.9z"/>
		<path class="st0" d="M302.7,70.6h1.6v12.7h6.2v1.5h-7.9V70.6z"/>
		<path class="st0" d="M319.7,84.8v-1.7c-0.9,1.2-2.2,1.7-3.9,1.7c-0.7,0-1.4-0.1-1.9-0.4c-0.6-0.3-1-0.7-1.3-1.2
			c-0.3-0.5-0.5-1-0.5-1.6c0-0.9,0.4-1.7,1.1-2.2c0.7-0.6,1.7-0.8,3-0.8h3.5v-0.7c0-0.8-0.2-1.4-0.7-1.9c-0.5-0.4-1.2-0.7-2.1-0.7
			c-1.1,0-2.2,0.4-3.4,1.2l-0.7-1.1c0.8-0.5,1.5-0.9,2.1-1.1s1.4-0.3,2.3-0.3c1.3,0,2.3,0.3,3,1c0.7,0.6,1.1,1.6,1.1,2.7l0,7.1
			H319.7z M318.4,82.9c0.6-0.4,1.1-1,1.3-1.8v-1.3h-3.3c-1.8,0-2.7,0.6-2.7,1.7c0,0.6,0.2,1.1,0.7,1.4c0.4,0.4,1,0.5,1.8,0.5
			C317,83.5,317.8,83.3,318.4,82.9z"/>
		<path class="st0" d="M334.2,74.1v9.6c0,1-0.2,1.9-0.7,2.7c-0.5,0.8-1.1,1.4-1.9,1.8s-1.8,0.6-2.8,0.6c-1.6,0-3-0.5-4.4-1.6
			l0.7-1.2c0.5,0.5,1.1,0.8,1.7,1c0.6,0.2,1.2,0.3,1.9,0.3c1.2,0,2.1-0.3,2.8-1s1-1.6,1-2.7v-1.6c-0.4,0.7-0.9,1.3-1.6,1.7
			c-0.7,0.4-1.5,0.6-2.4,0.6c-0.9,0-1.8-0.2-2.5-0.7c-0.7-0.4-1.3-1.1-1.7-1.8c-0.4-0.8-0.6-1.7-0.6-2.7c0-1,0.2-1.9,0.6-2.7
			c0.4-0.8,1-1.4,1.7-1.8c0.7-0.4,1.6-0.7,2.6-0.7c0.9,0,1.7,0.2,2.3,0.6c0.7,0.4,1.2,0.9,1.6,1.7v-2.2H334.2z M330.9,82.5
			c0.6-0.3,1-0.8,1.3-1.4c0.3-0.6,0.5-1.2,0.5-2c0-0.7-0.2-1.4-0.5-2c-0.3-0.6-0.7-1-1.3-1.4c-0.6-0.3-1.2-0.5-1.9-0.5
			c-0.7,0-1.3,0.2-1.9,0.5s-1,0.8-1.3,1.4c-0.3,0.6-0.5,1.3-0.5,2s0.2,1.4,0.5,2c0.3,0.6,0.8,1,1.3,1.4c0.6,0.3,1.2,0.5,1.9,0.5
			C329.7,83,330.3,82.9,330.9,82.5z"/>
		<path class="st0" d="M347.2,74.1v10.7h-1.6v-2.4c-0.7,1.6-2,2.5-4.1,2.5c-1.2,0-2.2-0.4-2.9-1.1c-0.7-0.7-1.1-1.8-1.1-3.1v-6.6
			h1.6v6.2c0,0.9,0.3,1.7,0.8,2.2c0.5,0.5,1.3,0.8,2.2,0.8c1.1,0,2-0.4,2.6-1.1s0.9-1.7,0.9-2.9v-5.2H347.2z"/>
		<path class="st0" d="M359.9,75.2c0.7,0.7,1.1,1.8,1.1,3.1v6.6h-1.6v-6.2c0-0.9-0.3-1.7-0.8-2.2c-0.5-0.5-1.3-0.8-2.2-0.8
			c-1,0-1.9,0.3-2.5,1c-0.6,0.6-1,1.5-1.1,2.5v5.7h-1.6V74.1h1.6v2.4c0.7-1.6,2.1-2.4,4.2-2.4C358.2,74,359.2,74.4,359.9,75.2z"/>
		<path class="st0" d="M371.3,84.8v-1.7c-0.9,1.2-2.2,1.7-3.9,1.7c-0.7,0-1.4-0.1-1.9-0.4c-0.6-0.3-1-0.7-1.3-1.2
			c-0.3-0.5-0.5-1-0.5-1.6c0-0.9,0.4-1.7,1.1-2.2c0.7-0.6,1.7-0.8,3-0.8h3.5v-0.7c0-0.8-0.2-1.4-0.7-1.9c-0.5-0.4-1.2-0.7-2.1-0.7
			c-1.1,0-2.2,0.4-3.4,1.2l-0.7-1.1c0.8-0.5,1.5-0.9,2.1-1.1s1.4-0.3,2.3-0.3c1.3,0,2.3,0.3,3,1c0.7,0.6,1.1,1.6,1.1,2.7l0,7.1
			H371.3z M370,82.9c0.6-0.4,1.1-1,1.3-1.8v-1.3h-3.3c-1.8,0-2.7,0.6-2.7,1.7c0,0.6,0.2,1.1,0.7,1.4c0.4,0.4,1,0.5,1.8,0.5
			C368.6,83.5,369.4,83.3,370,82.9z"/>
	</g>
	<polygon class="st0" points="87.7,70.5 87.7,40 87.1,40 73.1,53.4 73.1,70.5 59.4,70.5 59.4,40 58.7,40 44.8,53.4 44.8,84.7 
		56.4,84.7 59.4,84.7 73.1,71.5 73.1,84.7 84.7,84.7 87.7,84.7 102,71 102,70.5 	"/>
</g>
<g id="Guias">
</g>
</svg>
