<?xml version="1.0" encoding="UTF-8" standalone="no"?>
<!-- Created with Inkscape (http://www.inkscape.org/) -->

<svg
   xmlns:dc="http://purl.org/dc/elements/1.1/"
   xmlns:cc="http://creativecommons.org/ns#"
   xmlns:rdf="http://www.w3.org/1999/02/22-rdf-syntax-ns#"
   xmlns:svg="http://www.w3.org/2000/svg"
   xmlns="http://www.w3.org/2000/svg"
   xmlns:xlink="http://www.w3.org/1999/xlink"
   xmlns:sodipodi="http://sodipodi.sourceforge.net/DTD/sodipodi-0.dtd"
   xmlns:inkscape="http://www.inkscape.org/namespaces/inkscape"
   width="93.483376mm"
   height="26.07165mm"
   viewBox="0 0 93.483376 26.07165"
   version="1.1"
   id="svg3267"
   inkscape:version="0.92.4 (5da689c313, 2019-01-14)"
   sodipodi:docname="gulic-logo.svg">
  <defs
     id="defs3261">
    <linearGradient
       y2="0.33527011"
       x2="0.68666941"
       y1="0.33527011"
       x1="0.64009601"
       gradientUnits="userSpaceOnUse"
       id="linearGradient12848"
       xlink:href="#linearGradient12428"
       inkscape:collect="always" />
    <linearGradient
       id="linearGradient12428">
      <stop
         id="stop12430"
         offset="0.0000000"
         style="stop-color:#e6eecd;stop-opacity:1.0000000;" />
      <stop
         id="stop12432"
         offset="1.0000000"
         style="stop-color:#eeeaac;stop-opacity:1.0000000;" />
    </linearGradient>
    <linearGradient
       y2="0.50282091"
       x2="0.52478141"
       y1="0.5"
       x1="0.40763053"
       gradientTransform="translate(-0.146225,0.00627238)"
       gradientUnits="userSpaceOnUse"
       id="linearGradient13145"
       xlink:href="#linearGradient12381"
       inkscape:collect="always" />
    <linearGradient
       id="linearGradient12381">
      <stop
         id="stop12387"
         offset="0.0000000"
         style="stop-color:#d9ecf2;stop-opacity:1.0000000;" />
      <stop
         id="stop12385"
         offset="1.0000000"
         style="stop-color:#73aacd;stop-opacity:1.0000000;" />
    </linearGradient>
    <linearGradient
       y2="0.67282426"
       x2="0.29654428"
       y1="0.6728248"
       x1="0.17133355"
       gradientTransform="translate(-0.143861,-0.157423)"
       gradientUnits="userSpaceOnUse"
       id="linearGradient13147"
       xlink:href="#linearGradient10141"
       inkscape:collect="always" />
    <linearGradient
       id="linearGradient10141">
      <stop
         id="stop12359"
         offset="0.0000000"
         style="stop-color:#f6faf6;stop-opacity:1.0000000;" />
      <stop
         style="stop-color:#d9ecf2;stop-opacity:1.0000000;"
         offset="1.0000000"
         id="stop12379" />
    </linearGradient>
    <linearGradient
       y2="0.48206177"
       x2="0.70071673"
       y1="0.48206177"
       x1="0.58384246"
       gradientTransform="translate(-0.146268,6.377616e-4)"
       gradientUnits="userSpaceOnUse"
       id="linearGradient13149"
       xlink:href="#linearGradient12406"
       inkscape:collect="always" />
    <linearGradient
       id="linearGradient12406">
      <stop
         id="stop12408"
         offset="0.0000000"
         style="stop-color:#6a9dbd;stop-opacity:1.0000000;" />
      <stop
         id="stop12410"
         offset="1.0000000"
         style="stop-color:#cddacd;stop-opacity:1.0000000;" />
    </linearGradient>
    <linearGradient
       y2="0.47202158"
       x2="0.85147619"
       y1="0.47202158"
       x1="0.73293531"
       gradientTransform="matrix(1.06049,0,0,1,-0.0720566,-0.127739)"
       gradientUnits="userSpaceOnUse"
       id="linearGradient13102"
       xlink:href="#linearGradient12436"
       inkscape:collect="always" />
    <linearGradient
       id="linearGradient12436">
      <stop
         id="stop12438"
         offset="0.0000000"
         style="stop-color:#eee68b;stop-opacity:1.0000000;" />
      <stop
         id="stop12440"
         offset="1.0000000"
         style="stop-color:#f6ee4a;stop-opacity:1.0000000;" />
    </linearGradient>
  </defs>
  <sodipodi:namedview
     id="base"
     pagecolor="#ffffff"
     bordercolor="#666666"
     borderopacity="1.0"
     inkscape:pageopacity="0.0"
     inkscape:pageshadow="2"
     inkscape:zoom="1"
     inkscape:cx="172.16168"
     inkscape:cy="54.673644"
     inkscape:document-units="mm"
     inkscape:current-layer="layer1"
     showgrid="false"
     fit-margin-top="0"
     fit-margin-left="0"
     fit-margin-right="0"
     fit-margin-bottom="0"
     inkscape:window-width="504"
     inkscape:window-height="398"
     inkscape:window-x="588"
     inkscape:window-y="97"
     inkscape:window-maximized="0" />
  <metadata
     id="metadata3264">
    <rdf:RDF>
      <cc:Work
         rdf:about="">
        <dc:format>image/svg+xml</dc:format>
        <dc:type
           rdf:resource="http://purl.org/dc/dcmitype/StillImage" />
        <dc:title></dc:title>
      </cc:Work>
    </rdf:RDF>
  </metadata>
  <g
     inkscape:label="Capa 1"
     inkscape:groupmode="layer"
     id="layer1"
     transform="translate(-3.1511663,-5.017747)">
    <g
       id="layer1-9"
       inkscape:label="Layer 1"
       transform="matrix(0.0940871,0,0,0.0940871,-0.1722181,-0.87347062)">
      <g
         transform="translate(3.018535,-285.876)"
         id="g13264">
        <path
           id="path6988"
           style="font-style:normal;font-variant:normal;font-weight:normal;font-stretch:normal;letter-spacing:normal;word-spacing:normal;text-anchor:start;fill:#000000;fill-opacity:1;stroke:none;stroke-width:0.00013889;stroke-linecap:round;stroke-linejoin:round;stroke-miterlimit:10.43299961;stroke-dasharray:none;stroke-dashoffset:0;stroke-opacity:1"
           d="m 1025.8872,570.38338 h -325.14054 c -9.26695,-0.27641 -14.77751,-5.1225 -12.793,-15.10884 3.57921,-18.18306 6.57368,-23.17268 6.5914,-44.24923 0.0177,-45.8953 -15.16731,-47.41912 -15.06099,-69.98937 0.0886,-18.9237 11.64126,-31.38004 11.07426,-50.49866 -0.79734,-26.56051 -29.07659,-31.9116 -51.54407,-42.04677 21.81188,15.73432 26.89718,27.02122 26.29474,38.94598 -2.58695,51.65038 -38.98141,74.51654 -38.98141,127.94234 0,33.49213 9.46185,30.10075 6.39649,46.79542 -0.7442,4.10546 -2.01995,6.49927 -9.49729,7.76617 h -590.922901 v 10.6313 l 993.583311,0.25691 z"
           inkscape:label="Base del Conjunto"
           inkscape:connector-curvature="0" />
        <g
           id="g13191">
          <g
             id="g13171">
            <g
               id="g13166">
              <path
                 d="m 675.61595,367.72945 0.90365,0.72647 0.92141,0.72647 0.93906,0.7442 0.93907,0.79734 0.93916,0.81507 0.93907,0.86822 0.90365,0.92138 0.44294,0.4784 0.44305,0.49613 0.44294,0.51385 0.42519,0.53156 0.42529,0.54928 0.40753,0.567 0.38987,0.58473 0.38977,0.60244 0.37212,0.62016 0.35436,0.63787 0.35435,0.67332 0.3367,0.69104 0.31894,0.70875 0.30118,0.74419 0.26577,0.76191 0.26577,0.79735 0.24811,0.81507 0.23035,0.85049 c 4.92588,19.70335 -12.26142,38.52074 -11.78306,58.57845 0.19494,8.31013 2.26801,9.10925 8.77083,23.74677 -6.64459,-11.07426 -13.05872,-13.9394 -11.94248,-27.55632 0.99224,-12.20826 10.7553,-29.96254 12.73988,-46.52964 0.88589,-7.42419 -2.03765,-16.3722 -10.68447,-25.46195 z"
                 style="font-style:normal;font-variant:normal;font-weight:normal;font-stretch:normal;letter-spacing:normal;word-spacing:normal;text-anchor:start;fill:#ebc300;fill-opacity:1;fill-rule:nonzero;stroke:#ebba00;stroke-width:0;stroke-linecap:butt;stroke-linejoin:miter;stroke-miterlimit:10.43299961;stroke-dasharray:none;stroke-dashoffset:0;stroke-opacity:1"
                 id="path8318"
                 inkscape:connector-curvature="0" />
              <path
                 d="m 675.43387,367.57176 0.90364,0.72647 0.92131,0.72647 0.93917,0.7442 0.93906,0.79734 0.93906,0.81507 0.93917,0.86823 0.90365,0.92137 0.44294,0.47841 0.44295,0.49613 0.44305,0.51384 0.42518,0.53157 0.42529,0.54928 0.40753,0.567 0.38977,0.58473 0.38988,0.60243 0.37211,0.62017 0.35436,0.63787 0.35435,0.67332 0.3367,0.69103 0.31894,0.70876 0.30119,0.74418 0.26576,0.76191 0.26577,0.79735 0.24811,0.81507 0.23035,0.8505 c 4.92578,19.70334 -12.26141,38.52074 -11.78305,58.57845 0.19493,8.31013 2.268,9.10925 8.77082,23.74677 -6.64458,-11.07426 -13.05882,-13.9394 -11.94247,-27.55633 0.99223,-12.20826 10.7553,-29.96253 12.73977,-46.52963 0.886,-7.42419 -2.03765,-16.3722 -10.68436,-25.46196 z"
                 style="font-style:normal;font-variant:normal;font-weight:normal;font-stretch:normal;letter-spacing:normal;word-spacing:normal;text-anchor:start;fill:none;fill-opacity:1;stroke:#ebba00;stroke-width:0.88594133;stroke-linecap:butt;stroke-linejoin:miter;stroke-miterlimit:10.43299961;stroke-dasharray:none;stroke-dashoffset:0;stroke-opacity:1"
                 id="path8320"
                 inkscape:connector-curvature="0" />
              <ellipse
                 transform="matrix(1020.611,0,0,1020.611,-23.9534,171.2588)"
                 id="path11605"
                 style="display:inline;opacity:1;fill:url(#linearGradient12848);fill-opacity:1;fill-rule:nonzero;stroke:none;stroke-width:0.1;stroke-linecap:round;stroke-linejoin:round;stroke-miterlimit:10.43299961;stroke-dasharray:none;stroke-opacity:1"
                 cx="0.66338271"
                 cy="0.33527011"
                 rx="0.023286717"
                 ry="0.048113052" />
            </g>
            <g
               id="g13151">
              <g
                 transform="translate(4.615184)"
                 id="g13134">
                <g
                   id="g12391"
                   transform="matrix(1020.611,0,0,1029.591,46.83373,2.608429)">
                  <path
                     d="m 0.39038247,0.51840917 v 5.486e-4 l -3.473e-5,5.434e-4 -5.208e-5,5.3993e-4 -6.944e-5,5.3645e-4 -1.0417e-4,5.3125e-4 -1.0416e-4,5.2777e-4 -1.3889e-4,5.2431e-4 -1.5625e-4,5.1909e-4 -1.7361e-4,5.1562e-4 -2.0833e-4,5.1042e-4 -2.0834e-4,5.0867e-4 -2.4305e-4,5.0347e-4 -2.6041e-4,4.9826e-4 -2.7778e-4,4.9479e-4 -3.125e-4,4.9132e-4 -3.125e-4,4.8784e-4 -3.4722e-4,4.8264e-4 -3.6458e-4,4.7916e-4 -3.993e-4,4.7569e-4 -3.993e-4,4.7049e-4 -4.3403e-4,4.6701e-4 -4.3402e-4,4.618e-4 -4.6875e-4,4.6007e-4 -5.0347e-4,4.5485e-4 -5.0347e-4,4.4965e-4 -5.3819e-4,4.4618e-4 -5.5555e-4,4.4271e-4 -5.7291e-4,4.3923e-4 -5.9028e-4,4.3403e-4 -6.0763e-4,4.3055e-4 -6.4236e-4,4.2708e-4 -6.5972e-4,4.2187e-4 c -0.00651,0.004069 -0.0153818,0.007222 -0.0266491,0.00946 -0.010677,0.002109 -0.02217,0.00316 -0.0344616,0.00316 -0.0122048,0 -0.0233853,-0.001017 -0.0335588,-0.00305 -0.0108854,-0.002144 -0.0194617,-0.005264 -0.025729,-0.009366 -0.006858,-0.004448 -0.0102777,-0.009691 -0.0102777,-0.0157273 v -0.0476872 h 0.0542705 v 0.0454494 c 0,0.001941 0.001806,0.003479 0.005399,0.004632 0.003368,0.001059 0.007309,0.00158 0.0118402,0.00158 0.004479,0 0.008246,-5.0694e-4 0.011302,-0.001524 0.003403,-0.00112 0.005104,-0.002679 0.005104,-0.004687 v -0.0454494 h 0.0534372 z"
                     style="font-style:normal;font-variant:normal;font-weight:normal;font-stretch:normal;letter-spacing:normal;word-spacing:normal;text-anchor:start;fill:#000000;fill-opacity:1;stroke:#000000;stroke-width:0;stroke-linecap:butt;stroke-linejoin:miter;stroke-miterlimit:10.43299961;stroke-dasharray:none;stroke-dashoffset:0;stroke-opacity:1"
                     id="path8328"
                     inkscape:connector-curvature="0" />
                  <path
                     d="m 0.37855658,0.51817655 v -0.0436664 h -0.0290623 v 0.0412046 c 0,0.003696 -0.002934,0.006632 -0.008802,0.008809 -0.005295,0.001934 -0.0118055,0.002903 -0.0195485,0.002903 -0.007969,0 -0.0147568,-9.8264e-4 -0.0203471,-0.002957 -0.006215,-0.002203 -0.009323,-0.005127 -0.009323,-0.008755 v -0.0412046 h -0.0298956 v 0.0436664 c 0,0.008076 0.005972,0.0144721 0.0178992,0.0191856 0.005399,0.002109 0.0113715,0.003682 0.0179165,0.004733 0.006545,0.001052 0.0137673,0.001582 0.0217013,0.001582 0.0159374,0 0.0295484,-0.002137 0.0407983,-0.006417 0.0124478,-0.004746 0.0186631,-0.0111076 0.0186632,-0.0190836 z"
                     style="font-style:normal;font-variant:normal;font-weight:normal;font-stretch:normal;letter-spacing:normal;word-spacing:normal;text-anchor:start;fill:url(#linearGradient13145);fill-opacity:1;stroke:#000000;stroke-width:0;stroke-linecap:butt;stroke-linejoin:miter;stroke-miterlimit:10.43299961;stroke-dasharray:none;stroke-dashoffset:0;stroke-opacity:1"
                     id="path8330"
                     inkscape:connector-curvature="0" />
                </g>
                <g
                   id="g12367"
                   transform="matrix(1020.687,0,0,1025.083,116.7559,-3.019578)">
                  <path
                     d="m 0.15748704,0.50617926 h -0.0120659 c 0.007014,0.002339 0.0124478,0.005547 0.0163193,0.009621 0.003611,0.003799 0.005434,0.007887 0.005434,0.0122621 0,0.004543 -0.00191,0.008755 -0.005746,0.0126214 -0.004028,0.004102 -0.009809,0.007344 -0.0173436,0.009717 -0.008299,0.002583 -0.0179686,0.003873 -0.0289929,0.003873 h -0.03732615 c -0.01369783,0 -0.02555539,-0.001832 -0.03559526,-0.005493 -0.0090538,-0.00329 -0.0161058,-0.007922 -0.02115785,-0.0138888 -0.0046458,-0.005528 -0.0069652,-0.0115642 -0.0069652,-0.0181075 0,-0.006578 0.0023871,-0.0127707 0.0071683,-0.0185676 0.0050521,-0.006069 0.01217354,-0.0108506 0.02135577,-0.0143437 0.01010757,-0.003832 0.02182625,-0.005745 0.03519422,-0.005745 h 0.07972171 z"
                     style="font-style:normal;font-variant:normal;font-weight:normal;font-stretch:normal;letter-spacing:normal;word-spacing:normal;text-anchor:start;fill:#000000;fill-opacity:1;stroke:#000000;stroke-width:0;stroke-linecap:butt;stroke-linejoin:miter;stroke-miterlimit:10.43299961;stroke-dasharray:none;stroke-dashoffset:0;stroke-opacity:1"
                     id="path8324"
                     inkscape:connector-curvature="0" />
                  <path
                     d="m 0.14601615,0.49545341 v -0.0145815 h -0.06753429 c -0.01067702,0 -0.02006932,0.001729 -0.02817691,0.005189 -0.0073576,0.003153 -0.01305373,0.0075 -0.01708843,0.0130277 -0.0038316,0.005227 -0.0057447,0.0108558 -0.0057447,0.0168992 0,0.005899 0.0018455,0.0113662 0.0055416,0.0163836 0.0039323,0.005297 0.0095746,0.009469 0.01692697,0.012519 0.0080382,0.003365 0.01753461,0.00504 0.02852413,0.00504 h 0.01717003 0.02013876 c 0.0115624,0 0.0207811,-0.002184 0.0276561,-0.006552 0.006163,-0.003967 0.009253,-0.008795 0.009253,-0.014486 0,-0.005696 -0.003073,-0.0105242 -0.009201,-0.0144843 -0.006806,-0.004375 -0.0160416,-0.006559 -0.0276734,-0.006559 h -0.0201214 v 0.0147916 h 0.01515615 c 0.003264,0 0.005816,6.3021e-4 0.007674,0.001892 0.001701,0.001118 0.002552,0.002529 0.002552,0.004231 0,0.001736 -8.6805e-4,0.003215 -0.002587,0.004443 -0.001944,0.001356 -0.004479,0.002042 -0.007639,0.002042 h -0.01515615 l -0.01211798,-3.125e-4 c -0.0072743,0 -0.01310755,-0.002123 -0.01748253,-0.006354 -0.0039757,-0.003825 -0.0059548,-0.00845 -0.0059548,-0.013868 0,-0.005325 0.0019097,-0.00974 0.0057465,-0.0132655 0.0043055,-0.003995 0.01020827,-0.005995 0.01769086,-0.005995 z"
                     style="font-style:normal;font-variant:normal;font-weight:normal;font-stretch:normal;letter-spacing:normal;word-spacing:normal;text-anchor:start;fill:url(#linearGradient13147);fill-opacity:1;stroke:#000000;stroke-width:0;stroke-linecap:round;stroke-linejoin:round;stroke-miterlimit:10.43299961;stroke-dasharray:none;stroke-dashoffset:0;stroke-opacity:1;marker-start:none;marker-mid:none"
                     id="path8326"
                     inkscape:connector-curvature="0" />
                </g>
                <g
                   id="g12416"
                   transform="matrix(1020.73,0,0,1027.318,25.07841,27.03885)">
                  <path
                     d="m 0.56631781,0.52415396 h -0.0672565 c -0.021111,0 -0.0377428,-0.002293 -0.0499129,-0.00687 -0.009566,-0.003595 -0.0162673,-0.00858 -0.020104,-0.0149548 -0.002431,-0.004068 -0.003663,-0.008917 -0.003663,-0.0145468 v -0.001884 -0.00224 -0.0356508 h 0.0551038 v 0.0362151 c 0,0.00312 0.001424,0.005743 0.004271,0.00788 0.003333,0.002406 0.00809,0.003608 0.0142534,0.003608 h 0.0673086 z"
                     style="font-style:normal;font-variant:normal;font-weight:normal;font-stretch:normal;letter-spacing:normal;word-spacing:normal;text-anchor:start;fill:#000000;fill-opacity:1;stroke:#000000;stroke-width:0;stroke-linecap:butt;stroke-linejoin:miter;stroke-miterlimit:10.43299961;stroke-dasharray:none;stroke-dashoffset:0;stroke-opacity:1"
                     id="path8332"
                     inkscape:connector-curvature="0" />
                  <path
                     d="m 0.55444837,0.51722882 v -0.0149947 h -0.0550865 c -0.009965,0 -0.0177603,-0.002292 -0.0233679,-0.00687 -0.004913,-0.004002 -0.007378,-0.008932 -0.007378,-0.0147985 v -0.0323956 h -0.030729 v 0.0324165 l -1.5625e-4,8.6805e-4 -1.5625e-4,0.00249 c 0,0.00455 0.001076,0.008755 0.003212,0.0126267 0.003316,0.005901 0.008993,0.0105867 0.0169964,0.0140451 0.0103471,0.004408 0.0242186,0.006613 0.041597,0.006613 z"
                     style="font-style:normal;font-variant:normal;font-weight:normal;font-stretch:normal;letter-spacing:normal;word-spacing:normal;text-anchor:start;fill:url(#linearGradient13149);fill-opacity:1;stroke:#000000;stroke-width:0;stroke-linecap:butt;stroke-linejoin:miter;stroke-miterlimit:10.43299961;stroke-dasharray:none;stroke-dashoffset:0;stroke-opacity:1"
                     id="path8334"
                     inkscape:connector-curvature="0" />
                </g>
              </g>
              <g
                 transform="matrix(1020.611,0,0,1029.554,-10.86235,171.5834)"
                 id="g12457">
                <path
                   id="path8336"
                   style="font-style:normal;font-variant:normal;font-weight:normal;font-stretch:normal;letter-spacing:normal;word-spacing:normal;text-anchor:start;fill:#000000;fill-opacity:1;stroke:#000000;stroke-width:0;stroke-linecap:butt;stroke-linejoin:miter;stroke-miterlimit:10.43299961;stroke-dasharray:none;stroke-dashoffset:0;stroke-opacity:1"
                   d="m 0.84111402,0.38286877 h -0.0797217 c -0.0136978,0 -0.0255554,-0.001832 -0.03559,-0.005493 -0.009045,-0.00329 -0.0160936,-0.007922 -0.0211457,-0.0138888 -0.004653,-0.005528 -0.006979,-0.0115642 -0.006979,-0.0181075 0,-0.006578 0.002396,-0.0127707 0.00717,-0.0185676 0.005052,-0.006069 0.0121701,-0.0108506 0.021354,-0.0143437 0.0101041,-0.003832 0.0218401,-0.005745 0.0351907,-0.005745 h 0.0797217 v 0.0281231 h -0.0745481 c -0.004201,0 -0.0075,9.7742e-4 -0.009896,0.002944 -0.00217,0.00179 -0.003264,0.003988 -0.003264,0.006592 0,0.002672 0.001128,0.00497 0.003351,0.006896 0.002483,0.002102 0.005746,0.003148 0.009809,0.003148 h 0.0745481 z"
                   inkscape:connector-curvature="0" />
                <path
                   id="path8338"
                   style="font-style:normal;font-variant:normal;font-weight:normal;font-stretch:normal;letter-spacing:normal;word-spacing:normal;text-anchor:start;fill:url(#linearGradient13102);fill-opacity:1;stroke:#000000;stroke-width:0;stroke-linecap:butt;stroke-linejoin:miter;stroke-miterlimit:10.43299961;stroke-dasharray:none;stroke-dashoffset:0;stroke-opacity:1"
                   d="m 0.8309269,0.37881229 v -0.0149947 h -0.0661698 c -0.007733,0 -0.0139004,-0.002123 -0.0185401,-0.006354 -0.004216,-0.003825 -0.006315,-0.00845 -0.006315,-0.013868 0,-0.005325 0.002044,-0.00974 0.006094,-0.0132655 0.004566,-0.003995 0.0108074,-0.005995 0.018761,-0.005995 h 0.0661698 v -0.0145815 h -0.0716195 c -0.0113229,0 -0.0212833,0.001729 -0.0298629,0.005189 -0.007806,0.003153 -0.0138452,0.0075 -0.018135,0.0130277 -0.00405,0.005227 -0.006094,0.0108558 -0.006094,0.0168992 0,0.005899 0.00197,0.0113662 0.005892,0.0163836 0.004161,0.005297 0.0101446,0.009469 0.0179509,0.012519 0.008524,0.003365 0.0185953,0.00504 0.0302496,0.00504 z"
                   inkscape:connector-curvature="0" />
              </g>
            </g>
          </g>
          <text
             id="text12970"
             y="625.0426"
             x="32.771267"
             style="font-style:normal;font-variant:normal;font-weight:bold;font-stretch:normal;line-height:0%;font-family:'Bitstream Vera Sans';text-align:start;writing-mode:lr-tb;text-anchor:start;fill:#000000;fill-opacity:1;stroke:none;stroke-width:1px;stroke-linecap:butt;stroke-linejoin:miter;stroke-opacity:1"
             xml:space="preserve"><tspan
               style="font-size:38.77927017px;line-height:1.25"
               y="625.0426"
               x="32.771267"
               id="tspan12972"
               sodipodi:role="line">GRUPO DE USUARIOS DE LINUX DE CANARIAS</tspan></text>
        </g>
      </g>
    </g>
  </g>
</svg>
