{
  "coinmarketcap" : [ {
    "site" : "coinmarketcap",
    "cryptoName" : "ethereum",
    "url" : "https://api.coinmarketcap.com/v1/ticker/ethereum/",
    "price" : "price_usd",
    "updateTime" : "last_updated",
    "pair" : "USD",
    "interval" : 300,
    "responseType" : "KEY_VALUE"
  }, {
    "site" : "coinmarketcap",
    "cryptoName" : "nano",
    "url" : "https://api.coinmarketcap.com/v1/ticker/nano/",
    "price" : "price_usd",
    "updateTime" : "last_updated",
    "pair" : "USD",
    "interval" : 300,
    "responseType" : "KEY_VALUE"
  }, {
    "site" : "coinmarketcap",
    "cryptoName" : "bitcoin",
    "url" : "https://api.coinmarketcap.com/v1/ticker/bitcoin/",
    "price" : "price_usd",
    "updateTime" : "last_updated",
    "pair" : "USD",
    "interval" : 20,
    "responseType" : "KEY_VALUE"
  }, {
    "site" : "coinmarketcap",
    "cryptoName" : "litecoin",
    "url" : "https://api.coinmarketcap.com/v1/ticker/litecoin/",
    "price" : "price_usd",
    "updateTime" : "last_updated",
    "pair" : "USD",
    "interval" : 30,
    "responseType" : "KEY_VALUE"
  }, {
    "site" : "coinmarketcap",
    "cryptoName" : "stellar",
    "url" : "https://api.coinmarketcap.com/v1/ticker/stellar/",
    "price" : "price_usd",
    "updateTime" : "last_updated",
    "pair" : "USD",
    "interval" : 300,
    "responseType" : "KEY_VALUE"
  }, {
    "site" : "coinmarketcap",
    "cryptoName" : "dogecoin",
    "url" : "https://api.coinmarketcap.com/v1/ticker/dogecoin/",
    "price" : "price_usd",
    "updateTime" : "last_updated",
    "pair" : "USD",
    "interval" : 30,
    "responseType" : "KEY_VALUE"
  }, {
    "site" : "coinmarketcap",
    "cryptoName" : "ripple",
    "url" : "https://api.coinmarketcap.com/v1/ticker/ripple",
    "price" : "price_usd",
    "updateTime" : "last_updated",
    "pair" : "USD",
    "interval" : 300,
    "responseType" : "KEY_VALUE"
  } ],
  "bitfinex" : [ {
    "site" : "bitfinex",
    "cryptoName" : "bitcoin",
    "url" : "https://api.bitfinex.com/v2/ticker/tBTCUSD",
    "price" : "6",
    "updateTime" : "",
    "pair" : "USD",
    "interval" : 300,
    "responseType" : "ARRAY"
  } ],
  "bittrex" : [ {
    "site" : "bittrex",
    "cryptoName" : "litecoin",
    "url" : "https://bittrex.com/api/v1.1/public/getticker?market=BTC-LTC",
    "price" : "result.Last",
    "updateTime" : "",
    "pair" : "bitcoin",
    "interval" : 300,
    "responseType" : "KEY_VALUE"
  } ]
}