[{
  "site":"coinmarketcap",
  "responseType":"key-value",
  "period":"300",
  "config":{
    "price":"price_usd",
    "time":"last_updated"
  },
  "endpoints":[{
    "cryptoName":"bitcoin",
    "pair":"USD",
    "url":"https://api.coinmarketcap.com/v1/ticker/bitcoin/"
  },{
    "cryptoName":"litecoin",
    "pair":"USD",
    "url":"https://api.coinmarketcap.com/v1/ticker/litecoin/"
    },{
    "cryptoName":"ethereum",
    "pair":"USD",
    "url":"https://api.coinmarketcap.com/v1/ticker/ethereum/"
  }]
},{
  "site":"bittrex",
  "responseType":"key-value",
  "period":"300",
  "config":{
    "price":"result.Last",
    "time":""
  },
  "endpoints":[{
    "cryptoName":"litecoin",
    "pair":"bitcoin",
    "url":"https://bittrex.com/api/v1.1/public/getticker?market=BTC-LTC"
  }]
},{
  "site":"bitfinex",
  "responseType":"array",
  "period":"300",
  "config":{
    "price":"6",
    "time":""
  },
  "endpoints":[{
    "cryptoName":"bitcoin",
    "pair":"USD",
    "url":"https://api.bitfinex.com/v2/ticker/tBTCUSD"
  }]
}]