"ID","Item","Quantity","Reference","Make","Comment","Manufacturer","MPN","ExDist","ExDist PN","ExDist Link"
"front","shim tray front",12,,"true",,,,,,
"back1…12","shim tray back with specific mark for each slot (1…12)",12,,"true",,,,,,
"shim-insert","shim insert","x",,"true","quantity according to shimming results",,,,,
"magnet-insert","magnet insert for shim insert","x",,"true","quantity according to shimming results",,,,,
"rod4","brass roundrod Ø4×443mm",24,"round rod EN12164 - CW614N - M - RND4A - 500mm","false","=2*front","-","-","alu-messing-shop.de/","LM-16096-003","https://www.alu-messing-shop.de/messingrotgussbronze/rundstangen/messing-rundstange-22?number=LM-16096-003"
"M4sleeve","M4 sleeve nut, brass, l=20mm, l_thread=15mm, D=5mm, D_head=7mm",24,,"false","=1*rod4","-","-","schraubenking-shop.de","P004717","https://www.schraubenking-shop.de/M4-x-20mm-Huelsenmutter-mit-Linsensenkkopf-Messing-vernickelt-P004717"
"M4nut","M4 brass nut",48,"ISO 4032 M4, brass, low headroom","false","=2*rod4","-","-","befestigungsfuchs.de/","2910 040T100","https://www.befestigungsfuchs.de/eisenwaren/muttern/sechskantmuttern/100-sechskantmuttern-m4-sw7-messing-din-934"
"M4washer","brass washer for M4 nut",24,"ISO 7089 M4","false","=1*rod4","-","-",,,
"spacer4x50","spacer sleeve Ø4.2×50mm","x",,"false","quantity according to shimming results","A.R.T. Elektromechanik-Vertriebs-GmbH",,"artgmbh.com/","11423","https://www.artgmbh.com/distanzhuelsen-distanzhalter/distanzhuelsen-aus-kunststoff/kunststoff-distanzhuelsen/1188/dh-042080...-pa-gv-distanzhuelse-schwarz-6-0?number=11423-50.0-E"
"spacer4x10","spacer sleeve Ø4.2×10mm","x",,"false","quantity according to shimming results","A.R.T. Elektromechanik-Vertriebs-GmbH",,"artgmbh.com/","02767","https://www.artgmbh.com/distanzhuelsen-distanzhalter/distanzhuelsen-aus-kunststoff/kunststoff-distanzhuelsen/1188/dh-042080...-pa-gv-distanzhuelse-schwarz-6-0?number=02767-10.0-E"
"spacer4x2","spacer sleeve Ø4.2×2mm","x","ø_out=8, ø_in=4.2, l=2 [mm], black PA-GV","false","quantity according to shimming results","A.R.T. Elektromechanik-Vertriebs-GmbH","02575","artgmbh.com/","02575","https://www.artgmbh.com/distanzhuelsen-distanzhalter/distanzhuelsen-aus-kunststoff/kunststoff-distanzhuelsen/1188/dh-042080...-pa-gv-distanzhuelse-schwarz-6-0?number=02575"
"mag6","N45 magnet, 6×6×6mm²","x",,"false","quantity according to shimming results",,,"Magnetversand","237","https://magnetversand.de/product/wuerfelmagnet-6x6x6-mm-vernickelt-neodym/"
