M48
;DRILL file {KiCad (5.0.2)-1} date 01.07.2020 13:26:20
;FORMAT={-:-/ absolute / metric / decimal}
FMAT,2
METRIC,TZ
T1C0.200
T2C0.300
T3C0.400
T4C0.890
T5C1.000
T6C1.100
T7C1.500
T8C1.570
T9C1.700
T10C2.100
%
G90
G05
T1
X65.04Y-117.745
X65.04Y-118.745
X65.04Y-119.745
X66.04Y-117.745
X66.04Y-118.745
X66.04Y-119.745
X67.04Y-117.745
X67.04Y-118.745
X67.04Y-119.745
T2
X49.53Y-41.275
X49.53Y-45.085
X49.53Y-50.165
X49.53Y-55.245
X49.53Y-60.325
X49.53Y-65.405
X49.53Y-70.485
X49.53Y-75.565
X49.53Y-80.645
X49.53Y-85.725
X49.53Y-90.805
X49.53Y-95.885
X49.53Y-100.965
X49.53Y-106.045
X49.53Y-111.125
X49.53Y-116.205
X49.53Y-121.285
X49.53Y-126.365
X49.53Y-131.445
X49.53Y-136.525
X52.07Y-103.505
X53.34Y-65.405
X54.61Y-37.465
X55.88Y-103.505
X55.88Y-141.605
X57.15Y-65.405
X58.42Y-37.465
X58.42Y-46.355
X59.69Y-103.505
X59.69Y-141.605
X60.96Y-65.405
X61.087Y-111.633
X62.103Y-110.617
X62.23Y-117.475
X62.23Y-119.38
X62.357Y-112.903
X63.373Y-111.887
X63.5Y-37.465
X63.5Y-103.505
X63.5Y-141.605
X63.627Y-114.173
X64.008Y-114.935
X64.008Y-122.555
X64.008Y-123.825
X64.008Y-125.095
X64.008Y-126.365
X64.008Y-127.635
X64.643Y-113.157
X64.77Y-46.355
X64.77Y-66.675
X65.532Y-114.935
X65.532Y-122.555
X65.532Y-123.825
X65.532Y-125.095
X65.532Y-126.365
X65.532Y-127.635
X66.04Y-109.855
X67.31Y-103.505
X67.31Y-141.605
X67.945Y-53.975
X67.945Y-56.515
X67.945Y-61.595
X67.945Y-109.855
X67.945Y-127.635
X68.58Y-37.465
X68.58Y-66.675
X69.85Y-109.855
X69.85Y-117.475
X69.85Y-119.38
X69.85Y-127.635
X71.12Y-46.355
X71.12Y-71.12
X71.12Y-73.66
X71.12Y-76.2
X71.12Y-78.74
X71.12Y-81.28
X71.12Y-83.82
X71.12Y-86.36
X71.12Y-88.9
X71.12Y-103.505
X71.12Y-141.605
X71.755Y-127.635
X72.39Y-66.675
X72.39Y-108.585
X72.39Y-113.665
X73.66Y-37.465
X73.66Y-48.895
X73.66Y-127.635
X74.93Y-102.87
X74.93Y-126.365
X74.93Y-131.445
X74.93Y-136.525
X74.93Y-141.605
X75.565Y-53.975
X75.565Y-64.135
X75.565Y-103.505
X75.565Y-109.855
X76.2Y-66.675
X76.2Y-104.14
X76.2Y-112.395
X77.47Y-46.355
X77.47Y-48.895
X78.74Y-37.465
X78.74Y-141.605
X79.375Y-72.39
X79.375Y-74.93
X79.375Y-77.47
X79.375Y-80.01
X79.375Y-82.55
X79.375Y-85.09
X79.375Y-87.63
X79.375Y-90.17
X79.375Y-117.475
X79.375Y-121.285
X80.01Y-51.435
X80.01Y-66.675
X80.645Y-73.279
X80.645Y-106.045
X81.28Y-70.905
X81.915Y-56.515
X81.915Y-61.595
X81.915Y-75.985
X82.55Y-141.605
X83.82Y-37.465
X83.82Y-46.355
X83.82Y-66.675
X84.455Y-117.475
X86.36Y-141.605
X86.995Y-106.045
X87.63Y-66.675
X88.9Y-37.465
X88.9Y-118.745
X90.17Y-46.355
X90.17Y-67.945
X90.17Y-141.605
X91.44Y-71.755
X91.44Y-117.475
X91.44Y-122.555
X92.075Y-110.49
X92.075Y-115.57
X93.98Y-37.465
X93.98Y-73.025
X93.98Y-83.185
X93.98Y-86.995
X93.98Y-90.805
X93.98Y-94.615
X93.98Y-98.425
X93.98Y-102.235
X93.98Y-106.045
X93.98Y-109.855
X93.98Y-113.665
X93.98Y-117.475
X93.98Y-121.285
X93.98Y-126.365
X93.98Y-131.445
X93.98Y-136.525
X93.98Y-141.605
X95.885Y-69.215
X95.885Y-73.025
X97.79Y-40.005
X97.79Y-43.815
X97.79Y-47.625
X97.79Y-51.435
X97.79Y-55.245
X97.79Y-59.055
X97.79Y-62.865
X97.79Y-66.675
X97.79Y-69.215
X97.79Y-85.725
X97.79Y-90.805
X97.79Y-117.475
X99.06Y-37.465
X99.06Y-73.025
X99.06Y-141.605
X99.695Y-95.25
X100.33Y-89.535
X101.6Y-117.475
X102.235Y-60.96
X102.235Y-79.375
X102.235Y-89.535
X102.235Y-96.52
X102.87Y-77.47
X102.87Y-88.9
X103.505Y-78.105
X103.505Y-88.265
X104.14Y-37.465
X104.14Y-73.025
X104.14Y-75.565
X104.14Y-78.74
X104.14Y-83.82
X104.14Y-93.98
X104.14Y-141.605
X104.775Y-59.69
X104.775Y-76.835
X104.775Y-84.455
X104.775Y-97.79
X105.41Y-76.2
X105.41Y-85.09
X105.41Y-97.155
X105.41Y-117.475
X106.68Y-79.375
X106.68Y-97.79
X107.315Y-59.69
X107.315Y-88.265
X107.315Y-93.98
X107.315Y-106.045
X107.315Y-112.395
X107.315Y-118.11
X107.95Y-44.45
X107.95Y-88.9
X107.95Y-94.615
X108.585Y-67.31
X108.585Y-74.93
X108.585Y-100.33
X109.22Y-37.465
X109.22Y-73.025
X109.22Y-75.565
X109.22Y-117.475
X109.22Y-141.605
X110.49Y-43.18
X110.49Y-43.815
X110.49Y-85.725
X110.49Y-93.345
X111.125Y-59.055
X111.125Y-99.06
X111.76Y-79.375
X111.76Y-120.015
X113.03Y-73.025
X113.03Y-75.565
X113.03Y-84.455
X113.03Y-94.615
X113.03Y-118.11
X113.665Y-57.785
X114.3Y-37.465
X114.3Y-50.8
X114.3Y-141.605
X114.935Y-48.895
X115.57Y-119.38
X116.84Y-117.475
X116.84Y-118.745
X117.475Y-91.44
X118.11Y-111.125
X118.745Y-60.325
X119.38Y-37.465
X119.38Y-73.025
X119.38Y-75.565
X119.38Y-79.375
X119.38Y-103.505
X119.38Y-120.65
X119.38Y-141.605
X120.015Y-90.17
X120.65Y-79.375
X120.65Y-105.41
X120.65Y-109.855
X120.65Y-117.475
X121.285Y-59.055
X121.92Y-74.93
X121.92Y-85.09
X121.92Y-92.71
X122.555Y-74.295
X122.555Y-85.725
X123.19Y-79.375
X123.19Y-99.06
X123.825Y-67.31
X123.825Y-74.295
X124.46Y-37.465
X124.46Y-73.025
X124.46Y-75.565
X124.46Y-79.375
X124.46Y-117.475
X124.46Y-141.605
X125.73Y-105.41
X125.73Y-109.855
X126.365Y-94.615
X127.Y-67.945
X127.Y-76.2
X127.Y-121.285
X127.635Y-57.15
X128.27Y-73.025
X128.27Y-75.565
X128.27Y-83.185
X128.27Y-111.125
X128.27Y-117.475
X128.905Y-67.945
X128.905Y-76.835
X128.905Y-95.885
X129.54Y-37.465
X129.54Y-79.375
X129.54Y-126.365
X129.54Y-131.445
X129.54Y-136.525
X129.54Y-141.605
X130.175Y-55.88
X130.81Y-67.945
X130.81Y-78.74
X132.08Y-73.025
X132.08Y-75.565
X132.08Y-83.185
X132.08Y-86.995
X132.08Y-90.805
X132.08Y-94.615
X132.08Y-98.425
X132.08Y-102.235
X132.08Y-106.045
X132.08Y-109.855
X132.08Y-113.665
X132.08Y-117.475
X132.715Y-67.945
X132.715Y-78.105
X133.35Y-40.005
X133.35Y-43.815
X133.35Y-47.625
X133.35Y-51.435
X133.35Y-55.245
X133.35Y-59.055
X133.35Y-62.865
X133.985Y-64.77
X134.62Y-37.465
X134.62Y-79.375
X134.62Y-141.605
X135.89Y-69.215
X135.89Y-85.725
X135.89Y-90.805
X135.89Y-117.475
X137.16Y-78.105
X137.16Y-83.185
X137.795Y-95.25
X138.43Y-73.025
X138.43Y-75.565
X138.43Y-89.535
X138.43Y-118.11
X139.7Y-37.465
X139.7Y-77.47
X139.7Y-79.375
X139.7Y-117.475
X139.7Y-141.605
X140.335Y-80.01
X140.335Y-89.535
X140.335Y-96.52
X140.97Y-77.47
X140.97Y-88.9
X141.605Y-78.105
X141.605Y-88.265
X142.24Y-78.74
X142.24Y-83.82
X142.24Y-93.98
X142.875Y-76.835
X142.875Y-84.455
X142.875Y-97.79
X143.51Y-73.025
X143.51Y-76.2
X143.51Y-85.09
X143.51Y-97.155
X143.51Y-117.475
X144.78Y-37.465
X144.78Y-76.835
X144.78Y-79.375
X144.78Y-97.79
X144.78Y-141.605
X145.415Y-88.265
X145.415Y-93.98
X145.415Y-106.045
X145.415Y-112.395
X145.415Y-118.745
X146.05Y-88.9
X146.05Y-94.615
X146.685Y-100.33
X147.32Y-76.2
X147.32Y-117.475
X148.59Y-73.025
X148.59Y-75.565
X148.59Y-85.725
X148.59Y-93.345
X149.225Y-99.06
X149.86Y-37.465
X149.86Y-79.375
X149.86Y-141.605
X151.13Y-84.455
X151.13Y-94.615
X151.13Y-117.475
X154.94Y-37.465
X154.94Y-117.475
X154.94Y-141.605
X155.575Y-91.44
X156.21Y-111.125
X157.48Y-73.025
X157.48Y-75.565
X157.48Y-79.375
X157.48Y-103.505
X157.48Y-121.92
X158.115Y-90.17
X158.75Y-79.375
X158.75Y-105.41
X158.75Y-109.855
X158.75Y-117.475
X158.75Y-118.745
X160.02Y-37.465
X160.02Y-74.93
X160.02Y-85.09
X160.02Y-92.71
X160.02Y-141.605
X160.655Y-74.295
X160.655Y-85.725
X161.29Y-79.375
X161.29Y-99.06
X162.56Y-73.025
X162.56Y-75.565
X162.56Y-79.375
X162.56Y-117.475
X163.83Y-105.41
X163.83Y-109.855
X164.465Y-94.615
X165.1Y-37.465
X165.1Y-122.555
X165.1Y-141.605
X166.37Y-83.185
X166.37Y-111.125
X166.37Y-117.475
X167.005Y-95.885
X167.64Y-73.025
X167.64Y-75.565
X167.64Y-79.375
X168.91Y-40.005
X168.91Y-43.815
X168.91Y-47.625
X168.91Y-51.435
X168.91Y-55.245
X168.91Y-59.055
X168.91Y-62.865
X168.91Y-66.675
X170.18Y-37.465
X170.18Y-83.185
X170.18Y-86.995
X170.18Y-90.805
X170.18Y-94.615
X170.18Y-98.425
X170.18Y-102.235
X170.18Y-106.045
X170.18Y-109.855
X170.18Y-113.665
X170.18Y-117.475
X170.18Y-126.365
X170.18Y-131.445
X170.18Y-136.525
X170.18Y-141.605
X172.72Y-73.025
X172.72Y-75.565
X172.72Y-79.375
X173.99Y-66.675
X173.99Y-69.215
X173.99Y-85.725
X173.99Y-90.805
X173.99Y-117.475
X175.26Y-37.465
X175.26Y-83.185
X175.26Y-141.605
X175.895Y-95.25
X176.53Y-89.535
X177.8Y-73.025
X177.8Y-75.565
X177.8Y-79.375
X177.8Y-117.475
X178.435Y-80.645
X178.435Y-89.535
X178.435Y-96.52
X179.07Y-66.675
X179.07Y-77.47
X179.07Y-88.9
X179.07Y-119.38
X179.705Y-78.105
X179.705Y-88.265
X180.34Y-37.465
X180.34Y-78.74
X180.34Y-83.82
X180.34Y-93.98
X180.34Y-141.605
X180.975Y-76.835
X180.975Y-84.455
X180.975Y-97.79
X181.61Y-76.2
X181.61Y-85.09
X181.61Y-97.155
X181.61Y-117.475
X182.88Y-73.025
X182.88Y-75.565
X182.88Y-79.375
X182.88Y-97.79
X183.515Y-88.265
X183.515Y-93.98
X183.515Y-106.045
X183.515Y-112.395
X183.515Y-119.38
X184.15Y-66.675
X184.15Y-88.9
X184.15Y-88.9
X184.15Y-94.615
X184.785Y-100.33
X185.42Y-37.465
X185.42Y-117.475
X185.42Y-141.605
X186.69Y-85.725
X186.69Y-93.345
X187.325Y-99.06
X187.96Y-73.025
X187.96Y-75.565
X187.96Y-79.375
X189.23Y-66.675
X189.23Y-84.455
X189.23Y-94.615
X189.23Y-117.475
X190.5Y-37.465
X190.5Y-141.605
X193.04Y-117.475
X193.675Y-91.44
X194.31Y-66.675
X194.31Y-111.125
X195.58Y-37.465
X195.58Y-73.025
X195.58Y-75.565
X195.58Y-79.375
X195.58Y-103.505
X195.58Y-123.19
X195.58Y-141.605
X196.215Y-90.17
X196.85Y-79.375
X196.85Y-105.41
X196.85Y-109.855
X196.85Y-117.475
X198.12Y-74.93
X198.12Y-85.09
X198.12Y-92.71
X198.755Y-74.295
X198.755Y-85.725
X199.39Y-66.675
X199.39Y-79.375
X199.39Y-99.06
X199.39Y-120.015
X200.66Y-37.465
X200.66Y-73.025
X200.66Y-75.565
X200.66Y-79.375
X200.66Y-117.475
X200.66Y-141.605
X201.93Y-105.41
X201.93Y-109.855
X202.565Y-94.615
X203.2Y-123.825
X204.47Y-66.675
X204.47Y-83.185
X204.47Y-111.125
X204.47Y-117.475
X205.105Y-95.885
X205.74Y-37.465
X205.74Y-73.025
X205.74Y-75.565
X205.74Y-79.375
X205.74Y-141.605
X208.28Y-83.185
X208.28Y-86.995
X208.28Y-90.805
X208.28Y-94.615
X208.28Y-98.425
X208.28Y-102.235
X208.28Y-106.045
X208.28Y-109.855
X208.28Y-113.665
X208.28Y-117.475
X209.55Y-66.675
X210.82Y-37.465
X210.82Y-73.025
X210.82Y-75.565
X210.82Y-79.375
X210.82Y-126.365
X210.82Y-131.445
X210.82Y-136.525
X210.82Y-141.605
X212.09Y-69.215
X212.09Y-85.725
X212.09Y-90.805
X212.09Y-117.475
X213.36Y-83.185
X213.995Y-95.25
X214.63Y-66.675
X214.63Y-89.535
X215.9Y-37.465
X215.9Y-73.025
X215.9Y-75.565
X215.9Y-79.375
X215.9Y-117.475
X215.9Y-141.605
X216.535Y-81.28
X216.535Y-89.535
X216.535Y-96.52
X217.17Y-77.47
X217.17Y-88.9
X217.805Y-78.105
X217.805Y-88.265
X218.44Y-78.74
X218.44Y-83.82
X218.44Y-93.98
X219.075Y-76.835
X219.075Y-84.455
X219.075Y-97.79
X219.71Y-66.675
X219.71Y-76.2
X219.71Y-85.09
X219.71Y-97.155
X219.71Y-117.475
X220.98Y-37.465
X220.98Y-73.025
X220.98Y-75.565
X220.98Y-79.375
X220.98Y-97.79
X220.98Y-125.095
X220.98Y-141.605
X221.615Y-88.265
X221.615Y-93.98
X221.615Y-106.045
X221.615Y-112.395
X221.615Y-120.015
X221.615Y-124.46
X222.25Y-88.9
X222.25Y-94.615
X222.885Y-100.33
X222.885Y-123.825
X223.52Y-117.475
X223.52Y-120.65
X224.155Y-121.285
X224.79Y-66.675
X224.79Y-85.725
X224.79Y-93.345
X225.425Y-99.06
X225.425Y-123.19
X226.06Y-37.465
X226.06Y-73.025
X226.06Y-122.555
X226.06Y-141.605
X226.695Y-121.92
X227.33Y-84.455
X227.33Y-94.615
X227.33Y-117.475
X229.87Y-66.675
X231.14Y-37.465
X231.14Y-117.475
X231.14Y-141.605
X231.775Y-91.44
X232.41Y-111.125
X233.68Y-73.025
X233.68Y-103.505
X233.68Y-124.46
X234.315Y-90.17
X234.95Y-66.675
X234.95Y-70.485
X234.95Y-79.375
X234.95Y-105.41
X234.95Y-109.855
X234.95Y-117.475
X236.22Y-37.465
X236.22Y-74.93
X236.22Y-85.09
X236.22Y-92.71
X236.22Y-141.605
X236.855Y-74.295
X236.855Y-85.725
X237.49Y-79.375
X237.49Y-99.06
X238.76Y-73.025
X238.76Y-117.475
X240.03Y-105.41
X240.03Y-109.855
X240.665Y-94.615
X241.3Y-37.465
X241.3Y-125.095
X241.3Y-141.605
X242.57Y-111.125
X242.57Y-117.475
X243.205Y-95.885
X243.84Y-73.025
X246.38Y-42.545
X246.38Y-47.625
X246.38Y-52.705
X246.38Y-57.785
X246.38Y-62.865
X246.38Y-67.945
X246.38Y-73.025
X246.38Y-75.565
X246.38Y-79.375
X246.38Y-83.185
X246.38Y-86.995
X246.38Y-90.805
X246.38Y-94.615
X246.38Y-98.425
X246.38Y-102.235
X246.38Y-106.045
X246.38Y-109.855
X246.38Y-113.665
X246.38Y-117.475
X246.38Y-121.285
X246.38Y-126.365
X246.38Y-131.445
X246.38Y-136.525
T3
X79.375Y-53.975
X79.375Y-64.135
X99.695Y-100.33
X100.33Y-57.15
X100.33Y-71.755
X102.87Y-70.485
X103.505Y-54.61
X103.505Y-61.595
X106.045Y-40.64
X113.03Y-103.505
X114.935Y-70.485
X114.935Y-88.265
X115.57Y-61.595
X115.57Y-90.805
X115.57Y-98.425
X115.57Y-102.87
X116.205Y-106.68
X116.84Y-56.515
X117.475Y-71.755
X117.475Y-86.36
X128.905Y-90.805
X130.175Y-60.96
X130.175Y-106.68
X137.795Y-100.33
X151.13Y-103.505
X153.035Y-67.945
X153.035Y-70.485
X153.035Y-88.265
X153.67Y-90.805
X153.67Y-98.425
X153.67Y-102.87
X154.305Y-106.68
X155.575Y-67.945
X155.575Y-71.755
X155.575Y-86.36
X167.005Y-90.805
X168.275Y-106.68
X175.895Y-100.33
X189.23Y-103.505
X191.135Y-70.485
X191.135Y-88.265
X191.77Y-90.805
X191.77Y-98.425
X191.77Y-102.87
X192.405Y-106.68
X193.675Y-71.755
X193.675Y-86.36
X205.105Y-90.805
X206.375Y-106.68
X213.995Y-100.33
X227.33Y-103.505
X229.235Y-70.485
X229.235Y-88.265
X229.87Y-90.805
X229.87Y-98.425
X229.87Y-102.87
X230.505Y-106.68
X231.775Y-71.755
X231.775Y-86.36
X243.205Y-90.805
X244.475Y-106.68
T4
X107.055Y-129.925
X109.345Y-129.925
X110.335Y-134.745
X111.355Y-136.525
X112.375Y-134.745
X113.395Y-136.525
X114.415Y-134.745
X115.435Y-136.525
X116.455Y-134.745
X117.475Y-136.525
X118.485Y-129.925
X120.775Y-129.925
X216.91Y-129.925
X219.2Y-129.925
X220.19Y-134.745
X221.21Y-136.525
X222.23Y-134.745
X223.25Y-136.525
X224.27Y-134.745
X225.29Y-136.525
X226.31Y-134.745
X227.33Y-136.525
X228.34Y-129.925
X230.63Y-129.925
T5
X199.39Y-130.175
X201.93Y-130.175
X158.75Y-130.175
X161.29Y-130.175
X138.43Y-130.175
X140.97Y-130.175
X140.335Y-114.935
X142.875Y-114.935
X145.415Y-114.935
X147.955Y-114.935
X233.68Y-114.935
X236.22Y-114.935
X238.76Y-114.935
X241.3Y-114.935
X121.92Y-41.91
X121.92Y-44.45
X154.94Y-52.705
X154.94Y-55.245
X157.48Y-52.705
X157.48Y-55.245
X160.02Y-52.705
X160.02Y-55.245
X162.56Y-52.705
X162.56Y-55.245
X165.1Y-52.705
X165.1Y-55.245
X178.435Y-114.935
X180.975Y-114.935
X183.515Y-114.935
X186.055Y-114.935
X64.77Y-130.175
X67.31Y-130.175
X78.74Y-109.855
X78.74Y-112.395
X81.28Y-109.855
X81.28Y-112.395
X216.535Y-114.935
X219.075Y-114.935
X221.615Y-114.935
X224.155Y-114.935
X195.58Y-114.935
X198.12Y-114.935
X200.66Y-114.935
X203.2Y-114.935
X102.235Y-114.935
X104.775Y-114.935
X107.315Y-114.935
X109.855Y-114.935
X111.76Y-65.405
X114.3Y-65.405
X116.84Y-65.405
X119.38Y-65.405
X154.94Y-62.865
X154.94Y-65.405
X157.48Y-62.865
X157.48Y-65.405
X160.02Y-62.865
X160.02Y-65.405
X162.56Y-62.865
X162.56Y-65.405
X165.1Y-62.865
X165.1Y-65.405
X83.82Y-69.215
X83.82Y-71.755
X83.82Y-74.295
X83.82Y-76.835
X83.82Y-79.375
X83.82Y-81.915
X83.82Y-84.455
X83.82Y-86.995
X83.82Y-89.535
X83.82Y-92.075
X83.82Y-94.615
X83.82Y-97.155
X83.82Y-99.695
X86.36Y-69.215
X86.36Y-71.755
X86.36Y-74.295
X86.36Y-76.835
X86.36Y-79.375
X86.36Y-81.915
X86.36Y-84.455
X86.36Y-86.995
X86.36Y-89.535
X86.36Y-92.075
X86.36Y-94.615
X86.36Y-97.155
X86.36Y-99.695
X137.16Y-52.705
X137.16Y-55.245
X139.7Y-52.705
X139.7Y-55.245
X142.24Y-52.705
X142.24Y-55.245
X144.78Y-52.705
X144.78Y-55.245
X147.32Y-52.705
X147.32Y-55.245
X85.09Y-130.175
X87.63Y-130.175
X137.16Y-62.865
X137.16Y-65.405
X139.7Y-62.865
X139.7Y-65.405
X142.24Y-62.865
X142.24Y-65.405
X144.78Y-62.865
X144.78Y-65.405
X147.32Y-62.865
X147.32Y-65.405
X179.07Y-130.175
X181.61Y-130.175
X119.38Y-114.935
X121.92Y-114.935
X124.46Y-114.935
X127.Y-114.935
X157.48Y-114.935
X160.02Y-114.935
X162.56Y-114.935
X165.1Y-114.935
T6
X56.515Y-53.975
X56.515Y-56.515
X56.515Y-59.055
X56.515Y-61.595
X55.245Y-69.215
X55.245Y-71.755
X55.245Y-74.295
X55.245Y-76.835
X55.245Y-79.375
X55.245Y-81.915
X55.245Y-84.455
X55.245Y-86.995
X55.245Y-89.535
X55.245Y-92.075
X55.245Y-94.615
X55.245Y-97.155
X55.245Y-99.695
X57.785Y-69.215
X57.785Y-71.755
X57.785Y-74.295
X57.785Y-76.835
X57.785Y-79.375
X57.785Y-81.915
X57.785Y-84.455
X57.785Y-86.995
X57.785Y-89.535
X57.785Y-92.075
X57.785Y-94.615
X57.785Y-97.155
X57.785Y-99.695
T7
X57.15Y-110.49
T8
X105.785Y-135.635
X122.045Y-135.635
X215.64Y-135.635
X231.9Y-135.635
T9
X54.61Y-107.95
X54.61Y-113.03
X59.69Y-107.95
X59.69Y-113.03
T10
X173.99Y-135.255
X184.15Y-135.255
X204.47Y-135.255
X153.67Y-135.255
X163.83Y-135.255
X59.69Y-135.255
X69.85Y-135.255
X80.01Y-135.255
X90.17Y-135.255
X194.31Y-135.255
X133.35Y-135.255
X143.51Y-135.255
T0
M30
