{
    "basename": "asr-nested_01-290187e",
    "cmd": "lfortran --show-asr --no-color {infile} -o {outfile}",
    "infile": "tests/../integration_tests/nested_01.f90",
    "infile_hash": "4675b48954591a1e2f73ecf9b769ca335945b16b07ff6191f1445a8f",
    "outfile": null,
    "outfile_hash": null,
    "stdout": "asr-nested_01-290187e.stdout",
    "stdout_hash": "90debf6c8e3e998b7afd855063f5960e98c3dcf12905873d4ffefe06",
    "stderr": null,
    "stderr_hash": null,
    "returncode": 0
}