{
    "basename": "asr-subroutines_02-597f5e1",
    "cmd": "lfortran --show-asr --no-color {infile} -o {outfile}",
    "infile": "tests/../integration_tests/subroutines_02.f90",
    "infile_hash": "4484a05d86189244a0e0fd3d37b37c88ef5510e22bdd1b38633a1bc8",
    "outfile": null,
    "outfile_hash": null,
    "stdout": "asr-subroutines_02-597f5e1.stdout",
    "stdout_hash": "1eab2ec0b51d89b589c097263aff9d2562afb0ea0124e833c70cee85",
    "stderr": null,
    "stderr_hash": null,
    "returncode": 0
}