{
    "basename": "asr-complex_dp-ec165b1",
    "cmd": "lfortran --show-asr --no-color {infile} -o {outfile}",
    "infile": "tests/../integration_tests/complex_dp.f90",
    "infile_hash": "2ab8a19155ace703dc52c1f26d2ecea0db08a49637452b31871a40b2",
    "outfile": null,
    "outfile_hash": null,
    "stdout": "asr-complex_dp-ec165b1.stdout",
    "stdout_hash": "e0937f0f272d612b3f6c821740f1e37f89084e4619f6be36c017ead2",
    "stderr": null,
    "stderr_hash": null,
    "returncode": 0
}