{
    "basename": "asr-string_19-d880475",
    "cmd": "lfortran --show-asr --no-color {infile} -o {outfile}",
    "infile": "tests/../integration_tests/string_19.f90",
    "infile_hash": "d999d37e2b6c8522772ee6364d2fc01672a0beca39b18692f6290cfb",
    "outfile": null,
    "outfile_hash": null,
    "stdout": "asr-string_19-d880475.stdout",
    "stdout_hash": "4f7afa67a0bf263e52b3a173b56cbdee9181e200a6e65c4c2be2e63b",
    "stderr": null,
    "stderr_hash": null,
    "returncode": 0
}