{
    "basename": "asr-associate_04-8bcb3df",
    "cmd": "lfortran --show-asr --no-color {infile} -o {outfile}",
    "infile": "tests/../integration_tests/associate_04.f90",
    "infile_hash": "902a12c91e1df67575c96534b3b5a55ca93e85aa0777e689ecc1334c",
    "outfile": null,
    "outfile_hash": null,
    "stdout": "asr-associate_04-8bcb3df.stdout",
    "stdout_hash": "cf45bd3a2e83526a81b64f75a80bea1795bc6da7834a7374979300bf",
    "stderr": null,
    "stderr_hash": null,
    "returncode": 0
}