{
    "basename": "asr-bits_01-2906c1d",
    "cmd": "lfortran --show-asr --no-color {infile} -o {outfile}",
    "infile": "tests/../integration_tests/bits_01.f90",
    "infile_hash": "4fdd6c630a9f2559417372a42cca1dc1c98fa7af4e4a5442ebf9ca96",
    "outfile": null,
    "outfile_hash": null,
    "stdout": "asr-bits_01-2906c1d.stdout",
    "stdout_hash": "21949b32f91ce13d783cd0ba20718fc17b62f6097a47965752a61b69",
    "stderr": null,
    "stderr_hash": null,
    "returncode": 0
}