{
    "basename": "asr-rewind_inquire_flush-72b7f97",
    "cmd": "lfortran --show-asr --no-color {infile} -o {outfile}",
    "infile": "tests/../integration_tests/rewind_inquire_flush.f90",
    "infile_hash": "8a55dc820362b5ab028d6f06d1edc7476b8b0f03a76e7d87655825ad",
    "outfile": null,
    "outfile_hash": null,
    "stdout": "asr-rewind_inquire_flush-72b7f97.stdout",
    "stdout_hash": "4732489dd23a7de7b93697c36cdb1f7b7ae4ca7c259550fc7c15ab08",
    "stderr": null,
    "stderr_hash": null,
    "returncode": 0
}