{
    "basename": "asr-expr6-7f62240",
    "cmd": "lfortran --show-asr --no-color {infile} -o {outfile}",
    "infile": "tests/expr6.f90",
    "infile_hash": "722af2f789e614d9acf6975aae8260e4949a360066d5aa53a3f05944",
    "outfile": null,
    "outfile_hash": null,
    "stdout": "asr-expr6-7f62240.stdout",
    "stdout_hash": "627a2233fc3f5c7e6f00f2832a0a4e29e49bd2ec7ddd6aee62e8d693",
    "stderr": null,
    "stderr_hash": null,
    "returncode": 0
}