{
    "basename": "asr-intrinsics_36-1cb3d03",
    "cmd": "lfortran --show-asr --no-color {infile} -o {outfile}",
    "infile": "tests/../integration_tests/intrinsics_36.f90",
    "infile_hash": "e0ba5b752fd73ac8d29767fb102e424f77c0fa907af1ed4c6cbe3793",
    "outfile": null,
    "outfile_hash": null,
    "stdout": "asr-intrinsics_36-1cb3d03.stdout",
    "stdout_hash": "5b84a7389b6dcc0a5900b86b9621c0169d8c12c29256907f671f2488",
    "stderr": null,
    "stderr_hash": null,
    "returncode": 0
}