{
    "basename": "asr-string_02-bc2a3b9",
    "cmd": "lfortran --show-asr --no-color {infile} -o {outfile}",
    "infile": "tests/../integration_tests/string_02.f90",
    "infile_hash": "249fc849c605e3aad0bd2c8a33e00523fdc2270b95caa69737801caa",
    "outfile": null,
    "outfile_hash": null,
    "stdout": "asr-string_02-bc2a3b9.stdout",
    "stdout_hash": "8da7e20242e021f7897eaeaba58abc7fda29871bd7e0c90a23e26a3f",
    "stderr": null,
    "stderr_hash": null,
    "returncode": 0
}