{
    "basename": "asr-sign_from_value-b974070",
    "cmd": "lfortran --show-asr --no-color {infile} -o {outfile}",
    "infile": "tests/../integration_tests/sign_from_value.f90",
    "infile_hash": "18a4a6ee33509de837af6a678eccfc6e03c235ddc514d79f4b30a8d6",
    "outfile": null,
    "outfile_hash": null,
    "stdout": "asr-sign_from_value-b974070.stdout",
    "stdout_hash": "1c1d8d14695d8e0a969387117a68607e5ee025ecb345384e41d3003f",
    "stderr": null,
    "stderr_hash": null,
    "returncode": 0
}