{
    "basename": "asr-floor_02-5b70ee6",
    "cmd": "lfortran --show-asr --no-color {infile} -o {outfile}",
    "infile": "tests/../integration_tests/floor_02.f90",
    "infile_hash": "491234f50f51c45988216c1d0dc82e2493ae2de4b40cf8c85e31ed16",
    "outfile": null,
    "outfile_hash": null,
    "stdout": "asr-floor_02-5b70ee6.stdout",
    "stdout_hash": "6971fa6c8f7d29133f55b75c4bba8beb6ad5058d966f043fdba291f4",
    "stderr": null,
    "stderr_hash": null,
    "returncode": 0
}