{
    "basename": "llvm-array_bound_1-6741f43",
    "cmd": "lfortran --no-color --show-llvm {infile} -o {outfile}",
    "infile": "tests/../integration_tests/array_bound_1.f90",
    "infile_hash": "38d2c1d99ad714fdaa387541310a78f8d3c4d7e19e93ed67a2dcf677",
    "outfile": null,
    "outfile_hash": null,
    "stdout": "llvm-array_bound_1-6741f43.stdout",
    "stdout_hash": "ff9faa7bb6f7fd714fcd1045aad6fcda17221c0910a3687c1d1ea3cd",
    "stderr": null,
    "stderr_hash": null,
    "returncode": 0
}