{
    "basename": "cpp-types_03-dc774f0",
    "cmd": "lfortran --no-color --show-cpp {infile}",
    "infile": "tests/../integration_tests/types_03.f90",
    "infile_hash": "388683b8609d91d174ceb8c24787c982bf1ea22d342e94d44457b861",
    "outfile": null,
    "outfile_hash": null,
    "stdout": "cpp-types_03-dc774f0.stdout",
    "stdout_hash": "6df0b90799065cece76ad3110f16c555600f9007c31c09b5f90c8388",
    "stderr": null,
    "stderr_hash": null,
    "returncode": 0
}