{
    "basename": "asr-logical2-e35f19c",
    "cmd": "lfortran --show-asr --no-color {infile} -o {outfile}",
    "infile": "tests/../integration_tests/logical2.f90",
    "infile_hash": "7efb2fb2352ed7c8d81b56547300d3653a2f796950815393a0fae0ab",
    "outfile": null,
    "outfile_hash": null,
    "stdout": "asr-logical2-e35f19c.stdout",
    "stdout_hash": "42500c4d17203d80d5873fcdae5c6950f147fe9268d1ddc871346902",
    "stderr": null,
    "stderr_hash": null,
    "returncode": 0
}