{
    "basename": "asr-case_06-f84222d",
    "cmd": "lfortran --show-asr --no-color {infile} -o {outfile}",
    "infile": "tests/../integration_tests/case_06.f90",
    "infile_hash": "3987983e4c8d162530bceffbbce0bd7d038b1f794655c222c47ad714",
    "outfile": null,
    "outfile_hash": null,
    "stdout": "asr-case_06-f84222d.stdout",
    "stdout_hash": "7ecd7a564b81be245052cc3110fea3fd53cea4f829f04040b9cb4c31",
    "stderr": null,
    "stderr_hash": null,
    "returncode": 0
}