{
    "basename": "asr-intrinsics_09-2af35ec",
    "cmd": "lfortran --show-asr --no-color {infile} -o {outfile}",
    "infile": "tests/../integration_tests/intrinsics_09.f90",
    "infile_hash": "12c64a66c84a553de209e2227f56e1da90f0ce7e51cef682cb608cea",
    "outfile": null,
    "outfile_hash": null,
    "stdout": "asr-intrinsics_09-2af35ec.stdout",
    "stdout_hash": "1bba583c2173b2c515585be53369210bc263fb3aad3fcf96bb9fff95",
    "stderr": null,
    "stderr_hash": null,
    "returncode": 0
}