{
    "basename": "asr-sin_03-8490135",
    "cmd": "lfortran --show-asr --no-color {infile} -o {outfile}",
    "infile": "tests/../integration_tests/sin_03.f90",
    "infile_hash": "3c036b8aabdbfddc3c46fb69183c427f7991b105c361b785872acf59",
    "outfile": null,
    "outfile_hash": null,
    "stdout": "asr-sin_03-8490135.stdout",
    "stdout_hash": "7c26ab299be45fab8b1ed61bbe18d79b5c11c343a8bdbacf77cb9fec",
    "stderr": null,
    "stderr_hash": null,
    "returncode": 0
}