{
    "basename": "asr-functions_06-83a7aca",
    "cmd": "lfortran --show-asr --no-color {infile} -o {outfile}",
    "infile": "tests/../integration_tests/functions_06.f90",
    "infile_hash": "492410fa181e0849a1fa49f48fefb3145051455339c08e049c3f53b7",
    "outfile": null,
    "outfile_hash": null,
    "stdout": "asr-functions_06-83a7aca.stdout",
    "stdout_hash": "a4e3ca4629e03a3f3ce2e5dc3ce87832ca50c3d1ce31e836721a80cd",
    "stderr": null,
    "stderr_hash": null,
    "returncode": 0
}