{
    "basename": "asr-expr2-74c7f32",
    "cmd": "lfortran --show-asr --no-color {infile} -o {outfile}",
    "infile": "tests/expr2.f90",
    "infile_hash": "d666975e3f2e2c0cc5c739b85bb21073accdf5692bcb64c9e0278d62",
    "outfile": null,
    "outfile_hash": null,
    "stdout": "asr-expr2-74c7f32.stdout",
    "stdout_hash": "74bfe8cee4d27c23f0b380097bfcf07bc48e90c18d9996f9df38fa24",
    "stderr": null,
    "stderr_hash": null,
    "returncode": 0
}