{
    "basename": "asr-modules_03-54c2520",
    "cmd": "lfortran --show-asr --no-color {infile} -o {outfile}",
    "infile": "tests/modules_03.f90",
    "infile_hash": "e8a8f67348a67ae303e75cebd603e3d97bb6eb8737fd17d7ade3b3e0",
    "outfile": null,
    "outfile_hash": null,
    "stdout": "asr-modules_03-54c2520.stdout",
    "stdout_hash": "aa42ff70a6d322c4dc6894a0b245abc2239eab22fcd07d4cfdb02b5c",
    "stderr": null,
    "stderr_hash": null,
    "returncode": 0
}