{
    "basename": "llvm-operator_overloading_03-d9fd880",
    "cmd": "lfortran --no-color --show-llvm {infile} -o {outfile}",
    "infile": "tests/../integration_tests/operator_overloading_03.f90",
    "infile_hash": "3340e64f6a134b16739a00f54087bb1816f1e6876ec32e6170275e19",
    "outfile": null,
    "outfile_hash": null,
    "stdout": "llvm-operator_overloading_03-d9fd880.stdout",
    "stdout_hash": "4664278760ed5653969aaf0b4a903858627c16de79107cbd6634aee6",
    "stderr": null,
    "stderr_hash": null,
    "returncode": 0
}