{
    "basename": "asr-init_values-19dfa76",
    "cmd": "lfortran --show-asr --no-color {infile} -o {outfile}",
    "infile": "tests/../integration_tests/init_values.f90",
    "infile_hash": "1cafced706fa2754f92f2d460867d6c84638fd10447df12f124fd419",
    "outfile": null,
    "outfile_hash": null,
    "stdout": "asr-init_values-19dfa76.stdout",
    "stdout_hash": "6dc303bda737fda15fd95c19e5c1e7543379a4539d544a5f73ba1e1c",
    "stderr": null,
    "stderr_hash": null,
    "returncode": 0
}