{
    "basename": "asr-intrinsics_12-ff7ce44",
    "cmd": "lfortran --show-asr --no-color {infile} -o {outfile}",
    "infile": "tests/../integration_tests/intrinsics_12.f90",
    "infile_hash": "7f3ef938f03d46035bb9c845b8ab1b15ac06b209b8b464f50486baf8",
    "outfile": null,
    "outfile_hash": null,
    "stdout": "asr-intrinsics_12-ff7ce44.stdout",
    "stdout_hash": "29e091e7d1181c4875bb19e46f8ba71947353cef43403d9d9a2e599b",
    "stderr": null,
    "stderr_hash": null,
    "returncode": 0
}