{
    "basename": "asr-arrays_01_complex-2513a51",
    "cmd": "lfortran --show-asr --no-color {infile} -o {outfile}",
    "infile": "tests/../integration_tests/arrays_01_complex.f90",
    "infile_hash": "2f81875039547fcf7eaa3375e4f99fbc8ef6d91ac2bb214c88cff999",
    "outfile": null,
    "outfile_hash": null,
    "stdout": "asr-arrays_01_complex-2513a51.stdout",
    "stdout_hash": "63f83f7ee0ac4722b6c2b5dda30df78f9fb06853d32d0ef21f8ccb91",
    "stderr": null,
    "stderr_hash": null,
    "returncode": 0
}