{
    "basename": "asr-expr4-6c75096",
    "cmd": "lfortran --show-asr --no-color {infile} -o {outfile}",
    "infile": "tests/expr4.f90",
    "infile_hash": "104847f7b62623d6e9d6d752ab2c6c58a31b70bc70a9cae0b5809241",
    "outfile": null,
    "outfile_hash": null,
    "stdout": "asr-expr4-6c75096.stdout",
    "stdout_hash": "4e56ad96fc5f6dcc2448581773ab6de9026cd2815aa4d687f345fa1b",
    "stderr": null,
    "stderr_hash": null,
    "returncode": 0
}