{
  "stats": {
    "suites": 1,
    "tests": 5,
    "passes": 5,
    "pending": 0,
    "failures": 0,
    "start": "2020-01-27T18:41:25.852Z",
    "end": "2020-01-27T18:41:41.163Z",
    "duration": 15311,
    "testsRegistered": 5,
    "passPercent": 100,
    "pendingPercent": 0,
    "other": 0,
    "hasOther": false,
    "skipped": 0,
    "hasSkipped": false
  },
  "results": [
    {
      "uuid": "a185f540-6a50-471a-b6c7-75acb257c4a0",
      "title": "",
      "fullFile": "",
      "file": "",
      "beforeHooks": [],
      "afterHooks": [],
      "tests": [],
      "suites": [
        {
          "uuid": "8c87ddaf-d476-44e6-96a2-4a1f85f46042",
          "title": "Login with email",
          "fullFile": "",
          "file": "",
          "beforeHooks": [],
          "afterHooks": [],
          "tests": [
            {
              "title": "Render login component",
              "fullTitle": "Login with email Render login component",
              "timedOut": null,
              "duration": 1380,
              "state": "passed",
              "speed": "slow",
              "pass": true,
              "fail": false,
              "pending": false,
              "context": null,
              "code": "cy.get('.firebaseui-idp-list > li').as('list_login');\ncy.get('@list_login').should('be.visible');\ncy.get('@list_login').its('length').should('eq', 2);",
              "err": {},
              "uuid": "1c8c47e5-dc28-44dc-9cd3-9321b3c97f90",
              "parentUUID": "8c87ddaf-d476-44e6-96a2-4a1f85f46042",
              "isHook": false,
              "skipped": false
            },
            {
              "title": "Unlogged user",
              "fullTitle": "Login with email Unlogged user",
              "timedOut": null,
              "duration": 1133,
              "state": "passed",
              "speed": "slow",
              "pass": true,
              "fail": false,
              "pending": false,
              "context": null,
              "code": "cy.get('[data-cy=button_login_user]').as('button_login_user');\ncy.get('@button_login_user').should('be.visible');\ncy.get('@button_login_user').contains('Iniciar sesión');",
              "err": {},
              "uuid": "ee197643-cb7b-46b7-a350-834e0612f61c",
              "parentUUID": "8c87ddaf-d476-44e6-96a2-4a1f85f46042",
              "isHook": false,
              "skipped": false
            },
            {
              "title": "Login with email and password correct",
              "fullTitle": "Login with email Login with email and password correct",
              "timedOut": null,
              "duration": 5135,
              "state": "passed",
              "speed": "slow",
              "pass": true,
              "fail": false,
              "pending": false,
              "context": null,
              "code": "cy.login();\ncy.logout();",
              "err": {},
              "uuid": "ae3bc155-d590-4735-b3a2-b2810d00f210",
              "parentUUID": "8c87ddaf-d476-44e6-96a2-4a1f85f46042",
              "isHook": false,
              "skipped": false
            },
            {
              "title": "Login with email correct and password incorrect",
              "fullTitle": "Login with email Login with email correct and password incorrect",
              "timedOut": null,
              "duration": 2186,
              "state": "passed",
              "speed": "slow",
              "pass": true,
              "fail": false,
              "pending": false,
              "context": null,
              "code": "cy.get('.firebaseui-idp-list > :nth-child(2)').click();\ncy.get('.firebaseui-id-password').should('not.exist');\ncy.get('.firebaseui-id-email').type(Cypress.env('email')).should('have.value', Cypress.env('email'));\ncy.get('.firebaseui-form-actions > :nth-child(2)').click();\ncy.get('.firebaseui-id-password').should('be.visible');\ncy.get('.firebaseui-id-password').type('passwordincorrect').should('have.value', 'passwordincorrect');\ncy.get('.firebaseui-error-wrapper').should('not.have.value');\ncy.get('.firebaseui-form-actions > :nth-child(1)').click();\ncy.get('.firebaseui-error-wrapper').contains('El correo electrónico y la contraseña que ingresaste no coinciden');",
              "err": {},
              "uuid": "5d4ba0de-426b-4078-9f3f-8b00b943602e",
              "parentUUID": "8c87ddaf-d476-44e6-96a2-4a1f85f46042",
              "isHook": false,
              "skipped": false
            },
            {
              "title": "Login with new email",
              "fullTitle": "Login with email Login with new email",
              "timedOut": null,
              "duration": 5296,
              "state": "passed",
              "speed": "slow",
              "pass": true,
              "fail": false,
              "pending": false,
              "context": null,
              "code": "cy.get('.firebaseui-idp-list > :nth-child(2)').click();\ncy.get('.firebaseui-id-name').should('not.exist');\ncy.get('.firebaseui-id-new-password').should('not.exist');\ncy.get('.firebaseui-id-email').type(generateEmail());\ncy.get('.firebaseui-form-actions > :nth-child(2)').click();\ncy.get('.firebaseui-id-name').should('be.visible');\ncy.get('.firebaseui-id-new-password').should('be.visible');\ncy.get('.firebaseui-id-name').type('Pamela Test').should('have.value', 'Pamela Test');\ncy.get('.firebaseui-id-new-password').type('holiholi').should('have.value', 'holiholi');\ncy.get('.firebaseui-error-wrapper').should('not.have.value');\ncy.get('.firebaseui-form-actions > :nth-child(2)').click();\ncy.url().should('to.equal', Cypress.env('baseUrl') + '/certificate-data');\ncy.logout();",
              "err": {},
              "uuid": "91aba982-97d4-4ca3-9e3d-0f36e0094237",
              "parentUUID": "8c87ddaf-d476-44e6-96a2-4a1f85f46042",
              "isHook": false,
              "skipped": false
            }
          ],
          "suites": [],
          "passes": [
            "1c8c47e5-dc28-44dc-9cd3-9321b3c97f90",
            "ee197643-cb7b-46b7-a350-834e0612f61c",
            "ae3bc155-d590-4735-b3a2-b2810d00f210",
            "5d4ba0de-426b-4078-9f3f-8b00b943602e",
            "91aba982-97d4-4ca3-9e3d-0f36e0094237"
          ],
          "failures": [],
          "pending": [],
          "skipped": [],
          "duration": 15130,
          "root": false,
          "rootEmpty": false,
          "_timeout": 2000
        }
      ],
      "passes": [],
      "failures": [],
      "pending": [],
      "skipped": [],
      "duration": 0,
      "root": true,
      "rootEmpty": true,
      "_timeout": 2000
    }
  ],
  "meta": {
    "mocha": {
      "version": "6.2.2"
    },
    "mochawesome": {
      "options": {
        "quiet": false,
        "reportFilename": "mochawesome",
        "saveHtml": false,
        "saveJson": true,
        "consoleReporter": "spec",
        "useInlineDiffs": false
      },
      "version": "4.1.0"
    },
    "marge": {
      "options": {
        "id": "default",
        "reportDir": "cypress/reports/mochawesome",
        "overwrite": false,
        "html": false,
        "json": true
      },
      "version": "4.1.0"
    }
  }
}