<svg xmlns="http://www.w3.org/2000/svg" width="120.503" height="430.66" viewBox="0 0 120.503 430.66">
  <g id="Grupo_2255" data-name="Grupo 2255" transform="translate(-1056.826 -217.195)">
    <g id="Grupo_2252" data-name="Grupo 2252" transform="translate(1056.826 331.075)">
      <g id="Grupo_2251" data-name="Grupo 2251" transform="translate(0 2.891)">
        <g id="Grupo_2250" data-name="Grupo 2250" transform="translate(20.112 128.431)">
          <path id="Trazado_2112" data-name="Trazado 2112" d="M1085.677,289.62l-23.043,159.737L1081.1,452.7l36.831-164.322Z" transform="translate(-1062.634 -287.091)" fill="#00dfc0" style="mix-blend-mode: multiply;isolation: isolate"/>
          <path id="Trazado_2113" data-name="Trazado 2113" d="M1108.81,288.008l.15,5.28-10.015,158.1h-17.917l-6.771-161.151Z" transform="translate(-1034.009 -288.008)" fill="#0cc4a5" style="mix-blend-mode: multiply;isolation: isolate"/>
        </g>
        <path id="Trazado_2114" data-name="Trazado 2114" d="M1092.667,317.168s24.668-40.97,23.73-57.695c0,0-7.172-5.918-13.7-2.088l-20.163,33.183S1076.9,309.886,1092.667,317.168Z" transform="translate(-995.92 -238.167)" fill="#2a464f"/>
        <path id="Trazado_2115" data-name="Trazado 2115" d="M1127.047,269.409s-33.789-15.752-50.666-17.926c0,0,18.023,12.154,20.032,19.093l17.057,13.629S1131.735,285.282,1127.047,269.409Z" transform="translate(-1008.668 -249.526)" fill="#2a464f"/>
        <path id="Trazado_2116" data-name="Trazado 2116" d="M1102.784,259.215c-9.283-3.522-19.325-6.822-26.4-7.732,0,0,3.74,1.361,5.752,8.3l14.28,10.8C1101.828,266.241,1103.393,263.962,1102.784,259.215Z" transform="translate(-1008.668 -249.526)" fill="#ffc2b0"/>
        <path id="Trazado_2117" data-name="Trazado 2117" d="M1130.811,357.882l-.186-31.86.041-21.856c.821-11.5-1.465-23.993-4.865-33.8l-19.994-6.756-.658,4.321-2.6,1.621-11.863-5.509-22.075,6.053-2.2,28.2,8.715,24.661-3.7,33.4Z" transform="translate(-1033.233 -219.651)" fill="#2a464f"/>
        <path id="Trazado_2118" data-name="Trazado 2118" d="M1075.7,282.122l-.834-1.856-2.04-19.716,12.4-3.521,6.471,27.04c.471,3.584-5.668,4.914-9.976,3.84a11.42,11.42,0,0,1-3.93-2.774A10.022,10.022,0,0,1,1075.7,282.122Z" transform="translate(-1017.418 -235.87)" fill="#ffc2b0"/>
        <path id="Trazado_2119" data-name="Trazado 2119" d="M1088.33,288.1a5.829,5.829,0,0,0,2.047-.5c1.859-.817,5.367-2.815,5.813-6.416a57.046,57.046,0,0,0-.907-25.028,4.845,4.845,0,0,0-3.48-3.335,26.585,26.585,0,0,0-8.48-.873h0c-5.859.53-9.993.457-10.613,6.832,0,0-1.021,9.342.374,11.835C1073.083,270.616,1071.833,288.923,1088.33,288.1Z" transform="translate(-1018.598 -248.548)" fill="#ffc2b0"/>
        <path id="Trazado_2120" data-name="Trazado 2120" d="M1078.2,258.932c1.516,2.137,1.416,4.813-.225,5.977s-4.2.374-5.717-1.766-1.416-4.817.225-5.98S1076.678,256.792,1078.2,258.932Z" transform="translate(-1021.48 -236.86)" fill="#ffc2b0"/>
        <path id="Trazado_2121" data-name="Trazado 2121" d="M1090.292,265.933s-27.2,36.67-32.691,53.187c0,0,4.4,8.695,11.9,7.725l30.8-39.963S1107.391,260.992,1090.292,265.933Z" transform="translate(-1054.918 -215.485)" fill="#2a464f"/>
        <path id="Trazado_2122" data-name="Trazado 2122" d="M1058.008,289.159s18,21.69,32.819,30.825c0,0-5.7-18.321-6.167-21.583l-8.445-17.847S1059.694,271.9,1058.008,289.159Z" transform="translate(-1053.915 -183.276)" fill="#2a464f"/>
        <path id="Trazado_2123" data-name="Trazado 2123" d="M1062.956,293.14c7.268,7.268,8.833,8.556,15.045,12.386,0,0,5.021,4.934,5.8-2.594l-11.323-18.768C1067.083,286.613,1064.8,288.615,1062.956,293.14Z" transform="translate(-1041.729 -169.041)" fill="#ffc2b0"/>
        <path id="Trazado_2124" data-name="Trazado 2124" d="M1073.891,289.533s1.332,1.97-4.035,10.821l-2.9-6.018Z" transform="translate(-1031.872 -155.821)" fill="#fdbea3"/>
        <path id="Trazado_2125" data-name="Trazado 2125" d="M1066.936,290.631s-2.039,13.951.284,12.874c3.664-1.7,5.887,1.167,4.931-4.242C1070.879,292.085,1076.836,286.556,1066.936,290.631Z" transform="translate(-1033.968 -156.528)" fill="#ffc2b0"/>
        <path id="Trazado_2126" data-name="Trazado 2126" d="M1070.72,296.664s-6.163,1.323-6.032-.312c.27-3.456,6.036-4.328,6.036-4.328Z" transform="translate(-1037.468 -149.687)" fill="#ffc2b0"/>
        <path id="Trazado_2127" data-name="Trazado 2127" d="M1064.7,298.818s-.267-6.988,1.06-7.725,2.912,4.612,2.912,4.612Z" transform="translate(-1037.482 -152.153)" fill="#ffc2b0"/>
        <path id="Trazado_2128" data-name="Trazado 2128" d="M1076.072,272.373s-1.1-9.792.675-11.565c0,0,11.645-8.882,20.526-.5,0,0,1.42-11.4-13.314-9.076-10.665,1.683-12.123,9.034-12.123,9.034l.917,10.419Z" transform="translate(-1019.858 -250.918)" fill="#292d41"/>
        <path id="Trazado_2129" data-name="Trazado 2129" d="M1076.937,334.869s-20.8,16.666-20.094,21.1c0,0,10.312,6.07,22.186-2.465,1.593-1.146,13.57-3.518,13.57-3.518a25.975,25.975,0,0,0,2.178-4.945c.668-2.026.63-6.828.63-6.828Z" transform="translate(-1056.826 -44.174)" fill="#1a3036"/>
        <path id="Trazado_2130" data-name="Trazado 2130" d="M1076.52,335.191s-1.365,9.851.758,11.389l7.514.519c3.071.828,21.755,3.864,28.605,2.095,0,0-3.387-10.977-18.962-14Z" transform="translate(-1009.389 -43.381)" fill="#1a3036"/>
      </g>
      <path id="Trazado_2131" data-name="Trazado 2131" d="M1074.542,254.987s4.149,5.911,13.7,8.092,11.025-4.588.17-8.515c0,0,5.789,2.479,7.112-.533s-14.7-7.32-20.925.4" transform="translate(-1013.197 -250.083)" fill="#292d41"/>
    </g>
    <path id="Trazado_2132" data-name="Trazado 2132" d="M1082.552,265.166c-5.71,0-8.376-3.02-8.5-3.172l.9-.776c.138.159,3.456,3.854,10.859,2.431l.222,1.17A18.439,18.439,0,0,1,1082.552,265.166Z" transform="translate(42.412 108.414)" fill="#000001"/>
    <path id="Trazado_2133" data-name="Trazado 2133" d="M1076.85,263.64l-.077-1.188c1.8-.114,2.791-.741,2.989-1.108.052-.1.031-.135.01-.173a13.616,13.616,0,0,1-1.482-4.581l1.184-.135a12.571,12.571,0,0,0,1.337,4.131,1.335,1.335,0,0,1,0,1.326C1080.3,262.84,1078.75,263.519,1076.85,263.64Z" transform="translate(49.123 96.684)" fill="#000001"/>
    <path id="Trazado_2134" data-name="Trazado 2134" d="M1074.867,257.774c.125.641.53,1.1.9,1.028s.572-.654.447-1.295-.534-1.1-.9-1.025S1074.738,257.137,1074.867,257.774Z" transform="translate(44.333 96.733)" fill="#000001"/>
    <path id="Trazado_2135" data-name="Trazado 2135" d="M1078.2,257.531c.121.63.519,1.08.886,1.008s.564-.641.439-1.271-.523-1.077-.89-1.008S1078.078,256.9,1078.2,257.531Z" transform="translate(52.552 96.187)" fill="#000001"/>
    <path id="Trazado_2136" data-name="Trazado 2136" d="M1081.368,263.283c-2.9-3.639-6.077-3.065-6.212-3.04l-.238-1.167c.163-.031,4.006-.769,7.382,3.463Z" transform="translate(44.552 102.97)" fill="#000001"/>
    <path id="Trazado_2137" data-name="Trazado 2137" d="M1079.147,255.026c-.693-.72-4.179.779-4.321.862-1.087.634-.7,1.371-.547,1.614.094.142.5-.076,1.5-.326,2.13-.533,3.044-.232,3.442-.89A1.128,1.128,0,0,0,1079.147,255.026Z" transform="translate(42.5 92.684)" fill="#292d41"/>
    <path id="Trazado_2138" data-name="Trazado 2138" d="M1078.07,255.609c.447-.6,2.795.367,2.894.433a1.288,1.288,0,0,1,.54,1.53c-.056.118-.343-.055-1.039-.246-1.482-.405-2.1-.145-2.4-.682A1.085,1.085,0,0,1,1078.07,255.609Z" transform="translate(51.995 94.12)" fill="#292d41"/>
    <g id="Grupo_2253" data-name="Grupo 2253" transform="translate(1093.527 217.195)">
      <path id="Trazado_2139" data-name="Trazado 2139" d="M1076.258,226.368q8.831-9.173,24.731-9.173,14.808,0,23.031,6.524t8.22,18.207a20.458,20.458,0,0,1-3.327,11.891,60.83,60.83,0,0,1-9.581,10.395,63.81,63.81,0,0,0-7.607,8.016,12.333,12.333,0,0,0-2.449,7.607h-22.691a26.461,26.461,0,0,1,1.562-9.508,25.421,25.421,0,0,1,3.6-6.659,71.335,71.335,0,0,1,5.437-5.98,39.883,39.883,0,0,0,4.959-5.5,8.919,8.919,0,0,0,1.561-5.232,6.179,6.179,0,0,0-1.288-4.349q-1.293-1.356-4.28-1.357a6.273,6.273,0,0,0-5.571,2.58q-1.771,2.587-1.766,8.155h-23.373Q1067.425,235.542,1076.258,226.368Zm31.186,64.544a13.52,13.52,0,0,1,3.871,9.986,13.29,13.29,0,0,1-14,14,13.509,13.509,0,0,1-9.987-3.875,13.68,13.68,0,0,1-3.874-10.121,13.274,13.274,0,0,1,13.861-13.861A13.7,13.7,0,0,1,1107.443,290.912Z" transform="translate(-1067.425 -217.195)" fill="#21b8b5"/>
    </g>
    <g id="Grupo_2254" data-name="Grupo 2254" transform="translate(1066.948 628.366)">
      <path id="Trazado_2140" data-name="Trazado 2140" d="M1067.81,339.159c-4.016-3.109-6.461-1.742-6.565-1.683l-.616-1.018c.128-.08,3.2-1.891,7.908,1.756Z" transform="translate(-1057.582 -335.939)" fill="#fff"/>
      <path id="Trazado_2141" data-name="Trazado 2141" d="M1066.931,339.943c-4.017-3.106-6.461-1.742-6.565-1.679l-.616-1.018c.128-.08,3.2-1.891,7.908,1.755Z" transform="translate(-1059.749 -334.001)" fill="#fff"/>
    </g>
    <path id="Trazado_2142" data-name="Trazado 2142" d="M1066.415,347.144l-1.191-.031c.253-9.145,9.235-10.537,9.325-10.551l.169,1.181C1074.389,337.791,1066.637,339.017,1066.415,347.144Z" transform="translate(20.682 293.962)" fill="#fff"/>
    <path id="Trazado_2143" data-name="Trazado 2143" d="M1084.1,345.762c-1.4-8.768-7.677-8.774-7.95-8.8l-.017-1.191h.007c.239,0,7.586.107,9.138,9.8Z" transform="translate(47.542 292.016)" fill="#fff"/>
    <path id="Trazado_2144" data-name="Trazado 2144" d="M1082.647,338.847l-1.109-.433c1.535-3.941,3.841-3.172,3.938-3.137l-.381,1.125C1085.04,336.385,1083.741,336.045,1082.647,338.847Z" transform="translate(60.86 290.593)" fill="#fff"/>
    <path id="Trazado_2145" data-name="Trazado 2145" d="M1083.843,339.062l-1.167-.242a3.8,3.8,0,0,1,3.657-3.161l0,1.191A2.632,2.632,0,0,0,1083.843,339.062Z" transform="translate(63.66 291.735)" fill="#fff"/>
    <rect id="Rectángulo_1254" data-name="Rectángulo 1254" width="1.19" height="14.589" transform="translate(1150.486 397.513) rotate(-13.19)" fill="#000001"/>
    <rect id="Rectángulo_1255" data-name="Rectángulo 1255" width="10.112" height="1.191" transform="translate(1091.648 418.469) rotate(-61.282)" fill="#000001"/>
  </g>
</svg>
