{
  "@context": [
    "https://w3id.org/openbadges/v2",
    "https://w3id.org/blockcerts/v2",
    "https://unicef.os.city/_themes/unicef/context.json"
  ],
  "id": "https://unicef.os.city/_themes/unicef/issuer/revocation.json",
  "type": "RevocationList",
  "issuer": "https://unicef.os.city/_themes/unicef/issuer/issuer.json",
  "revokedAssertions": [
    {
      "id": "urn:uuid:93019408-acd8-4420-be5e-0400d643954a",
      "revocationReason": "Example revocation, add as needed"
    }
  ]
}
