{
    "security": {
        "nameIdEncrypted": false,
        "authnRequestsSigned": false,
        "logoutRequestSigned": false,
        "logoutResponseSigned": false,
        "signMetadata": false,
        "wantMessagesSigned": false,
        "wantAssertionsSigned": false,
        "wantNameId" : true,
        "wantNameIdEncrypted": false,
        "wantAssertionsEncrypted": false,
        "signatureAlgorithm": "http://www.w3.org/2000/09/xmldsig#rsa-sha1",
        "digestAlgorithm": "http://www.w3.org/2000/09/xmldsig#sha1"
    },
    "contactPerson": {
        "technical": {
            "givenName": "Oscar Delgado",
            "emailAddress": "oscar.delgado@uam.es"
        },
        "support": {
            "givenName": "Oscar Delgado",
            "emailAddress": "oscar.delgado@uam.es"
        }
    },
    "organization": {
        "en-US": {
            "name": "eps_tfg",
            "displayname": "EPS TFG",
            "url": "http://eps.uam.es"
        }
    }
}
