[
    {
    "Partner": "Apoteket",
    "URL": "https://apoteket.app.staging.platform24.se",
    "ID": "200104022397",
    "LoginPageIMG": "loginPage-Apoteket.png"
    },
    {
    "Partner": "DKV",
    "URL": "https://dkv.app.staging.platform24.se",
    "LoginPageIMG": "loginPage-DKV.png"
    },
    {
    "Partner": "Euroaccident",
    "URL": "https://euroaccident.app.staging.platform24.se",
    "ID": "198405306880",
    "LoginPageIMG": "loginPage-Euroaccident.png"
    },
    {
    "Partner": "Doktor24",
    "URL": "https://doktor24.app.staging.platform24.se",
    "ID": "200104022397",
    "LoginPageIMG": "loginPage-Doktor24.png"
    }
]