<?xml version="1.0" standalone="no"?>
<!DOCTYPE svg PUBLIC "-//W3C//DTD SVG 20010904//EN"
 "http://www.w3.org/TR/2001/REC-SVG-20010904/DTD/svg10.dtd">
<svg version="1.0" xmlns="http://www.w3.org/2000/svg"
 width="1600.000000pt" height="1600.000000pt" viewBox="0 0 1600.000000 1600.000000"
 preserveAspectRatio="xMidYMid meet">
<metadata>
Created by potrace 1.14, written by Peter Selinger 2001-2017
</metadata>
<g transform="translate(0.000000,1600.000000) scale(0.100000,-0.100000)"
fill="#000000" stroke="none">
<path d="M1958 11313 c-6 -12 -3 -3462 3 -3467 2 -3 112 81 244 186 298 237
534 414 735 551 151 102 416 267 513 317 l47 25 0 1197 0 1198 -769 0 c-424 0
-771 -3 -773 -7z"/>
<path d="M4150 10300 c0 -561 2 -1020 4 -1020 5 0 87 37 196 87 124 58 404
180 510 223 30 12 69 28 85 35 47 21 212 84 300 116 44 16 89 34 100 39 86 39
696 238 950 310 83 24 152 44 154 46 4 4 -244 496 -563 1119 l-31 60 -852 3
-853 2 0 -1020z"/>
<path d="M8166 11288 c-7 -18 -43 -98 -79 -178 -35 -80 -113 -253 -172 -385
-58 -132 -113 -253 -120 -268 l-14 -28 37 6 c20 3 48 8 62 10 47 8 245 34 303
40 32 4 66 8 75 10 9 1 51 6 92 10 41 4 82 9 91 10 8 2 55 6 105 10 49 4 100
8 114 10 14 2 66 7 115 10 50 4 110 9 135 11 25 2 95 6 155 9 61 3 133 8 160
10 83 6 440 17 631 19 99 1 184 5 190 8 5 4 9 145 9 360 l0 353 -937 3 -938 2
-14 -32z"/>
<path d="M12999 11316 c-2 -2 -26 -6 -54 -10 -27 -3 -59 -8 -70 -10 -11 -2
-40 -7 -65 -11 -25 -4 -72 -14 -105 -22 -33 -8 -71 -17 -85 -19 -50 -9 -263
-75 -363 -113 -212 -80 -435 -194 -602 -309 -93 -64 -247 -187 -289 -231 l-30
-31 30 -1 c16 -1 47 -2 69 -4 22 -1 90 -5 150 -9 61 -4 135 -9 165 -11 60 -6
126 -11 235 -20 39 -3 93 -7 120 -10 28 -2 82 -7 120 -11 39 -3 84 -7 100 -10
17 -2 59 -6 95 -9 36 -4 81 -8 100 -11 19 -2 60 -6 90 -9 55 -5 204 -22 270
-30 19 -3 58 -7 85 -10 28 -3 66 -8 85 -10 19 -3 49 -7 65 -9 17 -2 48 -7 70
-10 22 -3 78 -10 125 -16 120 -16 151 -20 180 -25 14 -3 48 -7 75 -10 28 -3
61 -8 75 -10 14 -3 43 -7 65 -11 22 -3 83 -12 135 -20 52 -9 106 -17 120 -19
14 -2 39 -6 55 -8 17 -3 50 -9 75 -12 25 -4 54 -9 65 -11 11 -3 36 -7 55 -10
19 -3 71 -11 115 -19 44 -8 96 -17 115 -20 19 -3 73 -13 120 -21 106 -20 94
-18 225 -42 61 -12 121 -23 135 -26 74 -13 343 -69 390 -81 30 -8 66 -16 80
-19 14 -2 37 -7 53 -11 15 -4 27 -3 28 1 3 29 4 1292 0 1307 -3 16 -67 17
-1236 17 -678 0 -1234 -2 -1236 -4z"/>
<path d="M9849 10446 c-2 -2 -83 -7 -179 -11 -96 -4 -195 -8 -220 -10 -25 -2
-94 -6 -155 -10 -60 -3 -128 -8 -150 -10 -22 -3 -83 -7 -135 -10 -52 -3 -104
-7 -115 -9 -17 -3 -78 -9 -215 -21 -45 -4 -148 -15 -180 -20 -14 -2 -52 -7
-85 -10 -33 -4 -67 -8 -75 -10 -8 -2 -43 -7 -78 -10 -35 -4 -71 -8 -80 -10 -9
-1 -42 -6 -72 -10 -30 -4 -64 -9 -75 -11 -10 -2 -37 -6 -60 -9 -22 -3 -80 -13
-130 -21 -49 -9 -103 -17 -119 -20 -16 -2 -92 -15 -170 -30 -77 -14 -152 -28
-166 -30 -14 -3 -32 -7 -40 -9 -8 -2 -31 -7 -50 -10 -19 -3 -54 -10 -78 -16
-23 -5 -59 -12 -80 -15 -20 -3 -46 -11 -57 -17 -11 -6 -20 -9 -20 -7 0 3 -29
-2 -90 -14 -117 -24 -555 -139 -770 -202 -27 -8 -54 -16 -60 -18 -5 -1 -50
-15 -100 -31 -49 -16 -92 -29 -95 -30 -22 -5 -260 -86 -535 -181 -136 -48
-348 -127 -400 -149 -16 -7 -77 -32 -135 -55 -835 -336 -1763 -872 -2485
-1435 -50 -38 -94 -73 -100 -77 -5 -4 -42 -34 -81 -65 -39 -32 -90 -74 -114
-93 -52 -42 -183 -152 -190 -161 -3 -3 -43 -39 -90 -80 -47 -40 -105 -92 -130
-114 -60 -53 -584 -578 -635 -635 -182 -204 -199 -223 -373 -435 -10 -11 -33
-40 -52 -65 -19 -25 -37 -47 -40 -50 -5 -5 -98 -131 -174 -237 -24 -33 -33
-53 -24 -54 7 0 201 -1 431 -1 l418 -1 16 23 c16 23 203 251 213 260 3 3 35
39 70 79 196 226 565 595 864 866 6 6 45 39 86 75 41 36 77 67 80 70 15 16
303 251 405 331 355 277 896 644 1230 832 33 19 78 44 100 57 123 70 261 144
430 229 180 91 241 120 430 206 44 20 89 40 100 45 55 25 325 134 435 175 258
96 972 339 1035 351 6 1 66 19 135 39 69 20 157 45 195 55 229 60 352 92 370
95 11 3 70 16 130 31 61 14 117 27 125 29 8 2 103 21 210 44 166 34 323 64
445 86 75 13 222 38 242 40 24 3 95 15 127 21 11 2 54 8 95 14 42 6 87 12 101
14 23 4 69 11 155 22 17 2 48 6 70 9 22 2 60 7 85 10 55 7 114 14 160 20 19 3
62 7 95 10 33 3 78 7 100 9 22 3 69 7 105 11 36 3 86 8 111 10 26 3 75 7 110
10 35 2 98 7 139 10 150 12 197 15 300 21 58 3 132 7 165 9 476 27 1630 27
2075 0 36 -2 112 -7 170 -10 188 -10 274 -15 325 -20 28 -3 91 -7 140 -10 50
-3 113 -8 140 -11 28 -3 75 -7 105 -9 30 -3 75 -7 100 -10 25 -2 77 -7 115
-10 71 -6 121 -12 185 -20 19 -2 62 -7 95 -10 58 -6 199 -22 260 -30 17 -2 53
-7 80 -10 28 -3 64 -8 80 -10 37 -6 85 -12 150 -20 28 -4 57 -8 65 -10 8 -3
44 -7 80 -11 36 -3 68 -8 71 -10 4 -2 24 -6 45 -9 136 -18 192 -29 188 -37 -3
-5 -9 -6 -13 -4 -4 3 -30 8 -57 11 -27 3 -67 7 -89 10 -22 3 -60 7 -85 10 -25
3 -117 12 -205 20 -88 8 -180 17 -205 20 -25 2 -79 7 -120 10 -41 3 -100 8
-130 10 -88 7 -229 16 -305 20 -397 21 -406 21 -730 30 -277 8 -888 8 -1120 1
-271 -9 -479 -17 -533 -21 -30 -2 -108 -6 -175 -10 -67 -4 -138 -8 -157 -10
-19 -2 -80 -6 -135 -10 -55 -4 -116 -8 -135 -10 -19 -2 -73 -6 -120 -9 -47 -4
-96 -9 -110 -11 -14 -2 -56 -7 -95 -10 -38 -3 -88 -8 -110 -11 -22 -2 -56 -6
-75 -8 -118 -12 -177 -19 -195 -22 -11 -2 -47 -6 -80 -9 -33 -3 -71 -8 -85
-10 -14 -3 -43 -7 -65 -10 -37 -4 -67 -8 -155 -21 -19 -2 -53 -7 -75 -9 -22
-3 -65 -10 -95 -15 -30 -5 -77 -12 -105 -16 -27 -3 -59 -8 -70 -10 -24 -5
-185 -31 -240 -39 -22 -4 -47 -8 -55 -10 -8 -2 -31 -7 -50 -10 -30 -5 -77 -14
-265 -51 -11 -2 -31 -6 -45 -9 -14 -2 -40 -7 -59 -10 -19 -3 -37 -7 -40 -9 -3
-2 -22 -7 -41 -10 -19 -3 -69 -12 -110 -21 -93 -20 -91 -20 -171 -39 -37 -8
-78 -17 -90 -20 -13 -2 -53 -12 -89 -21 -36 -9 -72 -18 -80 -20 -56 -12 -363
-92 -482 -126 -78 -22 -150 -42 -158 -44 -8 -2 -82 -25 -165 -50 -82 -26 -163
-51 -180 -55 -38 -10 -450 -149 -575 -193 -415 -149 -827 -328 -1245 -541
-231 -118 -241 -124 -450 -244 -323 -186 -755 -466 -950 -614 -5 -5 -80 -60
-165 -124 -85 -65 -177 -135 -205 -158 -102 -82 -340 -281 -345 -287 -3 -3
-30 -27 -60 -54 -230 -201 -567 -535 -767 -760 -97 -110 -102 -116 -162 -190
-31 -38 -64 -79 -74 -90 -10 -11 -28 -32 -39 -47 l-19 -28 755 0 c598 0 756 3
756 13 1 6 1 147 2 311 l0 300 52 46 c50 46 79 72 201 175 32 28 70 60 84 72
14 13 31 26 36 30 46 36 111 89 115 94 3 3 43 36 90 73 l85 66 3 -590 2 -590
750 0 750 0 1 28 c0 15 0 507 1 1093 l0 1066 43 22 c47 23 55 25 55 12 0 -5
65 -114 144 -242 135 -219 301 -489 329 -534 7 -11 23 -38 37 -60 14 -22 30
-49 37 -60 10 -18 148 -241 298 -485 200 -322 296 -479 400 -648 103 -169 119
-191 130 -175 10 15 86 141 146 241 9 15 91 150 183 301 91 151 166 278 166
282 0 5 4 9 9 9 5 0 12 8 15 18 3 9 12 26 19 37 7 11 45 74 85 140 40 66 77
127 82 135 5 8 64 105 130 215 66 110 125 207 130 215 5 8 70 116 146 240 75
124 175 289 223 367 47 78 87 140 89 138 2 -2 4 -532 4 -1179 l0 -1176 751 0
752 0 0 1755 0 1755 45 6 c25 4 54 8 65 10 10 2 37 6 60 9 22 3 51 8 65 10 14
2 45 7 70 10 25 3 56 8 70 10 14 2 43 7 65 10 22 2 72 9 110 15 39 5 75 10 81
10 7 0 3 -34 -12 -97 -31 -127 -51 -226 -60 -288 -3 -27 -8 -59 -10 -70 -2
-11 -7 -49 -10 -85 -3 -36 -8 -76 -11 -90 -9 -46 -11 -504 -2 -590 27 -273 60
-440 125 -640 15 -47 28 -87 29 -90 1 -3 6 -16 12 -30 6 -14 21 -50 33 -80 37
-93 121 -249 190 -355 156 -236 310 -397 585 -613 83 -65 302 -195 438 -260
140 -67 358 -154 431 -172 17 -5 72 -20 121 -35 82 -25 241 -63 290 -70 34 -4
88 -15 120 -22 41 -10 2515 -15 2516 -6 0 4 2 342 2 751 l2 742 -1172 0 -1173
0 -104 35 c-341 114 -614 310 -775 555 -75 114 -129 239 -147 336 -3 15 -7 31
-9 34 -19 31 -28 364 -12 465 25 160 89 323 180 460 129 191 441 420 586 430
31 2 103 6 161 10 58 3 130 8 160 10 30 2 116 7 190 11 74 3 162 8 195 9 54 3
210 10 455 20 276 11 626 18 992 19 229 0 414 4 411 9 -2 4 -13 7 -23 7 -11 0
-64 12 -117 26 -54 14 -105 27 -113 29 -8 2 -44 11 -80 20 -36 9 -72 18 -80
20 -8 2 -98 22 -200 45 -102 23 -196 44 -210 46 -14 3 -33 7 -42 10 -9 3 -25
6 -35 8 -275 54 -501 97 -548 105 -93 16 -118 20 -145 26 -14 3 -54 10 -90 16
-36 5 -76 12 -90 14 -152 25 -322 50 -475 71 -174 23 -180 24 -200 28 -11 2
-47 7 -80 10 -33 3 -76 8 -95 11 -19 2 -56 7 -82 10 -27 3 -67 7 -90 10 -44 6
-60 8 -183 20 -38 3 -81 8 -95 10 -14 2 -61 7 -105 10 -44 3 -93 8 -110 10
-16 2 -66 6 -110 10 -44 3 -102 8 -130 10 -27 3 -93 7 -145 10 -52 4 -120 8
-150 10 -30 3 -113 7 -185 11 -71 3 -161 8 -200 10 -89 6 -1351 14 -1356 10z
m5201 -572 c0 -2 -13 -4 -30 -4 -16 0 -30 4 -30 8 0 5 14 7 30 4 17 -2 30 -6
30 -8z m43 -11 c-7 -2 -19 -2 -25 0 -7 3 -2 5 12 5 14 0 19 -2 13 -5z"/>
<path d="M3455 5546 c-122 -38 -185 -115 -185 -229 0 -74 59 -150 145 -187 23
-10 81 -27 130 -39 183 -45 219 -62 246 -117 18 -38 19 -49 9 -79 -24 -74 -88
-107 -206 -108 -69 -1 -89 3 -137 27 -59 28 -96 76 -111 139 -6 23 -11 27 -34
23 -15 -2 -38 -5 -51 -5 -21 -1 -23 -4 -18 -45 7 -55 27 -95 74 -147 60 -66
158 -98 288 -94 96 3 108 6 172 39 146 74 182 262 71 367 -46 43 -95 64 -239
100 -191 47 -228 70 -229 136 0 46 16 75 56 103 50 34 189 39 251 8 44 -21 76
-61 88 -111 7 -26 11 -28 51 -26 67 4 71 9 51 73 -25 79 -86 139 -168 164 -73
23 -193 26 -254 8z"/>
<path d="M7966 5543 c-132 -39 -232 -148 -265 -289 -45 -190 14 -393 142 -491
121 -92 306 -105 448 -33 93 48 176 167 198 285 24 130 -8 295 -75 387 -95
132 -280 190 -448 141z m269 -118 c105 -62 147 -158 141 -324 -4 -123 -24
-179 -85 -240 -57 -57 -95 -73 -186 -77 -68 -3 -88 0 -132 20 -120 56 -174
162 -168 334 3 97 15 147 51 204 74 116 254 156 379 83z"/>
<path d="M11265 5546 c-122 -38 -185 -115 -185 -229 0 -72 59 -151 140 -185
19 -8 93 -30 164 -49 183 -48 217 -70 230 -153 8 -55 -48 -116 -124 -136 -73
-19 -163 -10 -229 23 -48 24 -60 36 -83 83 -14 30 -26 59 -25 64 2 10 -6 11
-72 8 l-33 -2 5 -45 c12 -97 85 -181 191 -221 70 -26 221 -26 301 1 203 66
241 316 65 422 -34 21 -145 57 -206 67 -72 13 -163 48 -188 72 -46 47 -29 130
36 168 37 23 160 32 215 17 52 -14 95 -56 113 -110 13 -41 14 -42 57 -40 60 4
65 9 55 55 -20 91 -87 157 -188 187 -61 18 -184 19 -239 3z"/>
<path d="M12473 5550 c-106 -24 -205 -105 -253 -205 -85 -179 -44 -449 88
-573 135 -125 405 -118 523 14 40 46 47 57 74 118 l25 57 -24 9 c-13 5 -40 12
-59 15 -35 7 -36 6 -46 -32 -40 -148 -206 -215 -357 -144 -47 22 -67 39 -92
77 -91 143 -78 396 27 503 92 95 283 98 363 7 11 -11 28 -40 39 -63 22 -48 22
-48 85 -32 44 11 54 25 32 47 -7 7 -9 12 -5 12 11 0 -52 90 -83 119 -50 48
-128 75 -220 77 -47 1 -99 -2 -117 -6z"/>
<path d="M13324 5546 c-129 -31 -231 -134 -275 -276 -6 -19 -13 -78 -15 -130
-3 -76 0 -109 17 -165 58 -192 211 -301 409 -291 261 14 415 228 377 523 -33
252 -258 401 -513 339z m219 -103 c141 -51 214 -236 172 -438 -16 -79 -77
-160 -148 -198 -34 -18 -58 -22 -132 -22 -80 0 -95 3 -137 27 -101 60 -149
156 -149 299 0 166 48 267 155 321 73 37 154 41 239 11z"/>
<path d="M401 5542 c-13 -4 -16 -841 -3 -843 34 -5 89 -5 97 0 11 6 15 840 5
842 -13 4 -89 4 -99 1z"/>
<path d="M704 5541 c-2 -2 -4 -193 -4 -423 0 -391 1 -418 18 -419 18 -2 58 -2
79 0 10 1 13 77 15 328 l3 326 219 -326 c120 -179 223 -328 230 -330 9 -3 41
-3 94 2 9 1 12 93 12 425 l0 424 -52 -2 -53 -2 0 -327 c0 -180 -2 -327 -5
-327 -3 0 -104 148 -225 329 l-220 329 -53 -1 c-29 -1 -55 -4 -58 -6z"/>
<path d="M1564 5536 c-2 -6 -3 -198 -2 -426 l3 -415 170 0 c94 0 195 4 225 8
70 10 146 45 188 88 36 36 86 125 96 174 3 17 9 41 12 55 10 51 4 197 -10 253
-23 84 -51 134 -107 187 -76 73 -121 83 -367 85 -140 1 -205 -2 -208 -9z m438
-114 c100 -45 149 -152 143 -310 -6 -157 -45 -241 -132 -289 -31 -18 -103 -26
-228 -27 l-110 0 -2 314 c-1 173 -1 320 2 326 2 8 48 10 143 8 113 -2 149 -6
184 -22z"/>
<path d="M2422 5226 c3 -237 8 -330 18 -356 48 -126 135 -180 297 -185 173 -6
288 59 329 188 15 43 18 106 22 363 l4 310 -58 0 -58 -1 -1 -295 c-1 -307 -6
-344 -47 -402 -44 -63 -213 -84 -298 -37 -44 24 -76 66 -86 111 -10 44 -13
133 -14 378 l0 246 -56 0 -56 1 4 -321z"/>
<path d="M4009 5545 c-6 -1 -4 -91 1 -95 5 -3 67 -5 139 -4 85 0 131 -3 132
-10 1 -6 2 -171 4 -366 1 -195 3 -360 4 -366 0 -5 24 -10 54 -10 l52 1 1 365
c1 201 2 370 3 375 1 7 50 11 140 10 l139 0 -2 50 -1 50 -332 0 c-183 0 -333
0 -334 0z"/>
<path d="M4796 5541 c-2 -3 -2 -195 -2 -426 l1 -419 45 -1 c25 -1 50 0 56 2 7
3 11 65 12 184 0 100 3 184 7 187 3 4 50 5 103 4 133 -4 150 -16 269 -197 130
-200 109 -179 186 -180 37 0 67 3 67 6 0 3 -8 17 -18 30 -10 13 -47 71 -83
128 -63 102 -130 182 -178 212 l-23 14 26 3 c42 3 121 41 149 70 38 39 59 99
59 163 0 106 -69 192 -172 215 -40 9 -500 13 -504 5z m483 -109 c69 -35 97
-117 62 -183 -33 -61 -74 -74 -263 -78 l-168 -3 -1 28 c-1 39 -1 226 0 242 1
9 42 12 169 12 139 0 173 -3 201 -18z"/>
<path d="M5565 5511 c12 -20 86 -130 164 -246 l141 -210 0 -180 0 -181 55 0
55 1 1 35 c0 19 0 100 0 180 l-1 145 165 237 c91 130 165 241 165 246 0 9
-115 11 -124 2 -8 -9 -206 -310 -206 -315 0 -2 -11 -20 -24 -40 l-25 -36 -14
23 c-8 13 -36 58 -63 101 -27 43 -54 86 -59 95 -6 10 -34 53 -64 97 l-53 80
-68 1 -68 1 23 -36z"/>
<path d="M6728 5536 c-3 -9 -2 -779 1 -827 1 -12 11 -15 49 -13 26 1 49 2 52
3 3 1 5 156 5 346 0 190 2 345 5 345 3 0 56 -152 119 -338 63 -185 118 -342
122 -348 7 -8 59 -11 100 -5 4 1 9 11 12 24 3 12 30 94 61 182 31 88 67 192
81 230 13 39 40 115 59 170 l36 100 0 -352 c0 -194 3 -353 8 -354 4 0 28 -2
53 -3 l47 -2 0 427 -1 427 -71 -3 c-39 -2 -74 -4 -78 -4 -3 -1 -13 -22 -21
-48 -14 -47 -212 -623 -223 -653 -4 -8 -61 147 -128 345 l-121 360 -82 1 c-50
0 -84 -4 -85 -10z"/>
<path d="M8566 5543 c-6 -6 94 -282 134 -368 5 -11 48 -121 96 -245 47 -124
88 -227 90 -229 2 -2 26 -5 54 -6 61 -3 64 0 110 125 17 47 36 94 41 105 16
35 239 609 239 615 0 4 -25 6 -55 7 -53 0 -54 -1 -69 -37 -35 -89 -248 -667
-252 -684 -7 -35 -12 -28 -32 36 -17 54 -89 256 -177 498 -13 36 -33 92 -45
125 l-21 60 -54 1 c-30 1 -56 0 -59 -3z"/>
<path d="M9439 5536 c-5 -57 -3 -815 2 -826 6 -13 50 -15 311 -15 166 0 308 3
313 7 6 3 9 26 7 50 l-4 44 -259 0 -259 -1 0 145 0 146 233 -1 232 0 0 50 0
50 -233 0 -232 0 0 131 0 130 249 0 249 -1 4 35 c6 70 29 65 -307 66 -207 0
-305 -3 -306 -10z"/>
<path d="M10232 5121 l3 -425 53 -1 52 -1 1 56 c0 30 1 115 2 189 l2 135 97
-2 c65 -1 108 -7 127 -16 41 -22 91 -83 178 -221 42 -66 82 -125 89 -131 10
-8 91 -11 136 -5 5 1 -22 44 -149 237 -39 60 -76 100 -117 125 -21 13 -26 20
-15 23 8 2 32 10 54 17 111 34 167 112 161 226 -6 106 -71 186 -166 208 -19 5
-142 9 -273 10 l-237 2 2 -426z m485 308 c56 -27 77 -66 70 -132 -3 -34 -11
-56 -29 -73 -42 -42 -90 -52 -260 -53 l-157 -2 0 141 1 140 166 0 c148 0 170
-2 209 -21z"/>
<path d="M13990 5123 c0 -232 3 -424 8 -424 4 -1 28 -2 55 -3 55 -2 49 -28 49
217 0 153 1 157 22 158 102 5 176 -1 203 -15 31 -15 109 -97 122 -126 10 -24
143 -224 153 -231 7 -5 75 -5 126 0 9 1 7 9 -7 29 -11 15 -53 79 -94 142 -77
118 -110 158 -152 186 -14 9 -25 19 -25 23 0 4 21 13 48 19 100 27 159 96 169
197 10 93 -42 191 -116 222 -57 24 -65 25 -318 27 l-243 3 0 -424z m479 314
c124 -54 106 -221 -29 -257 -22 -6 -105 -9 -187 -8 l-148 3 -1 138 -1 138 170
-1 c101 -1 181 -6 196 -13z"/>
<path d="M14849 5536 c-3 -29 -4 -822 -2 -831 3 -8 64 -11 105 -6 4 1 7 76 7
168 1 91 2 168 5 170 2 2 77 5 167 7 173 4 219 13 279 58 77 57 109 216 61
310 -36 68 -85 106 -161 123 -58 13 -460 14 -461 1z m448 -105 c50 -20 77 -67
78 -132 0 -67 -14 -96 -61 -128 -32 -22 -46 -24 -188 -28 -90 -3 -156 -1 -160
5 -5 9 -9 127 -7 243 l1 55 153 -1 c99 -1 164 -5 184 -14z"/>
<path d="M15503 4805 c-2 -7 -3 -34 -1 -61 l3 -49 55 0 55 0 0 60 0 59 -53 2
c-34 0 -56 -4 -59 -11z"/>
</g>
</svg>
