[
    {
        "id": 1,
        "title": "AWS Certified Solutions Architect - Associate 2020",
        "body": "Want to pass the AWS Solutions Architect - Associate Exam? Want to become Amazon Web Services Certified? Do this course!",
        "date": "September 2, 2020",
        "icon": "emoji_nature",
        "link": "https://www.udemy.com/?utm_source=adwords-brand&utm_medium=udemyads&utm_campaign=Brand-Udemy_la.EN_cc.ROW&utm_term=_._ag_80315195513_._ad_450687451854_._de_c_._dm__._pl__._ti_kwd-310556426868_._li_2807_._pd__._&utm_term=_._pd__._kw_udemy_._&matchtype=e&gclid=CjwKCAjwmrn5BRB2EiwAZgL9ooVmd50ytgFvb2uqVmLPsLKVaB5cpcDs_vcdg2CAltAXNpNbetHFGhoCIfkQAvD_BwE"
        },
        {
        "id": 2,
        "title": "Network Hacking Continued - Intermediate to Advanced",
        "body": "Learn advanced techniques to hack into WiFi & wired networks & write own python scripts to implement custom MITM attacks",
        "date": "September 12, 2020",
        "icon": "emoji_events",
        "link": "https://www.udemy.com/?utm_source=adwords-brand&utm_medium=udemyads&utm_campaign=Brand-Udemy_la.EN_cc.ROW&utm_term=_._ag_80315195513_._ad_450687451854_._de_c_._dm__._pl__._ti_kwd-310556426868_._li_2807_._pd__._&utm_term=_._pd__._kw_udemy_._&matchtype=e&gclid=CjwKCAjwmrn5BRB2EiwAZgL9ooVmd50ytgFvb2uqVmLPsLKVaB5cpcDs_vcdg2CAltAXNpNbetHFGhoCIfkQAvD_BwE"
        },
        {
        "id": 3,
        "title": "Learn Linux in 5 Days and Level Up Your Career",
        "body": "Use the in-demand Linux skills you learn in this course to get promoted or start a new career as a Linux professional.",
        "date": "October 5, 2020",
        "icon": "emoji_objects",
        "link": "https://www.udemy.com/?utm_source=adwords-brand&utm_medium=udemyads&utm_campaign=Brand-Udemy_la.EN_cc.ROW&utm_term=_._ag_80315195513_._ad_450687451854_._de_c_._dm__._pl__._ti_kwd-310556426868_._li_2807_._pd__._&utm_term=_._pd__._kw_udemy_._&matchtype=e&gclid=CjwKCAjwmrn5BRB2EiwAZgL9ooVmd50ytgFvb2uqVmLPsLKVaB5cpcDs_vcdg2CAltAXNpNbetHFGhoCIfkQAvD_BwE"
        },
        {
        "id": 4,
        "title": "The Complete Networking Fundamentals Course. Your CCNA start",
        "body": "Learn about networking and start your journey to Cisco 200-301 Certification. This course is for anyone who wants to attain the Cisco CCNA certification",
        "date": "October 8, 2020",
        "icon": "charging_station",
        "link": "https://www.udemy.com/?utm_source=adwords-brand&utm_medium=udemyads&utm_campaign=Brand-Udemy_la.EN_cc.ROW&utm_term=_._ag_80315195513_._ad_450687451854_._de_c_._dm__._pl__._ti_kwd-310556426868_._li_2807_._pd__._&utm_term=_._pd__._kw_udemy_._&matchtype=e&gclid=CjwKCAjwmrn5BRB2EiwAZgL9ooVmd50ytgFvb2uqVmLPsLKVaB5cpcDs_vcdg2CAltAXNpNbetHFGhoCIfkQAvD_BwE"
        },
        {
        "id": 5,
        "title": "Scrum Certification Prep +Scrum Master+ Agile Scrum Training",
        "body": "Overview of Scrum Agile project management+common questions+tips to pass PSM scrum org ONLINE Scrum Master Certification.",
        "date": "October 18, 2020",
        "icon": "pedal_bike",
        "link": "https://www.udemy.com/?utm_source=adwords-brand&utm_medium=udemyads&utm_campaign=Brand-Udemy_la.EN_cc.ROW&utm_term=_._ag_80315195513_._ad_450687451854_._de_c_._dm__._pl__._ti_kwd-310556426868_._li_2807_._pd__._&utm_term=_._pd__._kw_udemy_._&matchtype=e&gclid=CjwKCAjwmrn5BRB2EiwAZgL9ooVmd50ytgFvb2uqVmLPsLKVaB5cpcDs_vcdg2CAltAXNpNbetHFGhoCIfkQAvD_BwE"
        }
]