{
  "products": [
    {
      "id": 1,
      "name": "iPhone 13 128Gb",
      "price": 31999,
      "imgSrc": "https://content1.rozetka.com.ua/goods/images/big/221214139.jpg",
      "color": "Midnight"
    },

    {
      "id": 2,
      "name": "iPhone 14 128Gb",
      "price": 42499,
      "imgSrc": "https://content2.rozetka.com.ua/goods/images/big/284913542.jpg",
      "color": "Red"
    },

    {
      "id": 3,
      "name": "iPhone 14Pro 256Gb",
      "price": 52499,
      "imgSrc": "https://content1.rozetka.com.ua/goods/images/big/284920772.jpg",
      "color": "Gold"
    },

    {
      "id": 4,
      "name": "iPhone 14Pro Max 256Gb",
      "price": 57499,
      "imgSrc": "https://content1.rozetka.com.ua/goods/images/big/284924170.jpg",
      "color": "Deep Purple"
    },

    {
      "id": 5,
      "name": "iPhone 15 256Gb",
      "price": 47499,
      "imgSrc": "https://content.rozetka.com.ua/goods/images/big/364623606.jpg",
      "color": "Green"
    },

    {
      "id": 6,
      "name": "iPhone 15Pro 256Gb",
      "price": 58499,
      "imgSrc": "https://content1.rozetka.com.ua/goods/images/big/364827150.jpg",
      "color": "Blue Titianium"
    },

    {
      "id": 7,
      "name": "Samsung Galaxy S22 8/256GB",
      "price": 24599,
      "imgSrc": "https://content2.rozetka.com.ua/goods/images/big/253280106.jpg",
      "color": "Phantom Black"
    },

    {
      "id": 8,
      "name": "Samsung Galaxy S23 8/128GB",
      "price": 35999,
      "imgSrc": "https://content.rozetka.com.ua/goods/images/big/310594229.jpg",
      "color": "Phantom Black"
    },

    {
      "id": 9,
      "name": "Samsung Galaxy S23 Ultra 12/256GB",
      "price": 52299,
      "imgSrc": "https://content1.rozetka.com.ua/goods/images/big/310655485.jpg",
      "color": "Light Pink"
    },

    {
      "id": 10,
      "name": "Samsung Galaxy Fold 5 12/256GB",
      "price": 74999,
      "imgSrc": "https://content.rozetka.com.ua/goods/images/big/353442633.jpg",
      "color": "Black"
    },

    {
      "id": 11,
      "name": "Samsung Galaxy Fold 5 12GB/1TB",
      "price": 86999,
      "imgSrc": "https://content1.rozetka.com.ua/goods/images/big/353421865.jpg",
      "color": "Black"
    }
  ]
}
