<svg width="55" height="55" viewBox="0 0 55 55" fill="none" xmlns="http://www.w3.org/2000/svg">
<path d="M9.95215 10C9.35768 10 9.45215 10.4818 9.45215 11.0763V13.3432C9.45215 14.799 7.61077 16.8032 6.30516 17.2514L6.27162 11.0764C6.27162 10.4819 6.04662 10 5.45215 10C4.85768 10 4.78186 10.4819 4.78186 11.0764V17.1812C3.47625 16.7328 1.45215 14.7989 1.45215 13.3431V11.0764C1.45215 10.4819 1.54662 10 0.952148 10C0.357676 10 0 10.4819 0 11.0764V13.3432C0 15.9942 2.14982 18.2107 4.65555 18.7122V25.0528C3.37142 25.4996 2.19098 26.7213 2.19098 28.1557V40.4596C2 43.5 3.66459 43.7445 5.47594 43.7445C7.28729 43.7445 8.7609 44 8.7609 40.4596V28.1556C8.7609 26.7212 7.58929 25.4996 6.30516 25.0528V18.7122C8.81089 18.2107 10.9519 15.9941 10.9519 13.3431V11.0763C10.9519 10.4819 10.5466 10 9.95215 10ZM7.5 41.5C7.5 42 6.12444 42.5 5.5 42.5C4.87556 42.5 3.61498 41.9618 3.61498 41.3374V34.3557V28C3.61498 27.3757 4.87556 26.5 5.5 26.5C6.12444 26.5 7.5 27.3757 7.5 28V34.3557V37.3557V41.5Z" fill="#535353"/>
<path d="M53.3698 20.4328C54.2305 19.2768 54.4527 17.9689 54.4527 16.3649C54.4527 14.7608 54.2306 13.4531 53.3698 12.297C52.4384 11.0458 51.4179 10.5 50.0463 10.5C48.6748 10.5 47.6736 11.0458 46.742 12.297C45.8814 13.4531 45.4524 14.7607 45.4524 16.3649C45.4524 17.9689 45.8813 19.2768 46.742 20.4328C47.4237 21.3485 48.2355 22.1426 49.1864 22.4065V25.1971C47.9023 25.6439 47.4527 26.8655 47.4527 28.2999V40.5C47.4527 42.3113 48.1413 43 49.9527 43C51.764 43 52.7546 42.4152 52.7546 40.6039V38.7942C52.7546 38.1998 52.5471 37.5 51.9527 37.5C51.3582 37.5 51.1786 38.1998 51.1786 38.7942V40.6039C51.1786 41.2282 50.6707 41.7362 50.0462 41.7362C49.4218 41.7362 48.9139 41.2283 48.9139 40.6039V28.2999C48.9139 27.6755 49.4218 27.1677 50.0462 27.1677C50.6707 27.1677 51.1786 27.6755 51.1786 28.2999V29.0884C51.1786 29.6828 51.3582 30 51.9527 30C52.5471 30 52.7787 29.6828 52.7787 29.0884V28.2999C52.7787 26.8655 52.0689 25.6439 50.7848 25.1971V22.4065C51.7356 22.1427 52.6881 21.3485 53.3698 20.4328ZM47.2929 16.3649C47.2929 14.1598 48.5538 12.297 50.0463 12.297C51.5387 12.297 52.7997 14.1598 52.7997 16.3649C52.7997 18.5699 51.5387 20.4328 50.0463 20.4328C48.5538 20.4328 47.2929 18.5699 47.2929 16.3649Z" fill="#535353"/>
<path d="M27.7373 12.0001C18.5883 12.0001 11.4524 19.1143 11.4524 28.2634C11.4524 37.4124 18.5883 44.5001 27.7373 44.5001C36.8863 44.5001 43.7614 37.4124 43.7614 28.2634C43.7614 19.1143 36.8863 12.0001 27.7373 12.0001ZM27.7373 42.703C19.7753 42.703 13.2977 36.2255 13.2977 28.2634C13.2977 20.3012 19.7752 13.8237 27.7373 13.8237C35.6994 13.8237 42.177 20.3014 42.177 28.2634C42.177 36.2254 35.6993 42.703 27.7373 42.703Z" fill="#535353"/>
<path d="M27.7373 15.9905C20.9699 15.9905 15.4644 21.4961 15.4644 28.2635C15.4644 35.0308 20.9699 40.5364 27.7373 40.5364C34.5047 40.5364 40.0103 35.0308 40.0103 28.2635C40.0103 21.4961 34.5046 15.9905 27.7373 15.9905ZM27.7373 39C22.157 39 17.2026 33.8437 17.2026 28.2635C17.2026 22.6832 22.1571 17.5 27.7373 17.5C33.3176 17.5 38.4526 22.9198 38.4526 28.5C38.4526 34.0803 33.3176 39 27.7373 39Z" fill="#535353"/>
<path d="M34 28C34 28.5933 33.8358 29.1734 33.5281 29.6667C33.2204 30.1601 32.7831 30.5446 32.2714 30.7716C31.7597 30.9987 31.1966 31.0581 30.6534 30.9423C30.1101 30.8266 29.6111 30.5408 29.2195 30.1213L29.203 30.1025L26.2052 26.476C25.9246 26.1789 25.5681 25.9773 25.1808 25.8966C24.7934 25.816 24.3924 25.8599 24.0283 26.0228C23.6642 26.1857 23.3532 26.4604 23.1345 26.8122C22.9157 27.164 22.799 27.5773 22.799 28C22.799 28.4227 22.9157 28.836 23.1345 29.1878C23.3532 29.5396 23.6642 29.8143 24.0283 29.9772C24.3924 30.1401 24.7934 30.184 25.1808 30.1034C25.5681 30.0227 25.9246 29.8211 26.2052 29.524L26.6313 29.0087C26.7016 28.9234 26.8007 28.8716 26.9067 28.8646C27.0127 28.8577 27.117 28.8961 27.1966 28.9714C27.2761 29.0468 27.3245 29.153 27.331 29.2665C27.3375 29.3801 27.3017 29.4918 27.2313 29.577L26.7968 30.1025L26.7803 30.1213C26.3886 30.5408 25.8897 30.8264 25.3465 30.9422C24.8033 31.0579 24.2403 30.9985 23.7286 30.7714C23.2169 30.5444 22.7796 30.1599 22.4719 29.6666C22.1642 29.1733 22 28.5933 22 28C22 27.4067 22.1642 26.8267 22.4719 26.3334C22.7796 25.8401 23.2169 25.4556 23.7286 25.2286C24.2403 25.0015 24.8033 24.9421 25.3465 25.0578C25.8897 25.1736 26.3886 25.4592 26.7803 25.8787L26.7968 25.8975L29.7946 29.524C30.0752 29.8211 30.4317 30.0227 30.819 30.1034C31.2064 30.184 31.6073 30.1401 31.9715 29.9772C32.3356 29.8143 32.6466 29.5396 32.8653 29.1878C33.0841 28.836 33.2008 28.4227 33.2008 28C33.2008 27.5773 33.0841 27.164 32.8653 26.8122C32.6466 26.4604 32.3356 26.1857 31.9715 26.0228C31.6073 25.8599 31.2064 25.816 30.819 25.8966C30.4317 25.9773 30.0752 26.1789 29.7946 26.476L29.3685 26.9913C29.2982 27.0766 29.1991 27.1284 29.0931 27.1354C28.9871 27.1423 28.8828 27.1039 28.8032 27.0286C28.7237 26.9532 28.6753 26.847 28.6688 26.7335C28.6623 26.6199 28.6981 26.5082 28.7685 26.423L29.203 25.8975L29.2195 25.8787C29.6111 25.4592 30.1101 25.1734 30.6534 25.0577C31.1966 24.9419 31.7597 25.0013 32.2714 25.2284C32.7831 25.4554 33.2204 25.8399 33.5281 26.3333C33.8358 26.8266 34 27.4067 34 28Z" fill="#535353"/>
<path d="M52.2549 35.0149C52.8482 35.0149 53.3291 34.534 53.3291 33.9407C53.3291 33.3474 52.8482 32.8665 52.2549 32.8665C51.6616 32.8665 51.1807 33.3474 51.1807 33.9407C51.1807 34.534 51.6616 35.0149 52.2549 35.0149Z" fill="#535353"/>
</svg>
