Gi2/0/01
Gi2/0/01
Gi2/0/02
Gi2/0/02
Gi2/0/03
Gi2/0/03
Gi2/0/04
Gi2/0/04
Gi2/0/05
Gi2/0/05
Gi2/0/06
Gi2/0/06
Gi2/0/07
Gi2/0/07
Gi2/0/08
Gi2/0/08
Gi2/0/09
Gi2/0/09
Gi2/0/10
Gi2/0/10
Gi2/0/11
Gi2/0/11
Gi2/0/12
Gi2/0/12
Gi2/0/13
Gi2/0/13
Gi2/0/14
Gi2/0/14
Gi2/0/15
Gi2/0/15
Gi2/0/16
Gi2/0/16
Gi2/0/17
Gi2/0/17
Gi2/0/18
Gi2/0/18
Gi2/0/19
Gi2/0/19
Gi2/0/20
Gi2/0/20
Gi2/0/21
Gi2/0/21
Gi2/0/22
Gi2/0/22
Gi2/0/23
Gi2/0/23
Gi2/0/24
Gi2/0/24
