// Jest Snapshot v1, https://goo.gl/fbAQLP

exports[`HomePage renders correctly 1`] = `
<Layout
  hero={
    <Hero
      heading="Projects List"
      showProfilePhoto={false}
      sizes={
        Object {
          "aspectRatio": 1,
        }
      }
      subHeading={null}
    >
      <Styled(ul)>
        <Styled(li)>
          <Link
            to="/gtd"
          >
            <Styled(Image)
              Tag="div"
              alt=""
              critical={false}
              fadeIn={true}
              sizes={
                Object {
                  "sizes": Object {
                    "aspectRatio": 1,
                  },
                }
              }
            />
            <h3>
              Some Project
            </h3>
            <p>
              Some Project Description
            </p>
          </Link>
        </Styled(li)>
      </Styled(ul)>
    </Hero>
  }
>
  <span
    style={
      Object {
        "display": "block",
        "textAlign": "center",
      }
    }
  >
    lol
  </span>
</Layout>
`;
