%YAML 1.1
%TAG !u! tag:unity3d.com,2011:
--- !u!1045 &1
EditorBuildSettings:
  m_ObjectHideFlags: 0
  serializedVersion: 2
  m_Scenes:
  - enabled: 1
    path: Assets/Scenes/StartScreen.unity
    guid: 56749d20674b29144b457672d7706bfa
  - enabled: 1
    path: Assets/Scenes/MainMenu.unity
    guid: 1ea32e3f09a05064395821f67b517e97
  - enabled: 1
    path: Assets/Scenes/StartGame.unity
    guid: 9e21ac481be81094d98fad3d10a2b49a
  - enabled: 1
    path: Assets/Scenes/Settings.unity
    guid: e919a2265e04d32468c3239642677e03
  - enabled: 1
    path: Assets/Scenes/ChooseLevel.unity
    guid: f56bace7df3c5c7439e14a9775fce941
  - enabled: 1
    path: Assets/Scenes/Tutorial1.unity
    guid: f81c322d0f20b9a44a56f70d93ee501b
  - enabled: 1
    path: Assets/Scenes/Tutorial2.unity
    guid: 341990fe75bcfb346b9dcff0dc955263
  - enabled: 1
    path: Assets/Scenes/Tutorial3.unity
    guid: e8ccf4752039e14458463c169008b4bb
  - enabled: 1
    path: Assets/Scenes/Level1.unity
    guid: 4e2ae1ca2f37d844fa43d217dff31a05
  - enabled: 1
    path: Assets/Scenes/Level2.unity
    guid: 0478a84a2bcaa5b4fbd67c9a8785a7b3
  - enabled: 1
    path: Assets/Scenes/Level3.unity
    guid: c06e0c9b1edac4a489be7946154fa366
  - enabled: 1
    path: Assets/Scenes/Level4.unity
    guid: addf36f8bdddddc45b6655911e158b45
  - enabled: 1
    path: Assets/Scenes/Level5.unity
    guid: fe5a12c992414614ab8973a1ad61ece1
  m_configObjects: {}
