%YAML 1.1
%TAG !u! tag:unity3d.com,2011:
--- !u!136 &5701567533857514279
CapsuleCollider:
  m_ObjectHideFlags: 0
  m_CorrespondingSourceObject: {fileID: 0}
  m_PrefabInstance: {fileID: 0}
  m_PrefabAsset: {fileID: 0}
  m_GameObject: {fileID: 896327982039288202}
  m_Material: {fileID: 0}
  m_IsTrigger: 0
  m_Enabled: 0
  m_Radius: 29.6
  m_Height: 523.7155
  m_Direction: 1
  m_Center: {x: -24.9, y: 253.10953, z: -7.5}
--- !u!64 &-854799909683039336
MeshCollider:
  m_ObjectHideFlags: 0
  m_CorrespondingSourceObject: {fileID: 0}
  m_PrefabInstance: {fileID: 0}
  m_PrefabAsset: {fileID: 0}
  m_GameObject: {fileID: 8213913077265117523}
  m_Material: {fileID: 0}
  m_IsTrigger: 0
  m_Enabled: 1
  serializedVersion: 4
  m_Convex: 0
  m_CookingOptions: 30
  m_Mesh: {fileID: -1165227647811982169, guid: c57f079dfba822b47a2977e338a2425e, type: 3}
--- !u!23 &1962649159522080706
MeshRenderer:
  m_ObjectHideFlags: 0
  m_CorrespondingSourceObject: {fileID: 0}
  m_PrefabInstance: {fileID: 0}
  m_PrefabAsset: {fileID: 0}
  m_GameObject: {fileID: 8213913077265117523}
  m_Enabled: 1
  m_CastShadows: 1
  m_ReceiveShadows: 1
  m_DynamicOccludee: 1
  m_MotionVectors: 1
  m_LightProbeUsage: 1
  m_ReflectionProbeUsage: 1
  m_RayTracingMode: 2
  m_RenderingLayerMask: 1
  m_RendererPriority: 0
  m_Materials:
  - {fileID: 6271573414225017425, guid: 53d51a2799a1aeb4c8652267acd68dc2, type: 3}
  m_StaticBatchInfo:
    firstSubMesh: 0
    subMeshCount: 0
  m_StaticBatchRoot: {fileID: 0}
  m_ProbeAnchor: {fileID: 0}
  m_LightProbeVolumeOverride: {fileID: 0}
  m_ScaleInLightmap: 0.25
  m_ReceiveGI: 1
  m_PreserveUVs: 0
  m_IgnoreNormalsForChartDetection: 0
  m_ImportantGI: 0
  m_StitchLightmapSeams: 1
  m_SelectedEditorRenderState: 3
  m_MinimumChartSize: 4
  m_AutoUVMaxDistance: 0.5
  m_AutoUVMaxAngle: 89
  m_LightmapParameters: {fileID: 0}
  m_SortingLayerID: 0
  m_SortingLayer: 0
  m_SortingOrder: 0
--- !u!33 &8079833631870920105
MeshFilter:
  m_ObjectHideFlags: 0
  m_CorrespondingSourceObject: {fileID: 0}
  m_PrefabInstance: {fileID: 0}
  m_PrefabAsset: {fileID: 0}
  m_GameObject: {fileID: 8213913077265117523}
  m_Mesh: {fileID: -1165227647811982169, guid: c57f079dfba822b47a2977e338a2425e, type: 3}
--- !u!1001 &9024307369355480066
PrefabInstance:
  m_ObjectHideFlags: 0
  serializedVersion: 2
  m_Modification:
    m_TransformParent: {fileID: 0}
    m_Modifications:
    - target: {fileID: -8679921383154817045, guid: 503f1c91432b5e44d81984724d8ede43,
        type: 3}
      propertyPath: m_RootOrder
      value: 0
      objectReference: {fileID: 0}
    - target: {fileID: -8679921383154817045, guid: 503f1c91432b5e44d81984724d8ede43,
        type: 3}
      propertyPath: m_LocalScale.x
      value: 5
      objectReference: {fileID: 0}
    - target: {fileID: -8679921383154817045, guid: 503f1c91432b5e44d81984724d8ede43,
        type: 3}
      propertyPath: m_LocalScale.y
      value: 5
      objectReference: {fileID: 0}
    - target: {fileID: -8679921383154817045, guid: 503f1c91432b5e44d81984724d8ede43,
        type: 3}
      propertyPath: m_LocalScale.z
      value: 5
      objectReference: {fileID: 0}
    - target: {fileID: -8679921383154817045, guid: 503f1c91432b5e44d81984724d8ede43,
        type: 3}
      propertyPath: m_LocalPosition.x
      value: 668.84296
      objectReference: {fileID: 0}
    - target: {fileID: -8679921383154817045, guid: 503f1c91432b5e44d81984724d8ede43,
        type: 3}
      propertyPath: m_LocalPosition.y
      value: 8.748237
      objectReference: {fileID: 0}
    - target: {fileID: -8679921383154817045, guid: 503f1c91432b5e44d81984724d8ede43,
        type: 3}
      propertyPath: m_LocalPosition.z
      value: -1240.1516
      objectReference: {fileID: 0}
    - target: {fileID: -8679921383154817045, guid: 503f1c91432b5e44d81984724d8ede43,
        type: 3}
      propertyPath: m_LocalRotation.w
      value: 1
      objectReference: {fileID: 0}
    - target: {fileID: -8679921383154817045, guid: 503f1c91432b5e44d81984724d8ede43,
        type: 3}
      propertyPath: m_LocalRotation.x
      value: 0
      objectReference: {fileID: 0}
    - target: {fileID: -8679921383154817045, guid: 503f1c91432b5e44d81984724d8ede43,
        type: 3}
      propertyPath: m_LocalRotation.y
      value: -0
      objectReference: {fileID: 0}
    - target: {fileID: -8679921383154817045, guid: 503f1c91432b5e44d81984724d8ede43,
        type: 3}
      propertyPath: m_LocalRotation.z
      value: -0
      objectReference: {fileID: 0}
    - target: {fileID: -8679921383154817045, guid: 503f1c91432b5e44d81984724d8ede43,
        type: 3}
      propertyPath: m_LocalEulerAnglesHint.x
      value: 0
      objectReference: {fileID: 0}
    - target: {fileID: -8679921383154817045, guid: 503f1c91432b5e44d81984724d8ede43,
        type: 3}
      propertyPath: m_LocalEulerAnglesHint.y
      value: 0
      objectReference: {fileID: 0}
    - target: {fileID: -8679921383154817045, guid: 503f1c91432b5e44d81984724d8ede43,
        type: 3}
      propertyPath: m_LocalEulerAnglesHint.z
      value: 0
      objectReference: {fileID: 0}
    - target: {fileID: -7635826562936255635, guid: 503f1c91432b5e44d81984724d8ede43,
        type: 3}
      propertyPath: m_Materials.Array.data[0]
      value: 
      objectReference: {fileID: 2100000, guid: a30ea4fba84842443ae1b2ad345b5b7d, type: 2}
    - target: {fileID: 919132149155446097, guid: 503f1c91432b5e44d81984724d8ede43,
        type: 3}
      propertyPath: m_Name
      value: SM_Generic_TreeDead_01 Variant
      objectReference: {fileID: 0}
    - target: {fileID: 919132149155446097, guid: 503f1c91432b5e44d81984724d8ede43,
        type: 3}
      propertyPath: m_StaticEditorFlags
      value: 1
      objectReference: {fileID: 0}
    - target: {fileID: 8164078558771037576, guid: 503f1c91432b5e44d81984724d8ede43,
        type: 3}
      propertyPath: m_StaticEditorFlags
      value: 1
      objectReference: {fileID: 0}
    m_RemovedComponents: []
  m_SourcePrefab: {fileID: 100100000, guid: 503f1c91432b5e44d81984724d8ede43, type: 3}
--- !u!1 &8213913077265117523 stripped
GameObject:
  m_CorrespondingSourceObject: {fileID: 919132149155446097, guid: 503f1c91432b5e44d81984724d8ede43,
    type: 3}
  m_PrefabInstance: {fileID: 9024307369355480066}
  m_PrefabAsset: {fileID: 0}
--- !u!1 &896327982039288202 stripped
GameObject:
  m_CorrespondingSourceObject: {fileID: 8164078558771037576, guid: 503f1c91432b5e44d81984724d8ede43,
    type: 3}
  m_PrefabInstance: {fileID: 9024307369355480066}
  m_PrefabAsset: {fileID: 0}
