%YAML 1.1
%TAG !u! tag:unity3d.com,2011:
--- !u!1 &1905901595670594628
GameObject:
  m_ObjectHideFlags: 0
  m_CorrespondingSourceObject: {fileID: 0}
  m_PrefabInstance: {fileID: 0}
  m_PrefabAsset: {fileID: 0}
  serializedVersion: 6
  m_Component:
  - component: {fileID: 1905901595670594635}
  - component: {fileID: 1905901595670594634}
  m_Layer: 5
  m_Name: TutorialButton
  m_TagString: Untagged
  m_Icon: {fileID: 0}
  m_NavMeshLayer: 0
  m_StaticEditorFlags: 0
  m_IsActive: 1
--- !u!224 &1905901595670594635
RectTransform:
  m_ObjectHideFlags: 0
  m_CorrespondingSourceObject: {fileID: 0}
  m_PrefabInstance: {fileID: 0}
  m_PrefabAsset: {fileID: 0}
  m_GameObject: {fileID: 1905901595670594628}
  m_LocalRotation: {x: -0, y: -0, z: -0, w: 1}
  m_LocalPosition: {x: 0, y: 0, z: 0}
  m_LocalScale: {x: 1, y: 1, z: 1}
  m_Children:
  - {fileID: 5293665087970993400}
  m_Father: {fileID: 0}
  m_RootOrder: 0
  m_LocalEulerAnglesHint: {x: 0, y: 0, z: 0}
  m_AnchorMin: {x: 0, y: 0}
  m_AnchorMax: {x: 1, y: 1}
  m_AnchoredPosition: {x: 0, y: 0}
  m_SizeDelta: {x: 0, y: 0}
  m_Pivot: {x: 0.5, y: 0.5}
--- !u!222 &1905901595670594634
CanvasRenderer:
  m_ObjectHideFlags: 0
  m_CorrespondingSourceObject: {fileID: 0}
  m_PrefabInstance: {fileID: 0}
  m_PrefabAsset: {fileID: 0}
  m_GameObject: {fileID: 1905901595670594628}
  m_CullTransparentMesh: 0
--- !u!1001 &5319822648958883285
PrefabInstance:
  m_ObjectHideFlags: 0
  serializedVersion: 2
  m_Modification:
    m_TransformParent: {fileID: 1905901595670594635}
    m_Modifications:
    - target: {fileID: 46494887925457142, guid: 4570dad503a94b54a847937cae0c4c90,
        type: 3}
      propertyPath: m_Sprite
      value: 
      objectReference: {fileID: 3794550611322748858, guid: 8289f90f671eec140947df93e13029fb,
        type: 3}
    - target: {fileID: 46494887925457143, guid: 4570dad503a94b54a847937cae0c4c90,
        type: 3}
      propertyPath: m_AnchoredPosition.x
      value: 10
      objectReference: {fileID: 0}
    - target: {fileID: 46494888268689682, guid: 4570dad503a94b54a847937cae0c4c90,
        type: 3}
      propertyPath: m_Name
      value: Button
      objectReference: {fileID: 0}
    - target: {fileID: 46494888268689709, guid: 4570dad503a94b54a847937cae0c4c90,
        type: 3}
      propertyPath: m_LocalPosition.x
      value: 0
      objectReference: {fileID: 0}
    - target: {fileID: 46494888268689709, guid: 4570dad503a94b54a847937cae0c4c90,
        type: 3}
      propertyPath: m_LocalPosition.y
      value: 0
      objectReference: {fileID: 0}
    - target: {fileID: 46494888268689709, guid: 4570dad503a94b54a847937cae0c4c90,
        type: 3}
      propertyPath: m_LocalPosition.z
      value: 0
      objectReference: {fileID: 0}
    - target: {fileID: 46494888268689709, guid: 4570dad503a94b54a847937cae0c4c90,
        type: 3}
      propertyPath: m_LocalRotation.x
      value: -0
      objectReference: {fileID: 0}
    - target: {fileID: 46494888268689709, guid: 4570dad503a94b54a847937cae0c4c90,
        type: 3}
      propertyPath: m_LocalRotation.y
      value: -0
      objectReference: {fileID: 0}
    - target: {fileID: 46494888268689709, guid: 4570dad503a94b54a847937cae0c4c90,
        type: 3}
      propertyPath: m_LocalRotation.z
      value: -0
      objectReference: {fileID: 0}
    - target: {fileID: 46494888268689709, guid: 4570dad503a94b54a847937cae0c4c90,
        type: 3}
      propertyPath: m_LocalRotation.w
      value: 1
      objectReference: {fileID: 0}
    - target: {fileID: 46494888268689709, guid: 4570dad503a94b54a847937cae0c4c90,
        type: 3}
      propertyPath: m_RootOrder
      value: 0
      objectReference: {fileID: 0}
    - target: {fileID: 46494888268689709, guid: 4570dad503a94b54a847937cae0c4c90,
        type: 3}
      propertyPath: m_LocalEulerAnglesHint.x
      value: 0
      objectReference: {fileID: 0}
    - target: {fileID: 46494888268689709, guid: 4570dad503a94b54a847937cae0c4c90,
        type: 3}
      propertyPath: m_LocalEulerAnglesHint.y
      value: 0
      objectReference: {fileID: 0}
    - target: {fileID: 46494888268689709, guid: 4570dad503a94b54a847937cae0c4c90,
        type: 3}
      propertyPath: m_LocalEulerAnglesHint.z
      value: 0
      objectReference: {fileID: 0}
    - target: {fileID: 46494888268689709, guid: 4570dad503a94b54a847937cae0c4c90,
        type: 3}
      propertyPath: m_AnchoredPosition.x
      value: 0
      objectReference: {fileID: 0}
    - target: {fileID: 46494888268689709, guid: 4570dad503a94b54a847937cae0c4c90,
        type: 3}
      propertyPath: m_AnchoredPosition.y
      value: -600
      objectReference: {fileID: 0}
    - target: {fileID: 46494888268689709, guid: 4570dad503a94b54a847937cae0c4c90,
        type: 3}
      propertyPath: m_SizeDelta.x
      value: 200
      objectReference: {fileID: 0}
    - target: {fileID: 46494888268689709, guid: 4570dad503a94b54a847937cae0c4c90,
        type: 3}
      propertyPath: m_SizeDelta.y
      value: 200
      objectReference: {fileID: 0}
    - target: {fileID: 46494888268689709, guid: 4570dad503a94b54a847937cae0c4c90,
        type: 3}
      propertyPath: m_AnchorMin.x
      value: 0.5
      objectReference: {fileID: 0}
    - target: {fileID: 46494888268689709, guid: 4570dad503a94b54a847937cae0c4c90,
        type: 3}
      propertyPath: m_AnchorMin.y
      value: 0.5
      objectReference: {fileID: 0}
    - target: {fileID: 46494888268689709, guid: 4570dad503a94b54a847937cae0c4c90,
        type: 3}
      propertyPath: m_AnchorMax.x
      value: 0.5
      objectReference: {fileID: 0}
    - target: {fileID: 46494888268689709, guid: 4570dad503a94b54a847937cae0c4c90,
        type: 3}
      propertyPath: m_AnchorMax.y
      value: 0.5
      objectReference: {fileID: 0}
    - target: {fileID: 46494888268689709, guid: 4570dad503a94b54a847937cae0c4c90,
        type: 3}
      propertyPath: m_Pivot.x
      value: 0.5
      objectReference: {fileID: 0}
    - target: {fileID: 46494888268689709, guid: 4570dad503a94b54a847937cae0c4c90,
        type: 3}
      propertyPath: m_Pivot.y
      value: 0.5
      objectReference: {fileID: 0}
    - target: {fileID: 46494888268689709, guid: 4570dad503a94b54a847937cae0c4c90,
        type: 3}
      propertyPath: m_LocalScale.x
      value: 1
      objectReference: {fileID: 0}
    - target: {fileID: 46494888268689709, guid: 4570dad503a94b54a847937cae0c4c90,
        type: 3}
      propertyPath: m_LocalScale.y
      value: 1
      objectReference: {fileID: 0}
    - target: {fileID: 46494888268689709, guid: 4570dad503a94b54a847937cae0c4c90,
        type: 3}
      propertyPath: m_LocalScale.z
      value: 1
      objectReference: {fileID: 0}
    - target: {fileID: 6890434557812945096, guid: 4570dad503a94b54a847937cae0c4c90,
        type: 3}
      propertyPath: type
      value: 4
      objectReference: {fileID: 0}
    m_RemovedComponents: []
  m_SourcePrefab: {fileID: 100100000, guid: 4570dad503a94b54a847937cae0c4c90, type: 3}
--- !u!224 &5293665087970993400 stripped
RectTransform:
  m_CorrespondingSourceObject: {fileID: 46494888268689709, guid: 4570dad503a94b54a847937cae0c4c90,
    type: 3}
  m_PrefabInstance: {fileID: 5319822648958883285}
  m_PrefabAsset: {fileID: 0}
