%YAML 1.1
%TAG !u! tag:unity3d.com,2011:
--- !u!1 &3317815484604346228
GameObject:
  m_ObjectHideFlags: 0
  m_CorrespondingSourceObject: {fileID: 0}
  m_PrefabInstance: {fileID: 0}
  m_PrefabAsset: {fileID: 0}
  serializedVersion: 6
  m_Component:
  - component: {fileID: 3317815484604346231}
  - component: {fileID: 3317815484604346233}
  - component: {fileID: 3317815484604346230}
  - component: {fileID: 3317815484604346235}
  m_Layer: 5
  m_Name: LevelCompletedSimple
  m_TagString: Untagged
  m_Icon: {fileID: 0}
  m_NavMeshLayer: 0
  m_StaticEditorFlags: 0
  m_IsActive: 1
--- !u!224 &3317815484604346231
RectTransform:
  m_ObjectHideFlags: 0
  m_CorrespondingSourceObject: {fileID: 0}
  m_PrefabInstance: {fileID: 0}
  m_PrefabAsset: {fileID: 0}
  m_GameObject: {fileID: 3317815484604346228}
  m_LocalRotation: {x: -0, y: -0, z: -0, w: 1}
  m_LocalPosition: {x: 0, y: 0, z: 0}
  m_LocalScale: {x: 1, y: 1, z: 1}
  m_Children:
  - {fileID: 33344370211486252}
  - {fileID: 5103291794924063832}
  m_Father: {fileID: 0}
  m_RootOrder: 0
  m_LocalEulerAnglesHint: {x: 0, y: 0, z: 0}
  m_AnchorMin: {x: 0, y: 0}
  m_AnchorMax: {x: 1, y: 1}
  m_AnchoredPosition: {x: 0, y: 0}
  m_SizeDelta: {x: 0, y: 0}
  m_Pivot: {x: 0.5, y: 0.5}
--- !u!222 &3317815484604346233
CanvasRenderer:
  m_ObjectHideFlags: 0
  m_CorrespondingSourceObject: {fileID: 0}
  m_PrefabInstance: {fileID: 0}
  m_PrefabAsset: {fileID: 0}
  m_GameObject: {fileID: 3317815484604346228}
  m_CullTransparentMesh: 0
--- !u!114 &3317815484604346230
MonoBehaviour:
  m_ObjectHideFlags: 0
  m_CorrespondingSourceObject: {fileID: 0}
  m_PrefabInstance: {fileID: 0}
  m_PrefabAsset: {fileID: 0}
  m_GameObject: {fileID: 3317815484604346228}
  m_Enabled: 1
  m_EditorHideFlags: 0
  m_Script: {fileID: 11500000, guid: fe87c0e1cc204ed48ad3b37840f39efc, type: 3}
  m_Name: 
  m_EditorClassIdentifier: 
  m_Material: {fileID: 0}
  m_Color: {r: 0, g: 0, b: 0, a: 0.39215687}
  m_RaycastTarget: 1
  m_RaycastPadding: {x: 0, y: 0, z: 0, w: 0}
  m_Maskable: 1
  m_OnCullStateChanged:
    m_PersistentCalls:
      m_Calls: []
  m_Sprite: {fileID: 0}
  m_Type: 1
  m_PreserveAspect: 0
  m_FillCenter: 1
  m_FillMethod: 4
  m_FillAmount: 1
  m_FillClockwise: 1
  m_FillOrigin: 0
  m_UseSpriteMesh: 0
  m_PixelsPerUnitMultiplier: 1
--- !u!114 &3317815484604346235
MonoBehaviour:
  m_ObjectHideFlags: 0
  m_CorrespondingSourceObject: {fileID: 0}
  m_PrefabInstance: {fileID: 0}
  m_PrefabAsset: {fileID: 0}
  m_GameObject: {fileID: 3317815484604346228}
  m_Enabled: 1
  m_EditorHideFlags: 0
  m_Script: {fileID: 11500000, guid: d49819f9227ce3e4d8c9eeaa73c3c928, type: 3}
  m_Name: 
  m_EditorClassIdentifier: 
  mp: {x: 0, y: 0, z: 0}
  level: {fileID: 1326719340152574983}
  leaderBoard: {fileID: 0}
  time: 1
--- !u!1001 &633297875152835748
PrefabInstance:
  m_ObjectHideFlags: 0
  serializedVersion: 2
  m_Modification:
    m_TransformParent: {fileID: 3317815484604346231}
    m_Modifications:
    - target: {fileID: 630393484641595016, guid: 054da3bb2e73a104dbd27392213cfb3d,
        type: 3}
      propertyPath: m_LocalPosition.x
      value: 0
      objectReference: {fileID: 0}
    - target: {fileID: 630393484641595016, guid: 054da3bb2e73a104dbd27392213cfb3d,
        type: 3}
      propertyPath: m_LocalPosition.y
      value: 0
      objectReference: {fileID: 0}
    - target: {fileID: 630393484641595016, guid: 054da3bb2e73a104dbd27392213cfb3d,
        type: 3}
      propertyPath: m_LocalPosition.z
      value: 0
      objectReference: {fileID: 0}
    - target: {fileID: 630393484641595016, guid: 054da3bb2e73a104dbd27392213cfb3d,
        type: 3}
      propertyPath: m_LocalRotation.x
      value: 0
      objectReference: {fileID: 0}
    - target: {fileID: 630393484641595016, guid: 054da3bb2e73a104dbd27392213cfb3d,
        type: 3}
      propertyPath: m_LocalRotation.y
      value: 0
      objectReference: {fileID: 0}
    - target: {fileID: 630393484641595016, guid: 054da3bb2e73a104dbd27392213cfb3d,
        type: 3}
      propertyPath: m_LocalRotation.z
      value: 0
      objectReference: {fileID: 0}
    - target: {fileID: 630393484641595016, guid: 054da3bb2e73a104dbd27392213cfb3d,
        type: 3}
      propertyPath: m_LocalRotation.w
      value: 1
      objectReference: {fileID: 0}
    - target: {fileID: 630393484641595016, guid: 054da3bb2e73a104dbd27392213cfb3d,
        type: 3}
      propertyPath: m_RootOrder
      value: 0
      objectReference: {fileID: 0}
    - target: {fileID: 630393484641595016, guid: 054da3bb2e73a104dbd27392213cfb3d,
        type: 3}
      propertyPath: m_LocalEulerAnglesHint.x
      value: 0
      objectReference: {fileID: 0}
    - target: {fileID: 630393484641595016, guid: 054da3bb2e73a104dbd27392213cfb3d,
        type: 3}
      propertyPath: m_LocalEulerAnglesHint.y
      value: 0
      objectReference: {fileID: 0}
    - target: {fileID: 630393484641595016, guid: 054da3bb2e73a104dbd27392213cfb3d,
        type: 3}
      propertyPath: m_LocalEulerAnglesHint.z
      value: 0
      objectReference: {fileID: 0}
    - target: {fileID: 630393484641595016, guid: 054da3bb2e73a104dbd27392213cfb3d,
        type: 3}
      propertyPath: m_AnchoredPosition.x
      value: 0
      objectReference: {fileID: 0}
    - target: {fileID: 630393484641595016, guid: 054da3bb2e73a104dbd27392213cfb3d,
        type: 3}
      propertyPath: m_AnchoredPosition.y
      value: 600
      objectReference: {fileID: 0}
    - target: {fileID: 630393484641595016, guid: 054da3bb2e73a104dbd27392213cfb3d,
        type: 3}
      propertyPath: m_SizeDelta.x
      value: 100
      objectReference: {fileID: 0}
    - target: {fileID: 630393484641595016, guid: 054da3bb2e73a104dbd27392213cfb3d,
        type: 3}
      propertyPath: m_SizeDelta.y
      value: 100
      objectReference: {fileID: 0}
    - target: {fileID: 630393484641595016, guid: 054da3bb2e73a104dbd27392213cfb3d,
        type: 3}
      propertyPath: m_AnchorMin.x
      value: 0.5
      objectReference: {fileID: 0}
    - target: {fileID: 630393484641595016, guid: 054da3bb2e73a104dbd27392213cfb3d,
        type: 3}
      propertyPath: m_AnchorMin.y
      value: 0.5
      objectReference: {fileID: 0}
    - target: {fileID: 630393484641595016, guid: 054da3bb2e73a104dbd27392213cfb3d,
        type: 3}
      propertyPath: m_AnchorMax.x
      value: 0.5
      objectReference: {fileID: 0}
    - target: {fileID: 630393484641595016, guid: 054da3bb2e73a104dbd27392213cfb3d,
        type: 3}
      propertyPath: m_AnchorMax.y
      value: 0.5
      objectReference: {fileID: 0}
    - target: {fileID: 630393484641595016, guid: 054da3bb2e73a104dbd27392213cfb3d,
        type: 3}
      propertyPath: m_Pivot.x
      value: 0.5
      objectReference: {fileID: 0}
    - target: {fileID: 630393484641595016, guid: 054da3bb2e73a104dbd27392213cfb3d,
        type: 3}
      propertyPath: m_Pivot.y
      value: 0.5
      objectReference: {fileID: 0}
    - target: {fileID: 630393484641595019, guid: 054da3bb2e73a104dbd27392213cfb3d,
        type: 3}
      propertyPath: m_Name
      value: LevelCompleted
      objectReference: {fileID: 0}
    - target: {fileID: 1366519470525969952, guid: 054da3bb2e73a104dbd27392213cfb3d,
        type: 3}
      propertyPath: m_Enabled
      value: 0
      objectReference: {fileID: 0}
    m_RemovedComponents: []
  m_SourcePrefab: {fileID: 100100000, guid: 054da3bb2e73a104dbd27392213cfb3d, type: 3}
--- !u!224 &33344370211486252 stripped
RectTransform:
  m_CorrespondingSourceObject: {fileID: 630393484641595016, guid: 054da3bb2e73a104dbd27392213cfb3d,
    type: 3}
  m_PrefabInstance: {fileID: 633297875152835748}
  m_PrefabAsset: {fileID: 0}
--- !u!114 &1326719340152574983 stripped
MonoBehaviour:
  m_CorrespondingSourceObject: {fileID: 1918701915899805859, guid: 054da3bb2e73a104dbd27392213cfb3d,
    type: 3}
  m_PrefabInstance: {fileID: 633297875152835748}
  m_PrefabAsset: {fileID: 0}
  m_GameObject: {fileID: 0}
  m_Enabled: 1
  m_EditorHideFlags: 0
  m_Script: {fileID: 11500000, guid: 2286326b07ab04ae38003d85e9d81499, type: 3}
  m_Name: 
  m_EditorClassIdentifier: 
--- !u!1001 &8951712180096333272
PrefabInstance:
  m_ObjectHideFlags: 0
  serializedVersion: 2
  m_Modification:
    m_TransformParent: {fileID: 3317815484604346231}
    m_Modifications:
    - target: {fileID: 4244737300591339121, guid: b5c05b92f201ee54d829d83b0c80b1a6,
        type: 3}
      propertyPath: m_Material
      value: 
      objectReference: {fileID: 0}
    - target: {fileID: 4244737301012330880, guid: b5c05b92f201ee54d829d83b0c80b1a6,
        type: 3}
      propertyPath: m_LocalPosition.x
      value: 0
      objectReference: {fileID: 0}
    - target: {fileID: 4244737301012330880, guid: b5c05b92f201ee54d829d83b0c80b1a6,
        type: 3}
      propertyPath: m_LocalPosition.y
      value: 0
      objectReference: {fileID: 0}
    - target: {fileID: 4244737301012330880, guid: b5c05b92f201ee54d829d83b0c80b1a6,
        type: 3}
      propertyPath: m_LocalPosition.z
      value: 0
      objectReference: {fileID: 0}
    - target: {fileID: 4244737301012330880, guid: b5c05b92f201ee54d829d83b0c80b1a6,
        type: 3}
      propertyPath: m_LocalRotation.x
      value: -0
      objectReference: {fileID: 0}
    - target: {fileID: 4244737301012330880, guid: b5c05b92f201ee54d829d83b0c80b1a6,
        type: 3}
      propertyPath: m_LocalRotation.y
      value: -0
      objectReference: {fileID: 0}
    - target: {fileID: 4244737301012330880, guid: b5c05b92f201ee54d829d83b0c80b1a6,
        type: 3}
      propertyPath: m_LocalRotation.z
      value: -0
      objectReference: {fileID: 0}
    - target: {fileID: 4244737301012330880, guid: b5c05b92f201ee54d829d83b0c80b1a6,
        type: 3}
      propertyPath: m_LocalRotation.w
      value: 1
      objectReference: {fileID: 0}
    - target: {fileID: 4244737301012330880, guid: b5c05b92f201ee54d829d83b0c80b1a6,
        type: 3}
      propertyPath: m_RootOrder
      value: 1
      objectReference: {fileID: 0}
    - target: {fileID: 4244737301012330880, guid: b5c05b92f201ee54d829d83b0c80b1a6,
        type: 3}
      propertyPath: m_LocalEulerAnglesHint.x
      value: 0
      objectReference: {fileID: 0}
    - target: {fileID: 4244737301012330880, guid: b5c05b92f201ee54d829d83b0c80b1a6,
        type: 3}
      propertyPath: m_LocalEulerAnglesHint.y
      value: 0
      objectReference: {fileID: 0}
    - target: {fileID: 4244737301012330880, guid: b5c05b92f201ee54d829d83b0c80b1a6,
        type: 3}
      propertyPath: m_LocalEulerAnglesHint.z
      value: 0
      objectReference: {fileID: 0}
    - target: {fileID: 4244737301012330880, guid: b5c05b92f201ee54d829d83b0c80b1a6,
        type: 3}
      propertyPath: m_AnchoredPosition.x
      value: 0
      objectReference: {fileID: 0}
    - target: {fileID: 4244737301012330880, guid: b5c05b92f201ee54d829d83b0c80b1a6,
        type: 3}
      propertyPath: m_AnchoredPosition.y
      value: 300
      objectReference: {fileID: 0}
    - target: {fileID: 4244737301012330880, guid: b5c05b92f201ee54d829d83b0c80b1a6,
        type: 3}
      propertyPath: m_SizeDelta.x
      value: 100
      objectReference: {fileID: 0}
    - target: {fileID: 4244737301012330880, guid: b5c05b92f201ee54d829d83b0c80b1a6,
        type: 3}
      propertyPath: m_SizeDelta.y
      value: 100
      objectReference: {fileID: 0}
    - target: {fileID: 4244737301012330880, guid: b5c05b92f201ee54d829d83b0c80b1a6,
        type: 3}
      propertyPath: m_AnchorMin.x
      value: 0.5
      objectReference: {fileID: 0}
    - target: {fileID: 4244737301012330880, guid: b5c05b92f201ee54d829d83b0c80b1a6,
        type: 3}
      propertyPath: m_AnchorMin.y
      value: 0.5
      objectReference: {fileID: 0}
    - target: {fileID: 4244737301012330880, guid: b5c05b92f201ee54d829d83b0c80b1a6,
        type: 3}
      propertyPath: m_AnchorMax.x
      value: 0.5
      objectReference: {fileID: 0}
    - target: {fileID: 4244737301012330880, guid: b5c05b92f201ee54d829d83b0c80b1a6,
        type: 3}
      propertyPath: m_AnchorMax.y
      value: 0.5
      objectReference: {fileID: 0}
    - target: {fileID: 4244737301012330880, guid: b5c05b92f201ee54d829d83b0c80b1a6,
        type: 3}
      propertyPath: m_Pivot.x
      value: 0.5
      objectReference: {fileID: 0}
    - target: {fileID: 4244737301012330880, guid: b5c05b92f201ee54d829d83b0c80b1a6,
        type: 3}
      propertyPath: m_Pivot.y
      value: 0.5
      objectReference: {fileID: 0}
    - target: {fileID: 4244737301012330887, guid: b5c05b92f201ee54d829d83b0c80b1a6,
        type: 3}
      propertyPath: m_Name
      value: Confetti
      objectReference: {fileID: 0}
    - target: {fileID: 4244737301276250944, guid: b5c05b92f201ee54d829d83b0c80b1a6,
        type: 3}
      propertyPath: m_LocalPosition.z
      value: 0
      objectReference: {fileID: 0}
    - target: {fileID: 4244737301276250947, guid: b5c05b92f201ee54d829d83b0c80b1a6,
        type: 3}
      propertyPath: m_Material
      value: 
      objectReference: {fileID: 0}
    m_RemovedComponents: []
  m_SourcePrefab: {fileID: 100100000, guid: b5c05b92f201ee54d829d83b0c80b1a6, type: 3}
--- !u!224 &5103291794924063832 stripped
RectTransform:
  m_CorrespondingSourceObject: {fileID: 4244737301012330880, guid: b5c05b92f201ee54d829d83b0c80b1a6,
    type: 3}
  m_PrefabInstance: {fileID: 8951712180096333272}
  m_PrefabAsset: {fileID: 0}
