%YAML 1.1
%TAG !u! tag:unity3d.com,2011:
--- !u!1 &3317815484604346228
GameObject:
  m_ObjectHideFlags: 0
  m_CorrespondingSourceObject: {fileID: 0}
  m_PrefabInstance: {fileID: 0}
  m_PrefabAsset: {fileID: 0}
  serializedVersion: 6
  m_Component:
  - component: {fileID: 3317815484604346231}
  - component: {fileID: 3317815484604346233}
  - component: {fileID: 3317815484604346230}
  - component: {fileID: 3317815484604346235}
  m_Layer: 5
  m_Name: LevelCompletedLeaderBoardButton
  m_TagString: Untagged
  m_Icon: {fileID: 0}
  m_NavMeshLayer: 0
  m_StaticEditorFlags: 0
  m_IsActive: 1
--- !u!224 &3317815484604346231
RectTransform:
  m_ObjectHideFlags: 0
  m_CorrespondingSourceObject: {fileID: 0}
  m_PrefabInstance: {fileID: 0}
  m_PrefabAsset: {fileID: 0}
  m_GameObject: {fileID: 3317815484604346228}
  m_LocalRotation: {x: -0, y: -0, z: -0, w: 1}
  m_LocalPosition: {x: 0, y: 0, z: 0}
  m_LocalScale: {x: 1, y: 1, z: 1}
  m_Children:
  - {fileID: 1775134462330540303}
  - {fileID: 533450059411927382}
  - {fileID: 2098501279394511094}
  - {fileID: 6919565617719658713}
  m_Father: {fileID: 0}
  m_RootOrder: 0
  m_LocalEulerAnglesHint: {x: 0, y: 0, z: 0}
  m_AnchorMin: {x: 0, y: 0}
  m_AnchorMax: {x: 1, y: 1}
  m_AnchoredPosition: {x: 0, y: 0}
  m_SizeDelta: {x: 0, y: 0}
  m_Pivot: {x: 0.5, y: 0.5}
--- !u!222 &3317815484604346233
CanvasRenderer:
  m_ObjectHideFlags: 0
  m_CorrespondingSourceObject: {fileID: 0}
  m_PrefabInstance: {fileID: 0}
  m_PrefabAsset: {fileID: 0}
  m_GameObject: {fileID: 3317815484604346228}
  m_CullTransparentMesh: 0
--- !u!114 &3317815484604346230
MonoBehaviour:
  m_ObjectHideFlags: 0
  m_CorrespondingSourceObject: {fileID: 0}
  m_PrefabInstance: {fileID: 0}
  m_PrefabAsset: {fileID: 0}
  m_GameObject: {fileID: 3317815484604346228}
  m_Enabled: 1
  m_EditorHideFlags: 0
  m_Script: {fileID: 11500000, guid: fe87c0e1cc204ed48ad3b37840f39efc, type: 3}
  m_Name: 
  m_EditorClassIdentifier: 
  m_Material: {fileID: 0}
  m_Color: {r: 0, g: 0, b: 0, a: 0.39215687}
  m_RaycastTarget: 1
  m_Maskable: 1
  m_OnCullStateChanged:
    m_PersistentCalls:
      m_Calls: []
  m_Sprite: {fileID: 0}
  m_Type: 1
  m_PreserveAspect: 0
  m_FillCenter: 1
  m_FillMethod: 4
  m_FillAmount: 1
  m_FillClockwise: 1
  m_FillOrigin: 0
  m_UseSpriteMesh: 0
  m_PixelsPerUnitMultiplier: 1
--- !u!114 &3317815484604346235
MonoBehaviour:
  m_ObjectHideFlags: 0
  m_CorrespondingSourceObject: {fileID: 0}
  m_PrefabInstance: {fileID: 0}
  m_PrefabAsset: {fileID: 0}
  m_GameObject: {fileID: 3317815484604346228}
  m_Enabled: 1
  m_EditorHideFlags: 0
  m_Script: {fileID: 11500000, guid: d49819f9227ce3e4d8c9eeaa73c3c928, type: 3}
  m_Name: 
  m_EditorClassIdentifier: 
  mp: {x: 0, y: 0, z: 0}
  level: {fileID: 773926244539285284}
  leaderBoard: {fileID: 533450059411927402}
  time: 0
--- !u!1001 &1161102883237429127
PrefabInstance:
  m_ObjectHideFlags: 0
  serializedVersion: 2
  m_Modification:
    m_TransformParent: {fileID: 3317815484604346231}
    m_Modifications:
    - target: {fileID: 630393484641595016, guid: 054da3bb2e73a104dbd27392213cfb3d,
        type: 3}
      propertyPath: m_LocalPosition.x
      value: 0
      objectReference: {fileID: 0}
    - target: {fileID: 630393484641595016, guid: 054da3bb2e73a104dbd27392213cfb3d,
        type: 3}
      propertyPath: m_LocalPosition.y
      value: 0
      objectReference: {fileID: 0}
    - target: {fileID: 630393484641595016, guid: 054da3bb2e73a104dbd27392213cfb3d,
        type: 3}
      propertyPath: m_LocalPosition.z
      value: 0
      objectReference: {fileID: 0}
    - target: {fileID: 630393484641595016, guid: 054da3bb2e73a104dbd27392213cfb3d,
        type: 3}
      propertyPath: m_LocalRotation.x
      value: 0
      objectReference: {fileID: 0}
    - target: {fileID: 630393484641595016, guid: 054da3bb2e73a104dbd27392213cfb3d,
        type: 3}
      propertyPath: m_LocalRotation.y
      value: 0
      objectReference: {fileID: 0}
    - target: {fileID: 630393484641595016, guid: 054da3bb2e73a104dbd27392213cfb3d,
        type: 3}
      propertyPath: m_LocalRotation.z
      value: 0
      objectReference: {fileID: 0}
    - target: {fileID: 630393484641595016, guid: 054da3bb2e73a104dbd27392213cfb3d,
        type: 3}
      propertyPath: m_LocalRotation.w
      value: 1
      objectReference: {fileID: 0}
    - target: {fileID: 630393484641595016, guid: 054da3bb2e73a104dbd27392213cfb3d,
        type: 3}
      propertyPath: m_RootOrder
      value: 0
      objectReference: {fileID: 0}
    - target: {fileID: 630393484641595016, guid: 054da3bb2e73a104dbd27392213cfb3d,
        type: 3}
      propertyPath: m_LocalEulerAnglesHint.x
      value: 0
      objectReference: {fileID: 0}
    - target: {fileID: 630393484641595016, guid: 054da3bb2e73a104dbd27392213cfb3d,
        type: 3}
      propertyPath: m_LocalEulerAnglesHint.y
      value: 0
      objectReference: {fileID: 0}
    - target: {fileID: 630393484641595016, guid: 054da3bb2e73a104dbd27392213cfb3d,
        type: 3}
      propertyPath: m_LocalEulerAnglesHint.z
      value: 0
      objectReference: {fileID: 0}
    - target: {fileID: 630393484641595016, guid: 054da3bb2e73a104dbd27392213cfb3d,
        type: 3}
      propertyPath: m_AnchoredPosition.x
      value: 0
      objectReference: {fileID: 0}
    - target: {fileID: 630393484641595016, guid: 054da3bb2e73a104dbd27392213cfb3d,
        type: 3}
      propertyPath: m_AnchoredPosition.y
      value: 600
      objectReference: {fileID: 0}
    - target: {fileID: 630393484641595016, guid: 054da3bb2e73a104dbd27392213cfb3d,
        type: 3}
      propertyPath: m_SizeDelta.x
      value: 100
      objectReference: {fileID: 0}
    - target: {fileID: 630393484641595016, guid: 054da3bb2e73a104dbd27392213cfb3d,
        type: 3}
      propertyPath: m_SizeDelta.y
      value: 100
      objectReference: {fileID: 0}
    - target: {fileID: 630393484641595016, guid: 054da3bb2e73a104dbd27392213cfb3d,
        type: 3}
      propertyPath: m_AnchorMin.x
      value: 0.5
      objectReference: {fileID: 0}
    - target: {fileID: 630393484641595016, guid: 054da3bb2e73a104dbd27392213cfb3d,
        type: 3}
      propertyPath: m_AnchorMin.y
      value: 0.5
      objectReference: {fileID: 0}
    - target: {fileID: 630393484641595016, guid: 054da3bb2e73a104dbd27392213cfb3d,
        type: 3}
      propertyPath: m_AnchorMax.x
      value: 0.5
      objectReference: {fileID: 0}
    - target: {fileID: 630393484641595016, guid: 054da3bb2e73a104dbd27392213cfb3d,
        type: 3}
      propertyPath: m_AnchorMax.y
      value: 0.5
      objectReference: {fileID: 0}
    - target: {fileID: 630393484641595016, guid: 054da3bb2e73a104dbd27392213cfb3d,
        type: 3}
      propertyPath: m_Pivot.x
      value: 0.5
      objectReference: {fileID: 0}
    - target: {fileID: 630393484641595016, guid: 054da3bb2e73a104dbd27392213cfb3d,
        type: 3}
      propertyPath: m_Pivot.y
      value: 0.5
      objectReference: {fileID: 0}
    - target: {fileID: 630393484641595019, guid: 054da3bb2e73a104dbd27392213cfb3d,
        type: 3}
      propertyPath: m_Name
      value: LevelCompleted
      objectReference: {fileID: 0}
    m_RemovedComponents:
    - {fileID: 1366519470525969952, guid: 054da3bb2e73a104dbd27392213cfb3d, type: 3}
  m_SourcePrefab: {fileID: 100100000, guid: 054da3bb2e73a104dbd27392213cfb3d, type: 3}
--- !u!224 &1775134462330540303 stripped
RectTransform:
  m_CorrespondingSourceObject: {fileID: 630393484641595016, guid: 054da3bb2e73a104dbd27392213cfb3d,
    type: 3}
  m_PrefabInstance: {fileID: 1161102883237429127}
  m_PrefabAsset: {fileID: 0}
--- !u!114 &773926244539285284 stripped
MonoBehaviour:
  m_CorrespondingSourceObject: {fileID: 1918701915899805859, guid: 054da3bb2e73a104dbd27392213cfb3d,
    type: 3}
  m_PrefabInstance: {fileID: 1161102883237429127}
  m_PrefabAsset: {fileID: 0}
  m_GameObject: {fileID: 0}
  m_Enabled: 1
  m_EditorHideFlags: 0
  m_Script: {fileID: 11500000, guid: 2286326b07ab04ae38003d85e9d81499, type: 3}
  m_Name: 
  m_EditorClassIdentifier: 
--- !u!1001 &2142148892008073691
PrefabInstance:
  m_ObjectHideFlags: 0
  serializedVersion: 2
  m_Modification:
    m_TransformParent: {fileID: 3317815484604346231}
    m_Modifications:
    - target: {fileID: 46494888268689682, guid: aafe89dd0cc949049b5cd7a3745fe75e,
        type: 3}
      propertyPath: m_Name
      value: Button
      objectReference: {fileID: 0}
    - target: {fileID: 46494888268689709, guid: aafe89dd0cc949049b5cd7a3745fe75e,
        type: 3}
      propertyPath: m_LocalPosition.x
      value: 0
      objectReference: {fileID: 0}
    - target: {fileID: 46494888268689709, guid: aafe89dd0cc949049b5cd7a3745fe75e,
        type: 3}
      propertyPath: m_LocalPosition.y
      value: 0
      objectReference: {fileID: 0}
    - target: {fileID: 46494888268689709, guid: aafe89dd0cc949049b5cd7a3745fe75e,
        type: 3}
      propertyPath: m_LocalPosition.z
      value: 0
      objectReference: {fileID: 0}
    - target: {fileID: 46494888268689709, guid: aafe89dd0cc949049b5cd7a3745fe75e,
        type: 3}
      propertyPath: m_LocalRotation.x
      value: -0
      objectReference: {fileID: 0}
    - target: {fileID: 46494888268689709, guid: aafe89dd0cc949049b5cd7a3745fe75e,
        type: 3}
      propertyPath: m_LocalRotation.y
      value: -0
      objectReference: {fileID: 0}
    - target: {fileID: 46494888268689709, guid: aafe89dd0cc949049b5cd7a3745fe75e,
        type: 3}
      propertyPath: m_LocalRotation.z
      value: -0
      objectReference: {fileID: 0}
    - target: {fileID: 46494888268689709, guid: aafe89dd0cc949049b5cd7a3745fe75e,
        type: 3}
      propertyPath: m_LocalRotation.w
      value: 1
      objectReference: {fileID: 0}
    - target: {fileID: 46494888268689709, guid: aafe89dd0cc949049b5cd7a3745fe75e,
        type: 3}
      propertyPath: m_RootOrder
      value: 2
      objectReference: {fileID: 0}
    - target: {fileID: 46494888268689709, guid: aafe89dd0cc949049b5cd7a3745fe75e,
        type: 3}
      propertyPath: m_LocalEulerAnglesHint.x
      value: 0
      objectReference: {fileID: 0}
    - target: {fileID: 46494888268689709, guid: aafe89dd0cc949049b5cd7a3745fe75e,
        type: 3}
      propertyPath: m_LocalEulerAnglesHint.y
      value: 0
      objectReference: {fileID: 0}
    - target: {fileID: 46494888268689709, guid: aafe89dd0cc949049b5cd7a3745fe75e,
        type: 3}
      propertyPath: m_LocalEulerAnglesHint.z
      value: 0
      objectReference: {fileID: 0}
    - target: {fileID: 46494888268689709, guid: aafe89dd0cc949049b5cd7a3745fe75e,
        type: 3}
      propertyPath: m_AnchoredPosition.x
      value: 0
      objectReference: {fileID: 0}
    - target: {fileID: 46494888268689709, guid: aafe89dd0cc949049b5cd7a3745fe75e,
        type: 3}
      propertyPath: m_AnchoredPosition.y
      value: -600
      objectReference: {fileID: 0}
    - target: {fileID: 46494888268689709, guid: aafe89dd0cc949049b5cd7a3745fe75e,
        type: 3}
      propertyPath: m_SizeDelta.x
      value: 200
      objectReference: {fileID: 0}
    - target: {fileID: 46494888268689709, guid: aafe89dd0cc949049b5cd7a3745fe75e,
        type: 3}
      propertyPath: m_SizeDelta.y
      value: 200
      objectReference: {fileID: 0}
    - target: {fileID: 46494888268689709, guid: aafe89dd0cc949049b5cd7a3745fe75e,
        type: 3}
      propertyPath: m_AnchorMin.x
      value: 0.5
      objectReference: {fileID: 0}
    - target: {fileID: 46494888268689709, guid: aafe89dd0cc949049b5cd7a3745fe75e,
        type: 3}
      propertyPath: m_AnchorMin.y
      value: 0.5
      objectReference: {fileID: 0}
    - target: {fileID: 46494888268689709, guid: aafe89dd0cc949049b5cd7a3745fe75e,
        type: 3}
      propertyPath: m_AnchorMax.x
      value: 0.5
      objectReference: {fileID: 0}
    - target: {fileID: 46494888268689709, guid: aafe89dd0cc949049b5cd7a3745fe75e,
        type: 3}
      propertyPath: m_AnchorMax.y
      value: 0.5
      objectReference: {fileID: 0}
    - target: {fileID: 46494888268689709, guid: aafe89dd0cc949049b5cd7a3745fe75e,
        type: 3}
      propertyPath: m_Pivot.x
      value: 0.5
      objectReference: {fileID: 0}
    - target: {fileID: 46494888268689709, guid: aafe89dd0cc949049b5cd7a3745fe75e,
        type: 3}
      propertyPath: m_Pivot.y
      value: 0.5
      objectReference: {fileID: 0}
    - target: {fileID: 46494888268689709, guid: aafe89dd0cc949049b5cd7a3745fe75e,
        type: 3}
      propertyPath: m_LocalScale.x
      value: 1
      objectReference: {fileID: 0}
    - target: {fileID: 46494888268689709, guid: aafe89dd0cc949049b5cd7a3745fe75e,
        type: 3}
      propertyPath: m_LocalScale.y
      value: 1
      objectReference: {fileID: 0}
    - target: {fileID: 46494888268689709, guid: aafe89dd0cc949049b5cd7a3745fe75e,
        type: 3}
      propertyPath: m_LocalScale.z
      value: 1
      objectReference: {fileID: 0}
    m_RemovedComponents: []
  m_SourcePrefab: {fileID: 100100000, guid: aafe89dd0cc949049b5cd7a3745fe75e, type: 3}
--- !u!224 &2098501279394511094 stripped
RectTransform:
  m_CorrespondingSourceObject: {fileID: 46494888268689709, guid: aafe89dd0cc949049b5cd7a3745fe75e,
    type: 3}
  m_PrefabInstance: {fileID: 2142148892008073691}
  m_PrefabAsset: {fileID: 0}
--- !u!1001 &6552572881046303065
PrefabInstance:
  m_ObjectHideFlags: 0
  serializedVersion: 2
  m_Modification:
    m_TransformParent: {fileID: 3317815484604346231}
    m_Modifications:
    - target: {fileID: 4244737300591339121, guid: b5c05b92f201ee54d829d83b0c80b1a6,
        type: 3}
      propertyPath: m_Material
      value: 
      objectReference: {fileID: 0}
    - target: {fileID: 4244737301012330880, guid: b5c05b92f201ee54d829d83b0c80b1a6,
        type: 3}
      propertyPath: m_LocalPosition.x
      value: 0
      objectReference: {fileID: 0}
    - target: {fileID: 4244737301012330880, guid: b5c05b92f201ee54d829d83b0c80b1a6,
        type: 3}
      propertyPath: m_LocalPosition.y
      value: 0
      objectReference: {fileID: 0}
    - target: {fileID: 4244737301012330880, guid: b5c05b92f201ee54d829d83b0c80b1a6,
        type: 3}
      propertyPath: m_LocalPosition.z
      value: 0
      objectReference: {fileID: 0}
    - target: {fileID: 4244737301012330880, guid: b5c05b92f201ee54d829d83b0c80b1a6,
        type: 3}
      propertyPath: m_LocalRotation.x
      value: -0
      objectReference: {fileID: 0}
    - target: {fileID: 4244737301012330880, guid: b5c05b92f201ee54d829d83b0c80b1a6,
        type: 3}
      propertyPath: m_LocalRotation.y
      value: -0
      objectReference: {fileID: 0}
    - target: {fileID: 4244737301012330880, guid: b5c05b92f201ee54d829d83b0c80b1a6,
        type: 3}
      propertyPath: m_LocalRotation.z
      value: -0
      objectReference: {fileID: 0}
    - target: {fileID: 4244737301012330880, guid: b5c05b92f201ee54d829d83b0c80b1a6,
        type: 3}
      propertyPath: m_LocalRotation.w
      value: 1
      objectReference: {fileID: 0}
    - target: {fileID: 4244737301012330880, guid: b5c05b92f201ee54d829d83b0c80b1a6,
        type: 3}
      propertyPath: m_RootOrder
      value: 3
      objectReference: {fileID: 0}
    - target: {fileID: 4244737301012330880, guid: b5c05b92f201ee54d829d83b0c80b1a6,
        type: 3}
      propertyPath: m_LocalEulerAnglesHint.x
      value: 0
      objectReference: {fileID: 0}
    - target: {fileID: 4244737301012330880, guid: b5c05b92f201ee54d829d83b0c80b1a6,
        type: 3}
      propertyPath: m_LocalEulerAnglesHint.y
      value: 0
      objectReference: {fileID: 0}
    - target: {fileID: 4244737301012330880, guid: b5c05b92f201ee54d829d83b0c80b1a6,
        type: 3}
      propertyPath: m_LocalEulerAnglesHint.z
      value: 0
      objectReference: {fileID: 0}
    - target: {fileID: 4244737301012330880, guid: b5c05b92f201ee54d829d83b0c80b1a6,
        type: 3}
      propertyPath: m_AnchoredPosition.x
      value: 0
      objectReference: {fileID: 0}
    - target: {fileID: 4244737301012330880, guid: b5c05b92f201ee54d829d83b0c80b1a6,
        type: 3}
      propertyPath: m_AnchoredPosition.y
      value: 300
      objectReference: {fileID: 0}
    - target: {fileID: 4244737301012330880, guid: b5c05b92f201ee54d829d83b0c80b1a6,
        type: 3}
      propertyPath: m_SizeDelta.x
      value: 100
      objectReference: {fileID: 0}
    - target: {fileID: 4244737301012330880, guid: b5c05b92f201ee54d829d83b0c80b1a6,
        type: 3}
      propertyPath: m_SizeDelta.y
      value: 100
      objectReference: {fileID: 0}
    - target: {fileID: 4244737301012330880, guid: b5c05b92f201ee54d829d83b0c80b1a6,
        type: 3}
      propertyPath: m_AnchorMin.x
      value: 0.5
      objectReference: {fileID: 0}
    - target: {fileID: 4244737301012330880, guid: b5c05b92f201ee54d829d83b0c80b1a6,
        type: 3}
      propertyPath: m_AnchorMin.y
      value: 0.5
      objectReference: {fileID: 0}
    - target: {fileID: 4244737301012330880, guid: b5c05b92f201ee54d829d83b0c80b1a6,
        type: 3}
      propertyPath: m_AnchorMax.x
      value: 0.5
      objectReference: {fileID: 0}
    - target: {fileID: 4244737301012330880, guid: b5c05b92f201ee54d829d83b0c80b1a6,
        type: 3}
      propertyPath: m_AnchorMax.y
      value: 0.5
      objectReference: {fileID: 0}
    - target: {fileID: 4244737301012330880, guid: b5c05b92f201ee54d829d83b0c80b1a6,
        type: 3}
      propertyPath: m_Pivot.x
      value: 0.5
      objectReference: {fileID: 0}
    - target: {fileID: 4244737301012330880, guid: b5c05b92f201ee54d829d83b0c80b1a6,
        type: 3}
      propertyPath: m_Pivot.y
      value: 0.5
      objectReference: {fileID: 0}
    - target: {fileID: 4244737301012330887, guid: b5c05b92f201ee54d829d83b0c80b1a6,
        type: 3}
      propertyPath: m_Name
      value: Confetti
      objectReference: {fileID: 0}
    - target: {fileID: 4244737301276250944, guid: b5c05b92f201ee54d829d83b0c80b1a6,
        type: 3}
      propertyPath: m_LocalPosition.z
      value: 0
      objectReference: {fileID: 0}
    - target: {fileID: 4244737301276250947, guid: b5c05b92f201ee54d829d83b0c80b1a6,
        type: 3}
      propertyPath: m_Material
      value: 
      objectReference: {fileID: 0}
    m_RemovedComponents: []
  m_SourcePrefab: {fileID: 100100000, guid: b5c05b92f201ee54d829d83b0c80b1a6, type: 3}
--- !u!224 &6919565617719658713 stripped
RectTransform:
  m_CorrespondingSourceObject: {fileID: 4244737301012330880, guid: b5c05b92f201ee54d829d83b0c80b1a6,
    type: 3}
  m_PrefabInstance: {fileID: 6552572881046303065}
  m_PrefabAsset: {fileID: 0}
--- !u!1001 &7892847788449142806
PrefabInstance:
  m_ObjectHideFlags: 0
  serializedVersion: 2
  m_Modification:
    m_TransformParent: {fileID: 3317815484604346231}
    m_Modifications:
    - target: {fileID: 7705154554627991872, guid: 4696733d71cafa647af689193ef823f0,
        type: 3}
      propertyPath: m_LocalPosition.x
      value: 0
      objectReference: {fileID: 0}
    - target: {fileID: 7705154554627991872, guid: 4696733d71cafa647af689193ef823f0,
        type: 3}
      propertyPath: m_LocalPosition.y
      value: 0
      objectReference: {fileID: 0}
    - target: {fileID: 7705154554627991872, guid: 4696733d71cafa647af689193ef823f0,
        type: 3}
      propertyPath: m_LocalPosition.z
      value: 0
      objectReference: {fileID: 0}
    - target: {fileID: 7705154554627991872, guid: 4696733d71cafa647af689193ef823f0,
        type: 3}
      propertyPath: m_LocalRotation.x
      value: 0
      objectReference: {fileID: 0}
    - target: {fileID: 7705154554627991872, guid: 4696733d71cafa647af689193ef823f0,
        type: 3}
      propertyPath: m_LocalRotation.y
      value: 0
      objectReference: {fileID: 0}
    - target: {fileID: 7705154554627991872, guid: 4696733d71cafa647af689193ef823f0,
        type: 3}
      propertyPath: m_LocalRotation.z
      value: 0
      objectReference: {fileID: 0}
    - target: {fileID: 7705154554627991872, guid: 4696733d71cafa647af689193ef823f0,
        type: 3}
      propertyPath: m_LocalRotation.w
      value: 1
      objectReference: {fileID: 0}
    - target: {fileID: 7705154554627991872, guid: 4696733d71cafa647af689193ef823f0,
        type: 3}
      propertyPath: m_RootOrder
      value: 1
      objectReference: {fileID: 0}
    - target: {fileID: 7705154554627991872, guid: 4696733d71cafa647af689193ef823f0,
        type: 3}
      propertyPath: m_LocalEulerAnglesHint.x
      value: 0
      objectReference: {fileID: 0}
    - target: {fileID: 7705154554627991872, guid: 4696733d71cafa647af689193ef823f0,
        type: 3}
      propertyPath: m_LocalEulerAnglesHint.y
      value: 0
      objectReference: {fileID: 0}
    - target: {fileID: 7705154554627991872, guid: 4696733d71cafa647af689193ef823f0,
        type: 3}
      propertyPath: m_LocalEulerAnglesHint.z
      value: 0
      objectReference: {fileID: 0}
    - target: {fileID: 7705154554627991872, guid: 4696733d71cafa647af689193ef823f0,
        type: 3}
      propertyPath: m_AnchoredPosition.x
      value: 0
      objectReference: {fileID: 0}
    - target: {fileID: 7705154554627991872, guid: 4696733d71cafa647af689193ef823f0,
        type: 3}
      propertyPath: m_AnchoredPosition.y
      value: 0
      objectReference: {fileID: 0}
    - target: {fileID: 7705154554627991872, guid: 4696733d71cafa647af689193ef823f0,
        type: 3}
      propertyPath: m_SizeDelta.x
      value: 0
      objectReference: {fileID: 0}
    - target: {fileID: 7705154554627991872, guid: 4696733d71cafa647af689193ef823f0,
        type: 3}
      propertyPath: m_SizeDelta.y
      value: 910
      objectReference: {fileID: 0}
    - target: {fileID: 7705154554627991872, guid: 4696733d71cafa647af689193ef823f0,
        type: 3}
      propertyPath: m_AnchorMin.x
      value: 0
      objectReference: {fileID: 0}
    - target: {fileID: 7705154554627991872, guid: 4696733d71cafa647af689193ef823f0,
        type: 3}
      propertyPath: m_AnchorMin.y
      value: 0.5
      objectReference: {fileID: 0}
    - target: {fileID: 7705154554627991872, guid: 4696733d71cafa647af689193ef823f0,
        type: 3}
      propertyPath: m_AnchorMax.x
      value: 1
      objectReference: {fileID: 0}
    - target: {fileID: 7705154554627991872, guid: 4696733d71cafa647af689193ef823f0,
        type: 3}
      propertyPath: m_AnchorMax.y
      value: 0.5
      objectReference: {fileID: 0}
    - target: {fileID: 7705154554627991872, guid: 4696733d71cafa647af689193ef823f0,
        type: 3}
      propertyPath: m_Pivot.x
      value: 0.5
      objectReference: {fileID: 0}
    - target: {fileID: 7705154554627991872, guid: 4696733d71cafa647af689193ef823f0,
        type: 3}
      propertyPath: m_Pivot.y
      value: 0.5
      objectReference: {fileID: 0}
    - target: {fileID: 7705154554627991875, guid: 4696733d71cafa647af689193ef823f0,
        type: 3}
      propertyPath: m_Name
      value: LeaderBoard
      objectReference: {fileID: 0}
    m_RemovedComponents: []
  m_SourcePrefab: {fileID: 100100000, guid: 4696733d71cafa647af689193ef823f0, type: 3}
--- !u!224 &533450059411927382 stripped
RectTransform:
  m_CorrespondingSourceObject: {fileID: 7705154554627991872, guid: 4696733d71cafa647af689193ef823f0,
    type: 3}
  m_PrefabInstance: {fileID: 7892847788449142806}
  m_PrefabAsset: {fileID: 0}
--- !u!114 &533450059411927402 stripped
MonoBehaviour:
  m_CorrespondingSourceObject: {fileID: 7705154554627991932, guid: 4696733d71cafa647af689193ef823f0,
    type: 3}
  m_PrefabInstance: {fileID: 7892847788449142806}
  m_PrefabAsset: {fileID: 0}
  m_GameObject: {fileID: 0}
  m_Enabled: 1
  m_EditorHideFlags: 0
  m_Script: {fileID: 11500000, guid: 6b20e7e0f270cb044afc5f10be36a483, type: 3}
  m_Name: 
  m_EditorClassIdentifier: 
