%YAML 1.1
%TAG !u! tag:unity3d.com,2011:
--- !u!1 &2346860028059746847
GameObject:
  m_ObjectHideFlags: 0
  m_CorrespondingSourceObject: {fileID: 0}
  m_PrefabInstance: {fileID: 0}
  m_PrefabAsset: {fileID: 0}
  serializedVersion: 6
  m_Component:
  - component: {fileID: 2346860028059746846}
  - component: {fileID: 2346860028059746833}
  m_Layer: 5
  m_Name: LevelBarImagePointer
  m_TagString: Untagged
  m_Icon: {fileID: 0}
  m_NavMeshLayer: 0
  m_StaticEditorFlags: 0
  m_IsActive: 1
--- !u!224 &2346860028059746846
RectTransform:
  m_ObjectHideFlags: 0
  m_CorrespondingSourceObject: {fileID: 0}
  m_PrefabInstance: {fileID: 0}
  m_PrefabAsset: {fileID: 0}
  m_GameObject: {fileID: 2346860028059746847}
  m_LocalRotation: {x: 0, y: 0, z: 0, w: 1}
  m_LocalPosition: {x: 0, y: 0, z: 0}
  m_LocalScale: {x: 1, y: 1, z: 1}
  m_Children:
  - {fileID: 1365802626010454109}
  m_Father: {fileID: 0}
  m_RootOrder: 0
  m_LocalEulerAnglesHint: {x: 0, y: 0, z: 0}
  m_AnchorMin: {x: 0.5, y: 1}
  m_AnchorMax: {x: 0.5, y: 1}
  m_AnchoredPosition: {x: 0, y: -250}
  m_SizeDelta: {x: 100, y: 100}
  m_Pivot: {x: 0.5, y: 0.5}
--- !u!222 &2346860028059746833
CanvasRenderer:
  m_ObjectHideFlags: 0
  m_CorrespondingSourceObject: {fileID: 0}
  m_PrefabInstance: {fileID: 0}
  m_PrefabAsset: {fileID: 0}
  m_GameObject: {fileID: 2346860028059746847}
  m_CullTransparentMesh: 0
--- !u!1001 &3631579714406488643
PrefabInstance:
  m_ObjectHideFlags: 0
  serializedVersion: 2
  m_Modification:
    m_TransformParent: {fileID: 2346860028059746846}
    m_Modifications:
    - target: {fileID: 2346860028059746846, guid: 12b66b65288c9204ea2e68908cf8e6cd,
        type: 3}
      propertyPath: m_LocalPosition.x
      value: 0
      objectReference: {fileID: 0}
    - target: {fileID: 2346860028059746846, guid: 12b66b65288c9204ea2e68908cf8e6cd,
        type: 3}
      propertyPath: m_LocalPosition.y
      value: 0
      objectReference: {fileID: 0}
    - target: {fileID: 2346860028059746846, guid: 12b66b65288c9204ea2e68908cf8e6cd,
        type: 3}
      propertyPath: m_LocalPosition.z
      value: 0
      objectReference: {fileID: 0}
    - target: {fileID: 2346860028059746846, guid: 12b66b65288c9204ea2e68908cf8e6cd,
        type: 3}
      propertyPath: m_LocalRotation.x
      value: -0
      objectReference: {fileID: 0}
    - target: {fileID: 2346860028059746846, guid: 12b66b65288c9204ea2e68908cf8e6cd,
        type: 3}
      propertyPath: m_LocalRotation.y
      value: -0
      objectReference: {fileID: 0}
    - target: {fileID: 2346860028059746846, guid: 12b66b65288c9204ea2e68908cf8e6cd,
        type: 3}
      propertyPath: m_LocalRotation.z
      value: -0
      objectReference: {fileID: 0}
    - target: {fileID: 2346860028059746846, guid: 12b66b65288c9204ea2e68908cf8e6cd,
        type: 3}
      propertyPath: m_LocalRotation.w
      value: 1
      objectReference: {fileID: 0}
    - target: {fileID: 2346860028059746846, guid: 12b66b65288c9204ea2e68908cf8e6cd,
        type: 3}
      propertyPath: m_RootOrder
      value: 0
      objectReference: {fileID: 0}
    - target: {fileID: 2346860028059746846, guid: 12b66b65288c9204ea2e68908cf8e6cd,
        type: 3}
      propertyPath: m_LocalEulerAnglesHint.x
      value: 0
      objectReference: {fileID: 0}
    - target: {fileID: 2346860028059746846, guid: 12b66b65288c9204ea2e68908cf8e6cd,
        type: 3}
      propertyPath: m_LocalEulerAnglesHint.y
      value: 0
      objectReference: {fileID: 0}
    - target: {fileID: 2346860028059746846, guid: 12b66b65288c9204ea2e68908cf8e6cd,
        type: 3}
      propertyPath: m_LocalEulerAnglesHint.z
      value: 0
      objectReference: {fileID: 0}
    - target: {fileID: 2346860028059746846, guid: 12b66b65288c9204ea2e68908cf8e6cd,
        type: 3}
      propertyPath: m_AnchoredPosition.x
      value: 0
      objectReference: {fileID: 0}
    - target: {fileID: 2346860028059746846, guid: 12b66b65288c9204ea2e68908cf8e6cd,
        type: 3}
      propertyPath: m_AnchoredPosition.y
      value: 0
      objectReference: {fileID: 0}
    - target: {fileID: 2346860028059746846, guid: 12b66b65288c9204ea2e68908cf8e6cd,
        type: 3}
      propertyPath: m_SizeDelta.x
      value: 100
      objectReference: {fileID: 0}
    - target: {fileID: 2346860028059746846, guid: 12b66b65288c9204ea2e68908cf8e6cd,
        type: 3}
      propertyPath: m_SizeDelta.y
      value: 100
      objectReference: {fileID: 0}
    - target: {fileID: 2346860028059746846, guid: 12b66b65288c9204ea2e68908cf8e6cd,
        type: 3}
      propertyPath: m_AnchorMin.x
      value: 0.5
      objectReference: {fileID: 0}
    - target: {fileID: 2346860028059746846, guid: 12b66b65288c9204ea2e68908cf8e6cd,
        type: 3}
      propertyPath: m_AnchorMin.y
      value: 0.5
      objectReference: {fileID: 0}
    - target: {fileID: 2346860028059746846, guid: 12b66b65288c9204ea2e68908cf8e6cd,
        type: 3}
      propertyPath: m_AnchorMax.x
      value: 0.5
      objectReference: {fileID: 0}
    - target: {fileID: 2346860028059746846, guid: 12b66b65288c9204ea2e68908cf8e6cd,
        type: 3}
      propertyPath: m_AnchorMax.y
      value: 0.5
      objectReference: {fileID: 0}
    - target: {fileID: 2346860028059746846, guid: 12b66b65288c9204ea2e68908cf8e6cd,
        type: 3}
      propertyPath: m_Pivot.x
      value: 0.5
      objectReference: {fileID: 0}
    - target: {fileID: 2346860028059746846, guid: 12b66b65288c9204ea2e68908cf8e6cd,
        type: 3}
      propertyPath: m_Pivot.y
      value: 0.5
      objectReference: {fileID: 0}
    - target: {fileID: 2346860028059746847, guid: 12b66b65288c9204ea2e68908cf8e6cd,
        type: 3}
      propertyPath: m_Name
      value: LevelBar
      objectReference: {fileID: 0}
    - target: {fileID: 2448326745886333118, guid: 12b66b65288c9204ea2e68908cf8e6cd,
        type: 3}
      propertyPath: m_IsActive
      value: 0
      objectReference: {fileID: 0}
    - target: {fileID: 4990176836952431486, guid: 12b66b65288c9204ea2e68908cf8e6cd,
        type: 3}
      propertyPath: m_IsActive
      value: 0
      objectReference: {fileID: 0}
    - target: {fileID: 5613201442230314322, guid: 12b66b65288c9204ea2e68908cf8e6cd,
        type: 3}
      propertyPath: m_IsActive
      value: 0
      objectReference: {fileID: 0}
    - target: {fileID: 7128780599303044819, guid: 12b66b65288c9204ea2e68908cf8e6cd,
        type: 3}
      propertyPath: m_IsActive
      value: 0
      objectReference: {fileID: 0}
    - target: {fileID: 7993311854759934967, guid: 12b66b65288c9204ea2e68908cf8e6cd,
        type: 3}
      propertyPath: m_IsActive
      value: 1
      objectReference: {fileID: 0}
    m_RemovedComponents: []
  m_SourcePrefab: {fileID: 100100000, guid: 12b66b65288c9204ea2e68908cf8e6cd, type: 3}
--- !u!224 &1365802626010454109 stripped
RectTransform:
  m_CorrespondingSourceObject: {fileID: 2346860028059746846, guid: 12b66b65288c9204ea2e68908cf8e6cd,
    type: 3}
  m_PrefabInstance: {fileID: 3631579714406488643}
  m_PrefabAsset: {fileID: 0}
