%YAML 1.1
%TAG !u! tag:unity3d.com,2011:
--- !u!1 &6543877127774387574
GameObject:
  m_ObjectHideFlags: 0
  m_CorrespondingSourceObject: {fileID: 0}
  m_PrefabInstance: {fileID: 0}
  m_PrefabAsset: {fileID: 0}
  serializedVersion: 6
  m_Component:
  - component: {fileID: 6543877127774387575}
  - component: {fileID: 6543877127774387569}
  - component: {fileID: 6543877127774387568}
  m_Layer: 5
  m_Name: PauseTapToPlay
  m_TagString: Untagged
  m_Icon: {fileID: 0}
  m_NavMeshLayer: 0
  m_StaticEditorFlags: 0
  m_IsActive: 1
--- !u!224 &6543877127774387575
RectTransform:
  m_ObjectHideFlags: 0
  m_CorrespondingSourceObject: {fileID: 0}
  m_PrefabInstance: {fileID: 0}
  m_PrefabAsset: {fileID: 0}
  m_GameObject: {fileID: 6543877127774387574}
  m_LocalRotation: {x: -0, y: -0, z: -0, w: 1}
  m_LocalPosition: {x: 0, y: 0, z: 0}
  m_LocalScale: {x: 1, y: 1, z: 1}
  m_Children:
  - {fileID: 6275582232353301229}
  - {fileID: 4010299049196911249}
  m_Father: {fileID: 0}
  m_RootOrder: 0
  m_LocalEulerAnglesHint: {x: 0, y: 0, z: 0}
  m_AnchorMin: {x: 0, y: 0}
  m_AnchorMax: {x: 1, y: 1}
  m_AnchoredPosition: {x: 0, y: 0}
  m_SizeDelta: {x: 0, y: 0}
  m_Pivot: {x: 0.5, y: 0.5}
--- !u!222 &6543877127774387569
CanvasRenderer:
  m_ObjectHideFlags: 0
  m_CorrespondingSourceObject: {fileID: 0}
  m_PrefabInstance: {fileID: 0}
  m_PrefabAsset: {fileID: 0}
  m_GameObject: {fileID: 6543877127774387574}
  m_CullTransparentMesh: 0
--- !u!114 &6543877127774387568
MonoBehaviour:
  m_ObjectHideFlags: 0
  m_CorrespondingSourceObject: {fileID: 0}
  m_PrefabInstance: {fileID: 0}
  m_PrefabAsset: {fileID: 0}
  m_GameObject: {fileID: 6543877127774387574}
  m_Enabled: 1
  m_EditorHideFlags: 0
  m_Script: {fileID: 11500000, guid: fe87c0e1cc204ed48ad3b37840f39efc, type: 3}
  m_Name: 
  m_EditorClassIdentifier: 
  m_Material: {fileID: 0}
  m_Color: {r: 0, g: 0, b: 0, a: 0.39215687}
  m_RaycastTarget: 1
  m_Maskable: 1
  m_OnCullStateChanged:
    m_PersistentCalls:
      m_Calls: []
  m_Sprite: {fileID: 0}
  m_Type: 1
  m_PreserveAspect: 0
  m_FillCenter: 1
  m_FillMethod: 4
  m_FillAmount: 1
  m_FillClockwise: 1
  m_FillOrigin: 0
  m_UseSpriteMesh: 0
  m_PixelsPerUnitMultiplier: 1
--- !u!1001 &8330843696680724299
PrefabInstance:
  m_ObjectHideFlags: 0
  serializedVersion: 2
  m_Modification:
    m_TransformParent: {fileID: 6543877127774387575}
    m_Modifications:
    - target: {fileID: 2632990592549717401, guid: aeecf5e7ac41e9f49b7cc3667971e7b4,
        type: 3}
      propertyPath: m_Name
      value: Title
      objectReference: {fileID: 0}
    - target: {fileID: 2632990592549717414, guid: aeecf5e7ac41e9f49b7cc3667971e7b4,
        type: 3}
      propertyPath: m_LocalPosition.x
      value: 0
      objectReference: {fileID: 0}
    - target: {fileID: 2632990592549717414, guid: aeecf5e7ac41e9f49b7cc3667971e7b4,
        type: 3}
      propertyPath: m_LocalPosition.y
      value: 0
      objectReference: {fileID: 0}
    - target: {fileID: 2632990592549717414, guid: aeecf5e7ac41e9f49b7cc3667971e7b4,
        type: 3}
      propertyPath: m_LocalPosition.z
      value: 0
      objectReference: {fileID: 0}
    - target: {fileID: 2632990592549717414, guid: aeecf5e7ac41e9f49b7cc3667971e7b4,
        type: 3}
      propertyPath: m_LocalRotation.x
      value: 0
      objectReference: {fileID: 0}
    - target: {fileID: 2632990592549717414, guid: aeecf5e7ac41e9f49b7cc3667971e7b4,
        type: 3}
      propertyPath: m_LocalRotation.y
      value: 0
      objectReference: {fileID: 0}
    - target: {fileID: 2632990592549717414, guid: aeecf5e7ac41e9f49b7cc3667971e7b4,
        type: 3}
      propertyPath: m_LocalRotation.z
      value: 0
      objectReference: {fileID: 0}
    - target: {fileID: 2632990592549717414, guid: aeecf5e7ac41e9f49b7cc3667971e7b4,
        type: 3}
      propertyPath: m_LocalRotation.w
      value: 1
      objectReference: {fileID: 0}
    - target: {fileID: 2632990592549717414, guid: aeecf5e7ac41e9f49b7cc3667971e7b4,
        type: 3}
      propertyPath: m_RootOrder
      value: 0
      objectReference: {fileID: 0}
    - target: {fileID: 2632990592549717414, guid: aeecf5e7ac41e9f49b7cc3667971e7b4,
        type: 3}
      propertyPath: m_LocalEulerAnglesHint.x
      value: 0
      objectReference: {fileID: 0}
    - target: {fileID: 2632990592549717414, guid: aeecf5e7ac41e9f49b7cc3667971e7b4,
        type: 3}
      propertyPath: m_LocalEulerAnglesHint.y
      value: 0
      objectReference: {fileID: 0}
    - target: {fileID: 2632990592549717414, guid: aeecf5e7ac41e9f49b7cc3667971e7b4,
        type: 3}
      propertyPath: m_LocalEulerAnglesHint.z
      value: 0
      objectReference: {fileID: 0}
    - target: {fileID: 2632990592549717414, guid: aeecf5e7ac41e9f49b7cc3667971e7b4,
        type: 3}
      propertyPath: m_AnchoredPosition.x
      value: 0
      objectReference: {fileID: 0}
    - target: {fileID: 2632990592549717414, guid: aeecf5e7ac41e9f49b7cc3667971e7b4,
        type: 3}
      propertyPath: m_AnchoredPosition.y
      value: 600
      objectReference: {fileID: 0}
    - target: {fileID: 2632990592549717414, guid: aeecf5e7ac41e9f49b7cc3667971e7b4,
        type: 3}
      propertyPath: m_SizeDelta.x
      value: 800
      objectReference: {fileID: 0}
    - target: {fileID: 2632990592549717414, guid: aeecf5e7ac41e9f49b7cc3667971e7b4,
        type: 3}
      propertyPath: m_SizeDelta.y
      value: 200
      objectReference: {fileID: 0}
    - target: {fileID: 2632990592549717414, guid: aeecf5e7ac41e9f49b7cc3667971e7b4,
        type: 3}
      propertyPath: m_AnchorMin.x
      value: 0.5
      objectReference: {fileID: 0}
    - target: {fileID: 2632990592549717414, guid: aeecf5e7ac41e9f49b7cc3667971e7b4,
        type: 3}
      propertyPath: m_AnchorMin.y
      value: 0.5
      objectReference: {fileID: 0}
    - target: {fileID: 2632990592549717414, guid: aeecf5e7ac41e9f49b7cc3667971e7b4,
        type: 3}
      propertyPath: m_AnchorMax.x
      value: 0.5
      objectReference: {fileID: 0}
    - target: {fileID: 2632990592549717414, guid: aeecf5e7ac41e9f49b7cc3667971e7b4,
        type: 3}
      propertyPath: m_AnchorMax.y
      value: 0.5
      objectReference: {fileID: 0}
    - target: {fileID: 2632990592549717414, guid: aeecf5e7ac41e9f49b7cc3667971e7b4,
        type: 3}
      propertyPath: m_Pivot.x
      value: 0.5
      objectReference: {fileID: 0}
    - target: {fileID: 2632990592549717414, guid: aeecf5e7ac41e9f49b7cc3667971e7b4,
        type: 3}
      propertyPath: m_Pivot.y
      value: 0.5
      objectReference: {fileID: 0}
    - target: {fileID: 2632990592549717415, guid: aeecf5e7ac41e9f49b7cc3667971e7b4,
        type: 3}
      propertyPath: m_Text
      value: PAUSE
      objectReference: {fileID: 0}
    m_RemovedComponents: []
  m_SourcePrefab: {fileID: 100100000, guid: aeecf5e7ac41e9f49b7cc3667971e7b4, type: 3}
--- !u!224 &6275582232353301229 stripped
RectTransform:
  m_CorrespondingSourceObject: {fileID: 2632990592549717414, guid: aeecf5e7ac41e9f49b7cc3667971e7b4,
    type: 3}
  m_PrefabInstance: {fileID: 8330843696680724299}
  m_PrefabAsset: {fileID: 0}
--- !u!1001 &8785839742830586018
PrefabInstance:
  m_ObjectHideFlags: 0
  serializedVersion: 2
  m_Modification:
    m_TransformParent: {fileID: 6543877127774387575}
    m_Modifications:
    - target: {fileID: 5641571134695199282, guid: 4479aa66cef6a77449b5bc2187e25313,
        type: 3}
      propertyPath: m_Name
      value: TutorialTapToPlay
      objectReference: {fileID: 0}
    - target: {fileID: 5641571134695199283, guid: 4479aa66cef6a77449b5bc2187e25313,
        type: 3}
      propertyPath: m_LocalPosition.x
      value: 0
      objectReference: {fileID: 0}
    - target: {fileID: 5641571134695199283, guid: 4479aa66cef6a77449b5bc2187e25313,
        type: 3}
      propertyPath: m_LocalPosition.y
      value: 0
      objectReference: {fileID: 0}
    - target: {fileID: 5641571134695199283, guid: 4479aa66cef6a77449b5bc2187e25313,
        type: 3}
      propertyPath: m_LocalPosition.z
      value: 0
      objectReference: {fileID: 0}
    - target: {fileID: 5641571134695199283, guid: 4479aa66cef6a77449b5bc2187e25313,
        type: 3}
      propertyPath: m_LocalRotation.x
      value: -0
      objectReference: {fileID: 0}
    - target: {fileID: 5641571134695199283, guid: 4479aa66cef6a77449b5bc2187e25313,
        type: 3}
      propertyPath: m_LocalRotation.y
      value: -0
      objectReference: {fileID: 0}
    - target: {fileID: 5641571134695199283, guid: 4479aa66cef6a77449b5bc2187e25313,
        type: 3}
      propertyPath: m_LocalRotation.z
      value: -0
      objectReference: {fileID: 0}
    - target: {fileID: 5641571134695199283, guid: 4479aa66cef6a77449b5bc2187e25313,
        type: 3}
      propertyPath: m_LocalRotation.w
      value: 1
      objectReference: {fileID: 0}
    - target: {fileID: 5641571134695199283, guid: 4479aa66cef6a77449b5bc2187e25313,
        type: 3}
      propertyPath: m_RootOrder
      value: 1
      objectReference: {fileID: 0}
    - target: {fileID: 5641571134695199283, guid: 4479aa66cef6a77449b5bc2187e25313,
        type: 3}
      propertyPath: m_LocalEulerAnglesHint.x
      value: 0
      objectReference: {fileID: 0}
    - target: {fileID: 5641571134695199283, guid: 4479aa66cef6a77449b5bc2187e25313,
        type: 3}
      propertyPath: m_LocalEulerAnglesHint.y
      value: 0
      objectReference: {fileID: 0}
    - target: {fileID: 5641571134695199283, guid: 4479aa66cef6a77449b5bc2187e25313,
        type: 3}
      propertyPath: m_LocalEulerAnglesHint.z
      value: 0
      objectReference: {fileID: 0}
    - target: {fileID: 5641571134695199283, guid: 4479aa66cef6a77449b5bc2187e25313,
        type: 3}
      propertyPath: m_AnchoredPosition.x
      value: 0
      objectReference: {fileID: 0}
    - target: {fileID: 5641571134695199283, guid: 4479aa66cef6a77449b5bc2187e25313,
        type: 3}
      propertyPath: m_AnchoredPosition.y
      value: 0
      objectReference: {fileID: 0}
    - target: {fileID: 5641571134695199283, guid: 4479aa66cef6a77449b5bc2187e25313,
        type: 3}
      propertyPath: m_SizeDelta.x
      value: 0
      objectReference: {fileID: 0}
    - target: {fileID: 5641571134695199283, guid: 4479aa66cef6a77449b5bc2187e25313,
        type: 3}
      propertyPath: m_SizeDelta.y
      value: 0
      objectReference: {fileID: 0}
    - target: {fileID: 5641571134695199283, guid: 4479aa66cef6a77449b5bc2187e25313,
        type: 3}
      propertyPath: m_AnchorMin.x
      value: 0
      objectReference: {fileID: 0}
    - target: {fileID: 5641571134695199283, guid: 4479aa66cef6a77449b5bc2187e25313,
        type: 3}
      propertyPath: m_AnchorMin.y
      value: 0
      objectReference: {fileID: 0}
    - target: {fileID: 5641571134695199283, guid: 4479aa66cef6a77449b5bc2187e25313,
        type: 3}
      propertyPath: m_AnchorMax.x
      value: 1
      objectReference: {fileID: 0}
    - target: {fileID: 5641571134695199283, guid: 4479aa66cef6a77449b5bc2187e25313,
        type: 3}
      propertyPath: m_AnchorMax.y
      value: 1
      objectReference: {fileID: 0}
    - target: {fileID: 5641571134695199283, guid: 4479aa66cef6a77449b5bc2187e25313,
        type: 3}
      propertyPath: m_Pivot.x
      value: 0.5
      objectReference: {fileID: 0}
    - target: {fileID: 5641571134695199283, guid: 4479aa66cef6a77449b5bc2187e25313,
        type: 3}
      propertyPath: m_Pivot.y
      value: 0.5
      objectReference: {fileID: 0}
    m_RemovedComponents: []
  m_SourcePrefab: {fileID: 100100000, guid: 4479aa66cef6a77449b5bc2187e25313, type: 3}
--- !u!224 &4010299049196911249 stripped
RectTransform:
  m_CorrespondingSourceObject: {fileID: 5641571134695199283, guid: 4479aa66cef6a77449b5bc2187e25313,
    type: 3}
  m_PrefabInstance: {fileID: 8785839742830586018}
  m_PrefabAsset: {fileID: 0}
