volume,cx,cy,cz,Ix,Iy,Iz
7.977366559922909e-8,0.0866989311263332,-0.10333856460276811,0.0008013137693268185,3.454163906940837e-13,3.46274155605061e-13,5.581324071250324e-13
9.933046385413036e-8,0.08669866108898351,-0.1082665213111752,0.0008014001985881251,1.407376521492493e-13,1.0404877106221546e-12,1.0431719256715858e-12
7.977664987871928e-8,-0.0036988447272748,-0.10333843229176191,0.09119851184121365,3.471032223287024e-13,3.4733494400062676e-13,5.587923505417004e-13
9.933225442182447e-8,-0.003698606606984244,-0.10826648913396679,0.09119864997321367,1.4057492573950852e-13,1.0426860688072e-12,1.0435609032418811e-12
5.525838275843853e-8,0.0041013600950212635,0.0444780924150922,0.09219878994176704,5.942267196322257e-14,7.564921494695536e-13,7.585076138047633e-13
1.0887038115470205e-7,0.07512007893064226,-0.02860002272963018,0.0014999646576332052,1.0005281548303895e-13,6.080866900868399e-12,6.082394147320878e-12
1.0887098748450323e-7,0.07511992162672237,-0.028599991258887306,0.09049995074694091,1.0063624748983075e-13,6.083313645659676e-12,6.0845211572497314e-12
5.525856276259825e-8,0.07889859068167844,-0.10167788971633872,-0.0001986393127610117,6.101709698622687e-14,7.596831455229697e-13,7.605910652040703e-13
5.525893698177242e-8,0.004101318960146263,-0.10167780120296539,-0.00019863708856156776,6.077379876875302e-14,7.610716737695617e-13,7.617361403489196e-13
5.52583543367291e-8,0.004101363878815638,0.04447798670648019,-0.00019859761871138308,6.07728268763167e-14,7.582425537489485e-13,7.589072317682257e-13
5.5257847482910925e-8,0.07889869043818595,0.04447803035264661,-0.00019859573594877868,6.069179156667747e-14,7.579647201302764e-13,7.585487383687068e-13
5.5258780662370555e-8,0.004101324534804547,-0.10167808883531769,0.09219859751936334,6.143168869594891e-14,7.582111673459025e-13,7.582363251556092e-13
1.058753732833632e-10,0.008129342268580047,-0.015274998073173444,0.00809326478979196,1.6894418002573966e-18,1.0546791470432851e-17,1.0559618536928757e-17
1.3514664412165681e-5,0.04147223851305129,-0.013949997568339529,0.04603363201780801,9.635501563922864e-9,9.641307644494266e-9,1.9271042966728094e-8
6.448106641225119e-9,0.026899996707953913,-0.016020006790246802,0.01106499748413298,2.605359099665329e-15,4.770403877436805e-15,4.772194742279147e-15
6.448110193938798e-9,-0.00013499990865595865,-0.016020016616329458,0.07820497957279642,2.6289508203178586e-15,4.769867384128851e-15,4.793910624135662e-15
6.450163662445145e-9,0.04399754706032795,-0.016020021385967486,0.08138004828263241,2.552779124110924e-15,4.712530235860609e-15,4.776825204957433e-15
6.448108417581959e-9,-0.00013500003552249326,-0.016020013855515672,0.08074501255155357,2.5984481576689486e-15,4.763705605867421e-15,4.770462172757652e-15
8.803233697562973e-10,0.050605324321633866,-0.015899949885958078,0.009964180504044434,5.030865630642005e-17,4.118469819205792e-16,4.155135795889842e-16
8.805477828370082e-10,0.043569402594153914,-0.01589997962915394,0.0196413731883522,5.3142728248588707e-17,4.1404662343065137e-16,4.1547877635689003e-16
6.450170767872502e-9,0.06780950821462962,-0.0160200080415886,0.01851498893363578,2.624059324421168e-15,4.7727809155548446e-15,4.790182530681836e-15
5.019498520534663e-10,0.08373680013111673,-0.013145319857644278,0.08429956101996486,1.9981966173997194e-15,2.00298070934514e-15,4.007697485869895e-15
7.166427167248912e-7,-0.0025825387993755793,-0.10842337631791243,0.09136499517105628,9.29037012728776e-12,1.756314231196012e-11,1.9760675216168202e-11
7.166443083406193e-7,0.08558249268547792,-0.10842316195697639,0.0006349725718642209,9.297671765335103e-12,1.7587006232456097e-11,1.9769855738905142e-11
7.166415040652888e-7,-0.002582539451312722,0.05122335364574234,0.09136504401474364,9.285484413075482e-12,1.7564362183458966e-11,1.9755382972972796e-11
7.166428683073415e-7,0.08558255228763494,0.05122334867292914,0.0006349741576279105,9.286758982410419e-12,1.756200243424454e-11,1.9755747485745693e-11
3.617290834275385e-5,0.0039550030234433145,-0.028522403652101617,0.04588596317726806,7.610500771960514e-8,8.140034433297189e-8,1.3367623865902118e-7
6.906845374032855e-5,0.061561186095077734,-0.02859092269466967,0.04616760963727621,1.7657319987645705e-7,3.3898805671119044e-7,3.714139040997133e-7
0.893002430597941,-1.5028029458453118,-3.715443795086597,0.3850470041082818,0.4452784076608703,1.1424878113250585,1.1536256572116872
0.0011190610627333324,-1.6343012049663388,-3.688731362081344,1.0725574298120146,1.35010482501642e-6,2.6101685467933815e-6,2.654492868139564e-6
0.0006436811139186224,-2.2842982827588134,-4.433601711550166,0.26602353719081606,5.055555432700202e-7,1.1508962582581395e-6,1.168324017226361e-6
0.0007358863949775696,-2.2675046488945587,-4.631234665397713,-0.0916774029975667,1.9078950758404994e-6,3.1277975010067345e-5,3.312550103706121e-5
0.0016616185506184895,-2.2299837382819976,-5.068891094317964,-0.2831251233080639,0.00010478984999140582,0.00010865821863555727,0.00021085055079306096
0.00137786070505778,-2.304051910598414,-2.3635787671232875,0.38603494502523433,4.3280913005473774e-5,8.159581030373388e-5,0.0001260305042633693
0.0011190592000881832,-1.6343021220381373,-3.6887319536321876,-0.3005102376258828,1.3540610497289372e-6,2.6155819768706675e-6,2.6501257105704772e-6
4.036910831928253e-5,-2.984250757470893,-4.163759824051431,1.060623505244621,1.609157947249537e-9,1.1945484867219788e-8,2.14674133562858e-8
0.00044125815232594806,-2.9367043011357885,-4.080276236252913,1.5659415207064624,-5.294301039342618e-7,6.253893907277912e-5,6.308940654988945e-5
7.042397434512775e-5,-3.0795388172438796,-3.975367145467409,2.1368847021068844,1.9763376143630716e-8,2.707068971849576e-7,2.773141029637735e-7
0.0006683419148127238,-3.1327189625060385,-3.8607976292222514,2.0957250287986326,5.884260279095121e-7,4.412231228409007e-6,4.644386240168242e-6
0.0016612609227498372,-2.230463797928577,-5.070012198914058,1.0553227666718492,9.713007916944644e-5,0.00010296372558015821,0.0002010570618515294
0.0007358832905689875,-2.26751083973227,-4.631228047380113,0.8637250120863331,1.9192591000383315e-6,3.128732566909359e-5,3.313071433270391e-5
0.0006436792512734731,-2.2843087512708373,-4.433614541273519,0.5060239380429393,4.712813991608893e-7,1.1065922139191997e-6,1.1233933765529228e-6
0.001119060752292474,-2.2843008122345343,-2.937195869779488,0.10602406701496665,1.3684467004745545e-6,2.624362905073862e-6,2.653525579458848e-6
0.0007358832905689875,-2.2892409276566523,-2.796222103351015,-0.2720321144206618,1.8841733996167241e-6,3.125960929503321e-5,3.3113460034726716e-5
0.001661380132039388,-2.2524754843338917,-2.35916048792155,-0.4650634473660608,0.00010290893874855368,0.00010330049143839435,0.000206731306660743
0.000735887015859286,-2.2892242764900286,-2.7962106900860513,1.0440784017265863,1.910274936935846e-6,3.127299388518874e-5,3.313787468826327e-5
0.0011190575702736776,-2.28430245287676,-2.9371978411460975,0.6660239475184977,1.3626291651532233e-6,2.6124387528810885e-6,2.634976011163417e-6
0.0016613006591796875,-2.252511481056257,-2.3592823143895907,1.2371916334792386,0.00010224035510749091,0.00010309183213166877,0.00020593773572269008
0.0004412829875946045,-2.9850971387406857,-4.07398527723374,-0.7938239374394993,4.3631970673032475e-7,6.305493585817163e-5,6.356180275646682e-5
4.036941876014074e-5,-2.984258568583271,-4.163693199732388,-0.2885709407370097,1.4026352851788239e-8,1.7307481072515538e-8,2.8840614516546727e-8
0.0006683443983395895,-3.1326738780651846,-3.8677000382741693,-1.324956755762492,5.274244500413865e-7,4.35501807689072e-6,4.630588938363597e-6
7.042296541233857e-5,-3.080111925042402,-3.9796560035177704,-1.3656144581234373,-1.0937915581849352e-8,2.3972211562578003e-7,2.6414675375519406e-7
0.0015033210317293804,-1.6459995341283988,-3.6886957577599833,1.4874489317167698,0.0001280995164566656,0.0001329836179276487,0.0002608863828183984
0.012748320897420248,-1.6606155438218078,-3.688832904227266,2.697734842061953,0.0010606716832665872,0.0024979027774039023,0.0035600468273229375
0.0127487579981486,-1.660555491486225,-3.688706429824862,4.334804633563256,0.0010677584981782279,0.002505067680891197,0.0035720060483389643
0.0127485990524292,-1.6605964548092598,-3.6887520298975467,5.972043908125512,0.0010643125695719647,0.002502178547502903,0.0035682588765168642
0.009535074234008789,-1.6610271380824977,-4.571087440302053,5.987804636644746,0.0003850659466898164,0.002120603423908656,0.002502925132658414
0.0023653682631750903,-1.66281423387939,-3.6887441498719484,7.6021589407910835,0.000467736612225968,0.0008774506975283017,0.0013450377492033793
0.0015033036470413208,-1.6460202210437627,-3.688755761510631,-0.7154185458690588,0.00012800452331155566,0.00013257222459312886,0.00026049751398754886
0.012748161951700846,-1.6605957271724157,-3.688785775735776,-1.9256517714093349,0.001062364387458018,0.0024993620522743786,0.003562356897592802
0.012748122215270996,-1.6605806425469973,-3.6887988323561407,-3.562871902050078,0.0010622958297880852,0.002498450384157032,0.0035602600778127636
0.012748400370279947,-1.6605662294591428,-3.688714450913897,-5.199969843278558,0.0010663360167699402,0.002503949216400467,0.0035696681370470072
0.002365364693105221,-1.6628134624725683,-3.688700894417428,-6.830061738675872,0.0004681235824673464,0.0008783450411270553,0.0013464023236531015
0.009534637133280436,-1.661113704276361,-2.8054645921807735,-5.198904341375387,0.0003781197595502761,0.0021056449054884575,0.0024843939213503403
0.0023786816745996475,-1.6628166326689087,-3.6887345395033067,2.6952349630070462,0.00047144785787737515,0.0008858087990817908,0.0013571074646758427
0.0023786905221641064,-1.6628258478836344,-3.688759449922239,4.332439933004437,0.00047116307735481784,0.000885739309601899,0.001356907138448854
0.002379749280711015,-1.6628266217775811,-3.6890059353935816,5.969646382350282,0.0004714959911645273,0.000885394505443045,0.0013568605465523755
0.01274855931599935,-1.660598513845425,-3.688762748263867,7.609253244729263,0.0010638998402007424,0.0025013821087532325,0.0035669449906326214
0.0023786801223953566,-1.6628204584414659,-3.6887492144946696,-1.9231913800945282,0.00047126408464404545,0.0008856539810048114,0.0013568863137635322
0.0023786984384059906,-1.662812091997154,-3.688724726336292,-3.560367846621991,0.0004714118815525578,0.0008858456198135955,0.001357155919485414
0.0023797646475334964,-1.6628192761355578,-3.6885093627721246,-5.197557945505327,0.00047148526742291904,0.0008861382755993789,0.0013575344945119365
0.012748380502065023,-1.6605625834765845,-3.6887213686029856,-6.8371596843747415,0.001066052636362367,0.0025057312745014604,0.003571004045240436
7.339420456749697e-5,0.002477973950411458,-0.011827797297888538,-0.017437825552114313,2.1756063797909569e-7,2.1959460583240892e-7,2.4728266130759847e-7
2.458876163776343e-5,0.0024602511256503886,-0.029980980160402654,-0.01761635830485815,4.5640473193811116e-8,6.066074346672603e-8,6.542092334451084e-8
2.7923844754695892e-5,0.0024822008513157457,0.006956350786278891,-0.01778325154653609,5.173308255874666e-8,7.268285129684232e-8,7.776451956369615e-8
1.093728254393985e-5,0.0024759131650412916,0.03484089506535575,-0.017440073952363234,5.854092303664604e-9,5.8540962363172745e-9,1.1700633499134025e-8
5.61482593184337e-5,0.0010389669170805388,0.014879187174531726,-0.015865144821314306,2.154107644057134e-8,2.3701166697513115e-8,4.1239628025699275e-8
2.199939141670863e-5,0.005027094131584924,0.03145469020099838,-0.012928270164882169,9.984380660544296e-9,1.1304888831787382e-8,2.1097288313605534e-8
1.0937281331280246e-5,0.0020629261596251175,-0.05647899698101316,-0.02014992881615114,5.853980187403562e-9,5.853982712822111e-9,1.1700631703601918e-8
5.365612120537359e-7,-0.032524483052282144,0.015909468281035705,-0.05244017608113948,1.104344304964336e-12,8.254381956107663e-11,8.254437938133999e-11
5.365571572231905e-7,0.03747562473426458,0.015909484776980003,-0.05244005591567658,1.104700617926087e-12,8.254497628754588e-11,8.254643022726637e-11
5.365518139418176e-7,0.037475582997538115,0.01590949312785465,0.017559867784981916,1.1044678419048632e-12,8.254506661957649e-11,8.254592154873409e-11
5.365485170235237e-7,-0.032524301321769845,0.015909508118815766,0.01755981345991183,1.1045300272354055e-12,8.254318854253071e-11,8.25441635501609e-11
6.258375625141828e-8,-0.022076546071885174,0.03799581734417989,-0.017437952677000393,1.757390338694708e-13,1.762661809942342e-13,1.763580621027391e-13
6.258411625973774e-8,0.0024756418992102347,0.03799581165369363,-0.041990147213530345,1.7589377016162587e-13,1.7643337164000812e-13,1.7656014133840659e-13
6.259475071601628e-8,0.002062949927528401,-0.05963414045346266,-0.04470414159315073,1.7577468826393893e-13,1.76222016594137e-13,1.7635400880560847e-13
6.259598232342493e-8,-0.02248925310808616,-0.05963411643599157,-0.020151935838640295,1.7580422357188465e-13,1.7647307826891616e-13,1.7659055595146795e-13
6.259650338809782e-8,0.002062981733642529,-0.05963409772528869,0.004400205054866953,1.7582821708549486e-13,1.766034395706148e-13,1.766969297511373e-13
6.259479334858042e-8,0.026615127411515126,-0.05963412821603143,-0.020151911859490633,1.7582858992192242e-13,1.7635893636414105e-13,1.7642929382525625e-13
6.258421573572075e-8,0.0024755678925648798,0.0379958080272675,0.007114201738157926,1.7574324466419858e-13,1.7631808957249974e-13,1.764046832375711e-13
6.258487890894078e-8,0.027027786851980214,0.037995833521923685,-0.017437967461238817,1.757227264408934e-13,1.7622117729627593e-13,1.7629216349718227e-13
1.1611072598801305e-5,0.004258569942428533,-0.046037003380302755,-0.021047136011702283,5.535717283727021e-9,8.750050570464929e-9,1.2538489878355317e-8
6.996996429127951e-5,0.0020629880764581492,-0.03349523901312855,-0.020149960505786595,1.2436888248398518e-8,2.7201137359516888e-8,2.7201964285525293e-8
6.259597284952179e-8,0.03706297202294467,-0.05683408346198087,0.014850229673689309,1.7578550209285473e-13,1.765339579059117e-13,1.7658580433838367e-13
6.259648444029153e-8,-0.03293702128372846,-0.05683407301278262,0.01485022063439668,1.7577934341744642e-13,1.7655282874722027e-13,1.7660531051024964e-13
6.259710024399585e-8,-4.618753555716018e-10,-9.02443101966248e-10,0.002286060866508413,1.7582275333094992e-13,1.7626295613842292e-13,1.7635178190068289e-13
6.259528125459231e-8,0.03706286361303483,-0.05683405869903818,-0.05514975533238577,1.7587688276867359e-13,1.7667396966730646e-13,1.76857372124445e-13
2.343001445600142e-5,0.002475586579404053,-0.010540765690811844,-0.06958185913075703,7.542001682164505e-9,7.546012843176882e-9,1.4953221103824252e-8
7.038809902345141e-7,0.05307144186174721,-0.009246319546976108,-0.055154353687651175,1.700428332626478e-11,3.5125824629160724e-10,3.6739483389340056e-10
1.8402934074401855e-5,0.046251102915981356,-0.10917636804413378,-0.01752415089472103,1.0994694747488021e-8,1.1372020212608554e-8,2.2346397223900578e-8
1.840301896057402e-5,0.05002737920695847,-0.19921684266016507,-0.017552917483485166,1.0994733128416719e-8,1.1369846690410868e-8,2.2344606725981777e-8
1.840289526929458e-5,0.047696451742950285,0.08753775291835975,-0.017395603963666,1.099427235788336e-8,1.1371042468619274e-8,2.2345015703941588e-8
1.840166320713858e-5,0.05239928553127351,0.17757400970250875,-0.01736612953777067,1.0993864420581614e-8,1.1371280487343114e-8,2.2344877995954332e-8
7.231647032313049e-7,-0.04811185536584466,-0.010413350573220077,0.020217673155559023,1.7318259102966242e-11,3.815254016994175e-10,3.9794880193590123e-10
7.038792470363356e-7,0.040048731404410065,0.040005681009996574,-0.017162813320999355,1.69844614200383e-11,3.512538691986451e-10,3.6737763113955236e-10
7.038788680802099e-7,0.03788980850915832,-0.061643837091459146,-0.017756968124305217,1.6978901076988512e-11,3.512515280518132e-10,3.673786723640991e-10
2.3429985352170963e-5,0.0024756161393759257,-0.010540769888458021,0.03470586853084774,7.541973135382295e-9,7.545977172791745e-9,1.4953187749423853e-8
1.9116575761775795e-5,0.003125836697475345,-0.005009948527747063,-0.006286697928904993,8.565258026201137e-9,1.0970667062948483e-8,1.928122850323903e-8
