{
  "tests": [
    {
      "targets": ["core_tests", "sleep_tests", "net_tests"],
      "profiles": ["Debug", "FaultyThreadsASan"]
    },
    {
      "targets": ["echo_tests"],
      "profiles": ["Debug"]
    }
  ],
  "lint_files": ["tinyfibers", "echo"],
  "submit_files": [
    "tinyfibers/runtime",
    "tinyfibers/net",
    "echo"
  ],
  "forbidden_patterns": ["sleep_for"]
}
